<?xml version="1.0" encoding="utf-8"?>
<!-- Generator: Adobe Illustrator 14.0.0, SVG Export Plug-In . SVG Version: 6.00 Build 43363)  -->
<!DOCTYPE svg PUBLIC "-//W3C//DTD SVG 1.1//EN" "http://www.w3.org/Graphics/SVG/1.1/DTD/svg11.dtd">
<svg version="1.1" id="Layer_1" xmlns="http://www.w3.org/2000/svg" xmlns:xlink="http://www.w3.org/1999/xlink" x="0px" y="0px"
	 width="298px" height="38px" viewBox="0 0 298 38" enable-background="new 0 0 298 38" xml:space="preserve">
<g fill="#2E3192">
	<path fill="innerhan" d="M8.485,10.377c-0.577,0.871-2.474,0.712-2.474,0.712v3.606H2.566v2.911h3.445c0,0-0.028,6.437-0.014,7.195
		c0.014,0.76,0.641,2.976,3.182,2.912c0.426,0,2.04,0,2.04,0s1.345,0.081,1.825-0.824c0.438-0.654,0.438-2.771,0.438-2.771
		s-0.192,0.012-0.48,0.017c-0.096,0.444-0.064,0.889-0.58,0.907c-0.438,0.017-2.296,0-2.296,0c-0.523-0.014-0.722-0.455-0.722-0.907
		c0-0.419-0.011-6.537-0.011-6.537l4.15-0.015l0.007-2.851l-4.125-0.007l-0.011-4.348C9.415,10.377,8.752,10.377,8.485,10.377z"/>
	<path fill="innerhan" d="M15.777,9.331v18.072h3.36c0,0,0.019-6.23,0.004-7.37c0.057-1.667,2.118-2.533,3.133-2.42
		c0.754,0.083,0.875,0.543,0.938,1.426c0.003,0.746,0.025,8.365,0.025,8.365h3.417V17.99c-0.174-1.825-0.807-2.686-1.519-3.24
		c-1.239-0.961-3.428-0.418-3.796-0.28c-0.989,0.374-2.173,1.347-2.173,1.347l0.011-6.486H15.777z"/>
	<ellipse fill="innerhan" cx="34.714" cy="11.584" rx="2.008" ry="1.829"/>
	<polygon fill="innerhan" points="29.474,14.534 29.474,17.371 32.862,17.371 32.862,24.642 28.755,24.664 28.755,27.549 
		38.985,27.549 38.985,24.653 36.33,24.653 36.308,14.534 	"/>
	<path fill="innerhan" d="M49.886,21.484c-0.918-1.486-4.588-2.145-4.996-2.293c-1.133-0.414-0.813-1.47-0.215-1.772
		c0.482-0.243,3.173-0.127,4.273-0.071l0.19,0.47l0.406,0.023v-0.46V15.39c0,0-0.32-0.536-1.373-0.765
		c-0.564-0.123-3.005-0.374-4.151,0.041c-1.146,0.415-1.716,0.878-2.32,1.871c-0.764,1.256-0.506,3.349,0.555,4.284
		c1.061,0.936,3.897,1.246,4.812,1.983c0.897,0.725,0.534,1.698-0.47,1.924c-0.996,0.226-3.77,0.104-4.859,0.045l-0.075-0.347
		l-0.434-0.027v0.345v0.229v1.64c0,0,0.167,0.663,0.911,0.847c0.64,0.156,3.303,0.33,4.784,0c1.481-0.333,2.713-0.943,3.11-2.12
		C50.435,24.162,50.466,22.421,49.886,21.484z"/>
</g>
<g fill="#39B54A">
	<polygon fill="innerhan" points="66.054,12.355 64.25,12.355 63.874,7.754 66.429,7.754 	"/>
	<path fill="innerhan" d="M75.45,9.258l-0.019,5.06c0,0-1.404-0.278-3.427,0.009c-2.491,0.466-3.687,2.518-4.072,3.62
		c-0.384,1.101-0.669,4.54,0,6.396c0.956,2.651,2.546,2.941,2.755,2.987c0.489,0.108,1.915,0.279,2.826-0.03
		c0.911-0.31,1.965-1.931,1.965-1.931l0.014,1.938l3.346-0.007V9.258H75.45z M75.351,22.875c0,0-0.711,0.616-1.31,1.001
		s-1.841,0.73-2.507,0.301c-0.779-0.475-1.046-1.426-1.053-2.926c-0.006-1.501,0.015-2.482,1.48-3.636
		c0.997-0.785,3.389-0.431,3.389-0.431V22.875z"/>
	<path fill="innerhan" d="M91.133,21.724c0,0,0.026-1.878-0.043-2.621c-0.124-1.335-0.775-3.733-2.691-4.281
		c-1.471-0.421-3.023-0.577-4.955,0.204c-2.379,0.961-2.969,3.779-2.969,3.779s-0.513,3.19,0.213,5.091s2.35,3.258,3.353,3.508
		c1.004,0.249,3.93,0.271,4.998,0.09s1.708-0.769,1.708-0.769l-0.021-2.376c0,0-2.913,0.521-4.877,0.34
		c-1.645-0.158-3.003-1.879-2.576-2.92L91.133,21.724z M83.159,19.565c0,0,0.076-1.295,0.902-1.892
		c0.55-0.398,3.312-0.563,4.116,0.282c0.274,0.287,0.363,1.61,0.363,1.61H83.159z"/>
	<polygon fill="innerhan" points="101.78,14.566 98.742,23.874 95.647,14.566 92.28,14.566 96.54,27.517 98.518,27.517 
		100.598,27.517 105.328,14.566 	"/>
	<path fill="innerhan" d="M113.879,14.606c-0.741-0.196-2.99-0.362-4.143,0c-3.246,1.041-3.816,3.937-3.919,4.797
		c-0.104,0.859-0.393,2.987,0.513,5.25c0.729,1.824,2.572,2.83,3.406,2.896c1.869,0.147,3.246,0.227,4.143,0
		s1.239-0.769,1.239-0.769v-2.077v-0.05v-0.245h-0.298v0.249c-0.932,0.013-3.812,0.036-4.258-0.124
		c-0.534-0.192-1.937-1.419-2.05-3.275c-0.115-1.854,1.224-3.619,2.078-3.8c0.684-0.145,3.167-0.058,4.134-0.018v0.327h0.394v-0.309
		V17.44v-2.155C115.118,15.285,114.62,14.803,113.879,14.606z"/>
	<path fill="innerhan" d="M122.59,14.405c-3.27,0-5.922,2.971-5.922,6.637c0,3.665,2.652,6.637,5.922,6.637
		c3.271,0,5.923-2.972,5.923-6.637C128.513,17.376,125.862,14.405,122.59,14.405z M122.59,24.602c-1.754,0-3.177-1.594-3.177-3.56
		c0-1.966,1.423-3.56,3.177-3.56c1.755,0,3.177,1.593,3.177,3.56C125.767,23.008,124.346,24.602,122.59,24.602z"/>
	<path fill="innerhan" d="M132.325,27.035c1.239,0.961,3.428,0.418,3.795,0.279c0.989-0.374,2.174-1.348,2.174-1.348l-0.003,1.735
		h3.391v-13.32h-3.36c0,0-0.019,6.23-0.004,7.369c-0.056,1.668-2.118,2.533-3.131,2.421c-0.754-0.084-0.875-0.543-0.94-1.426
		c-0.002-0.746-0.025-8.364-0.025-8.364h-3.417v9.413C130.979,25.62,131.612,26.48,132.325,27.035z"/>
	<path fill="innerhan" d="M144.317,14.647V27.59h3.844c0,0-0.021-6.97,0-7.875c0.021-0.905,1.271-1.991,2.222-2.171
		c0.95-0.181,1.569,0.113,1.366,2.171c0.268,0,3.246,0,3.246,0s0.235-1.775,0-2.85c-0.234-1.075-1.249-1.901-2.007-2.217
		c-0.759-0.317-2.382-0.057-2.819,0.045c-0.438,0.102-2.52,1.493-2.52,1.493l0.01-1.538H144.317z"/>
	<path fill="innerhan" d="M165.933,21.484c-0.919-1.486-4.588-2.145-4.997-2.293c-1.133-0.414-0.813-1.47-0.215-1.772
		c0.482-0.243,3.173-0.127,4.273-0.071l0.19,0.47l0.406,0.023v-0.46V15.39c0,0-0.32-0.536-1.374-0.765
		c-0.563-0.123-3.005-0.374-4.149,0.041c-1.147,0.415-1.716,0.878-2.321,1.871c-0.765,1.256-0.506,3.349,0.555,4.284
		c1.061,0.936,3.898,1.246,4.813,1.983c0.896,0.725,0.534,1.698-0.47,1.924c-0.996,0.226-3.771,0.104-4.859,0.045l-0.075-0.347
		l-0.434-0.027v0.345v0.229v1.64c0,0,0.168,0.663,0.911,0.847c0.642,0.156,3.304,0.33,4.785,0c1.48-0.333,2.712-0.943,3.11-2.12
		S166.512,22.421,165.933,21.484z"/>
	<path fill="innerhan" d="M178.794,21.724c0,0,0.027-1.878-0.042-2.622c-0.124-1.335-0.775-3.733-2.691-4.281
		c-1.471-0.422-3.023-0.577-4.955,0.204c-2.378,0.96-2.968,3.779-2.968,3.779s-0.513,3.19,0.213,5.091
		c0.727,1.9,2.35,3.258,3.354,3.508c1.004,0.249,3.93,0.271,4.997,0.09c1.068-0.181,1.709-0.769,1.709-0.769l-0.021-2.376
		c0,0-2.913,0.521-4.878,0.34c-1.644-0.158-3.003-1.879-2.576-2.92L178.794,21.724z M170.82,19.564c0,0,0.076-1.294,0.902-1.893
		c0.55-0.397,3.312-0.563,4.116,0.283c0.273,0.286,0.363,1.609,0.363,1.609H170.82z"/>
	<path fill="innerhan" d="M189.629,21.484c-0.918-1.486-4.589-2.145-4.997-2.293c-1.132-0.414-0.812-1.47-0.214-1.772
		c0.48-0.243,3.173-0.127,4.271-0.071l0.192,0.47l0.405,0.023v-0.46V15.39c0,0-0.32-0.536-1.373-0.765
		c-0.565-0.123-3.005-0.374-4.151,0.041c-1.146,0.415-1.716,0.878-2.32,1.871c-0.764,1.256-0.506,3.349,0.556,4.284
		c1.06,0.936,3.897,1.246,4.812,1.983c0.897,0.725,0.534,1.698-0.47,1.924c-0.997,0.226-3.771,0.104-4.858,0.045l-0.076-0.347
		l-0.433-0.027v0.345v0.229v1.64c0,0,0.167,0.663,0.91,0.847c0.641,0.156,3.304,0.33,4.784,0c1.48-0.333,2.712-0.943,3.111-2.12
		C190.176,24.162,190.208,22.421,189.629,21.484z"/>
	<polygon fill="innerhan" points="194.938,12.355 193.134,12.355 192.759,7.755 195.313,7.755 	"/>
</g>
<g fill="#27AAE1">
	<path fill="innerhan" d="M221.563,14.277c-3.271,0-5.922,2.971-5.922,6.637c0,3.665,2.65,6.636,5.922,6.636
		c3.271,0,5.923-2.971,5.923-6.636C227.486,17.248,224.834,14.277,221.563,14.277z M221.563,24.473
		c-1.755,0-3.177-1.593-3.177-3.559c0-1.966,1.422-3.56,3.177-3.56c1.754,0,3.177,1.594,3.177,3.56
		C224.74,22.88,223.317,24.473,221.563,24.473z"/>
	<path fill="innerhan" d="M239.062,15.05c-1.238-0.962-3.428-0.419-3.795-0.28c-0.988,0.374-2.174,1.347-2.174,1.347l0.003-1.735
		h-3.391v13.32h3.359c0,0,0.019-6.23,0.004-7.369c0.057-1.667,2.118-2.534,3.132-2.421c0.754,0.083,0.875,0.542,0.939,1.425
		c0.003,0.748,0.025,8.365,0.025,8.365h3.417v-9.414C240.407,16.463,239.774,15.604,239.062,15.05z"/>
	<polygon fill="innerhan" points="244.064,9.447 244.064,12.223 247.425,12.223 247.425,24.653 243.723,24.653 243.766,27.549 
		254.201,27.549 254.201,24.714 250.784,24.714 250.784,9.447 	"/>
	<ellipse fill="innerhan" cx="263.503" cy="11.584" rx="2.007" ry="1.829"/>
	<polygon fill="innerhan" points="258.263,14.534 258.263,17.371 261.652,17.371 261.652,24.642 257.545,24.664 257.545,27.549 
		267.774,27.549 267.774,24.653 265.118,24.653 265.098,14.534 	"/>
	<path fill="innerhan" d="M280.417,14.921c-1.239-0.962-3.428-0.418-3.795-0.28c-0.989,0.373-2.175,1.347-2.175,1.347l0.003-1.734
		h-3.391v13.32h3.36c0,0,0.019-6.23,0.004-7.368c0.056-1.668,2.118-2.534,3.131-2.422c0.754,0.083,0.876,0.543,0.939,1.425
		c0.003,0.747,0.025,8.365,0.025,8.365h3.418V18.16C281.762,16.335,281.13,15.475,280.417,14.921z"/>
	<path fill="innerhan" d="M295.151,21.724c0,0,0.027-1.878-0.042-2.621c-0.125-1.335-0.776-3.733-2.691-4.281
		c-1.471-0.421-3.023-0.577-4.955,0.204c-2.378,0.961-2.969,3.779-2.969,3.779s-0.512,3.19,0.214,5.091
		c0.727,1.9,2.35,3.258,3.354,3.508c1.003,0.249,3.93,0.271,4.997,0.09c1.068-0.181,1.709-0.769,1.709-0.769l-0.021-2.376
		c0,0-2.913,0.521-4.878,0.34c-1.645-0.158-3.003-1.879-2.576-2.92L295.151,21.724z M287.178,19.565c0,0,0.076-1.295,0.902-1.892
		c0.55-0.398,3.312-0.563,4.116,0.282c0.273,0.287,0.363,1.61,0.363,1.61H287.178z"/>
</g>
<g fill="black">
	<circle fill="innerhan" cx="210.941" cy="25.486" r="2.129"/>
	<polygon fill="innerhan" points="62.125,27.86 57.5,27.86 57.5,8.044 62.125,8.044 62.125,3.895 57.5,3.895 53.351,3.895 53.351,8.044 
		53.351,27.86 53.351,32.009 57.5,32.009 62.125,32.009 	"/>
	<polygon fill="innerhan" points="196.975,27.86 201.601,27.86 201.601,8.044 196.975,8.044 196.975,3.895 201.601,3.895 205.75,3.895 205.75,8.044 
		205.75,27.86 205.75,32.009 201.601,32.009 196.975,32.009 	"/>
</g>
</svg>
