{
  "profiles": {
    "Identity.Service.EventHandlers": {
      "commandName": "Project",
      "launchBrowser": true,
      "environmentVariables": {
        "ASPNETCORE_ENVIRONMENT": "Development"
      },
      "applicationUrl": "https://localhost:58329;http://localhost:58333"
    }
  }
}