EESchema Schematic File Version 4
EELAYER 28 0
EELAYER END
$Descr A4 11693 8268
encoding utf-8
Sheet 3 3
Title "Bike Turn Signals"
Date ""
Rev "1"
Comp "demilleTech LLC"
Comment1 "Credit to SparkFun and their Fio v3 for the base microcontroller setup."
Comment2 ""
Comment3 ""
Comment4 ""
$EndDescr
Wire Wire Line
	2000 1700 2250 1700
Wire Wire Line
	2250 1800 2000 1800
Wire Wire Line
	2000 1900 2250 1900
Wire Wire Line
	2250 2000 2000 2000
$Comp
L SparkFun-Resistors:22OHM-0603-1_10W-1% R18
U 1 1 5BCBD4E0
P 2450 1950
F 0 "R18" H 2350 2050 45  0000 C CNN
F 1 "22Ω" H 2500 2050 45  0000 C CNN
F 2 "0603" H 2450 2100 20  0001 C CNN
F 3 "" H 2450 1950 60  0001 C CNN
F 4 "RES-08698" H 2450 2071 60  0001 C CNN "Field4"
	1    2450 1950
	1    0    0    -1  
$EndComp
$Comp
L SparkFun-Resistors:22OHM-0603-1_10W-1% R17
U 1 1 5BCBD5D9
P 2450 1750
F 0 "R17" H 2350 1850 45  0000 C CNN
F 1 "22Ω" H 2500 1850 45  0000 C CNN
F 2 "0603" H 2450 1900 20  0001 C CNN
F 3 "" H 2450 1750 60  0001 C CNN
F 4 "RES-08698" H 2450 1871 60  0001 C CNN "Field4"
	1    2450 1750
	1    0    0    -1  
$EndComp
$Comp
L BikeSignals-rescue:MIC5219-3.3-Regulator_Linear U2
U 1 1 5BCBFDF1
P 4850 5200
F 0 "U2" H 4850 5542 50  0000 C CNN
F 1 "MIC5219-3.3" H 4850 5451 50  0000 C CNN
F 2 "Package_TO_SOT_SMD:SOT-23-5" H 4850 5525 50  0001 C CNN
F 3 "http://ww1.microchip.com/downloads/en/devicedoc/mic5219.pdf" H 4850 5200 50  0001 C CNN
	1    4850 5200
	1    0    0    -1  
$EndComp
$Comp
L SparkFun-Switches:SWITCH-SPDT-SMD-AYZ0202 S3
U 1 1 5BCC1F18
P 4000 5100
F 0 "S3" H 4050 4726 45  0000 C CNN
F 1 "SWITCH-SPDT" H 4050 4810 45  0000 C CNN
F 2 "SWITCH_DPDT_SMD_AYZ0202" H 4000 5350 20  0001 C CNN
F 3 "" H 4000 5100 50  0001 C CNN
F 4 "SWCH-08179" H 4050 4905 60  0001 C CNN "Field4"
	1    4000 5100
	-1   0    0    1   
$EndComp
Wire Wire Line
	7950 6100 8100 6100
Wire Wire Line
	8100 6100 8100 6250
Wire Wire Line
	4550 5100 4450 5100
Wire Wire Line
	4550 5200 4450 5200
Wire Wire Line
	4450 5200 4450 5100
Connection ~ 4450 5100
Wire Wire Line
	4450 5100 4100 5100
$Comp
L SparkFun-IC-Power:MCP73831 U3
U 1 1 5BCC6F7D
P 7650 1300
F 0 "U3" H 7650 1760 45  0000 C CNN
F 1 "MCP73831" H 7650 1676 45  0000 C CNN
F 2 "SOT23-5" H 7650 1600 20  0001 C CNN
F 3 "" H 7650 1300 60  0001 C CNN
F 4 "IC-09995" H 7650 1581 60  0000 C CNN "Field4"
	1    7650 1300
	1    0    0    -1  
$EndComp
$Comp
L SparkFun-Capacitors:4.7UF0603 C8
U 1 1 5BCC8A8F
P 6500 1500
F 0 "C8" H 6608 1645 45  0000 L CNN
F 1 "4.7µF" H 6608 1561 45  0000 L CNN
F 2 "0603" H 6500 1750 20  0001 C CNN
F 3 "" H 6500 1500 50  0001 C CNN
F 4 "CAP-08280" H 6608 1466 60  0001 L CNN "Field4"
	1    6500 1500
	1    0    0    -1  
$EndComp
Wire Wire Line
	6500 1200 6500 1300
Connection ~ 6500 1200
Wire Wire Line
	6500 1200 7250 1200
$Comp
L Connector:USB_C_Receptacle_USB2.0 J5
U 1 1 5BCC68F6
P 1400 1800
F 0 "J5" H 1507 2667 50  0000 C CNN
F 1 "USB_C_Receptacle_USB2.0" H 1507 2576 50  0000 C CNN
F 2 "Connector_USB:USB_C_Receptacle_Amphenol_12401610E4-2A" H 1550 1800 50  0001 C CNN
F 3 "https://www.usb.org/sites/default/files/documents/usb_type-c.zip" H 1550 1800 50  0001 C CNN
	1    1400 1800
	1    0    0    -1  
$EndComp
Text HLabel 2000 1200 2    50   Input ~ 0
USB_VCC
Text HLabel 4200 5100 3    50   Input ~ 0
USB_VCC
Text HLabel 6150 1200 0    50   Input ~ 0
USB_VCC
$Comp
L SparkFun-Resistors:470OHM-0603-1_10W-1% R19
U 1 1 5BCD42FF
P 6250 1950
F 0 "R19" V 6155 2018 45  0000 L CNN
F 1 "470Ω" V 6239 2018 45  0000 L CNN
F 2 "0603" H 6250 2100 20  0001 C CNN
F 3 "" H 6250 1950 60  0001 C CNN
F 4 "RES-07869" V 6334 2018 60  0001 L CNN "Field4"
	1    6250 1950
	0    1    1    0   
$EndComp
Wire Wire Line
	6250 2150 6250 2200
Wire Wire Line
	6250 2200 7250 2200
Text HLabel 7250 2200 2    50   Input ~ 0
CHARGE_STAT
NoConn ~ 2000 2300
NoConn ~ 2000 2400
NoConn ~ 5150 5200
Wire Wire Line
	9650 1200 9650 1650
Wire Wire Line
	9650 1200 9950 1200
Text Label 9950 1200 0    50   ~ 0
VBATT
$Comp
L SparkFun-Capacitors:10UF-POLAR-0603-6.3V-20%_TANT_ C10
U 1 1 5BCE593E
P 9650 1750
F 0 "C10" H 9778 1742 45  0000 L CNN
F 1 "10µF" H 9778 1658 45  0000 L CNN
F 2 "0603-POLAR" H 9650 2000 20  0001 C CNN
F 3 "" H 9650 1750 50  0001 C CNN
F 4 "" H 9650 1750 60  0001 C CNN "Field4"
	1    9650 1750
	1    0    0    -1  
$EndComp
Wire Wire Line
	9650 1200 8050 1200
Connection ~ 9650 1200
Wire Wire Line
	8050 1300 8850 1300
Wire Wire Line
	8850 1300 8850 2350
$Comp
L SparkFun-Resistors:2.0KOHM-0603-1_10W-5% R21
U 1 1 5BCEC929
P 8850 2550
F 0 "R21" V 8755 2618 45  0000 L CNN
F 1 "2.0KΩ" V 8839 2618 45  0000 L CNN
F 2 "0603" H 8850 2700 20  0001 C CNN
F 3 "" H 8850 2550 60  0001 C CNN
F 4 "RES-08296" V 8934 2618 60  0001 L CNN "Field4"
	1    8850 2550
	0    1    1    0   
$EndComp
Wire Wire Line
	5150 5100 5500 5100
Wire Wire Line
	5500 5100 5500 5300
Connection ~ 5500 5100
$Comp
L SparkFun-Capacitors:10UF-POLAR-0603-6.3V-20%_TANT_ C5
U 1 1 5BCF44BC
P 5500 5400
F 0 "C5" H 5628 5392 45  0000 L CNN
F 1 "10µF" H 5628 5308 45  0000 L CNN
F 2 "0603-POLAR" H 5500 5650 20  0001 C CNN
F 3 "" H 5500 5400 50  0001 C CNN
F 4 "" H 5500 5400 60  0001 C CNN "Field4"
	1    5500 5400
	1    0    0    -1  
$EndComp
Wire Wire Line
	5500 5100 5950 5100
Wire Wire Line
	5950 5100 5950 5300
$Comp
L SparkFun-Capacitors:1.0UF-0603-16V-10% C6
U 1 1 5BCFBBF9
P 5950 5500
F 0 "C6" H 6058 5645 45  0000 L CNN
F 1 "1.0µF" H 6058 5561 45  0000 L CNN
F 2 "0603" H 5950 5750 20  0001 C CNN
F 3 "" H 5950 5500 50  0001 C CNN
F 4 "CAP-00868" H 6058 5466 60  0001 L CNN "Field4"
	1    5950 5500
	1    0    0    -1  
$EndComp
Wire Wire Line
	6400 5100 6400 5300
$Comp
L SparkFun-Capacitors:0.1UF-0603-25V-5% C7
U 1 1 5BD0238A
P 6400 5500
F 0 "C7" H 6508 5645 45  0000 L CNN
F 1 "0.1µF" H 6508 5561 45  0000 L CNN
F 2 "0603" H 6400 5750 20  0001 C CNN
F 3 "" H 6400 5500 50  0001 C CNN
F 4 "CAP-08604" H 6508 5466 60  0001 L CNN "Field4"
	1    6400 5500
	1    0    0    -1  
$EndComp
Wire Wire Line
	6500 5100 6500 4550
Wire Wire Line
	6500 4550 6400 4550
Text HLabel 6400 4550 0    50   Input ~ 0
3.3V
Wire Wire Line
	6500 4550 6600 4550
Connection ~ 6500 4550
$Comp
L SparkFun-Resistors:330OHM-0603-1_10W-1% R20
U 1 1 5BD0D8EE
P 6800 4550
F 0 "R20" H 6800 4850 45  0000 C CNN
F 1 "330Ω" H 6800 4766 45  0000 C CNN
F 2 "0603" H 6800 4700 20  0001 C CNN
F 3 "" H 6800 4550 60  0001 C CNN
F 4 "RES-00818" H 6800 4671 60  0001 C CNN "Field4"
	1    6800 4550
	1    0    0    -1  
$EndComp
$Comp
L SparkFun-LED:LED-RED0603 D7
U 1 1 5BD0E9E4
P 7550 4550
F 0 "D7" V 7860 4500 45  0000 C CNN
F 1 "LED-RED0603" V 7776 4500 45  0000 C CNN
F 2 "LED-0603" V 7350 4550 20  0001 C CNN
F 3 "" H 7550 4550 50  0001 C CNN
F 4 "DIO-00819" V 7681 4500 60  0001 C CNN "Field4"
	1    7550 4550
	0    -1   -1   0   
$EndComp
Wire Wire Line
	7000 4550 7450 4550
Text HLabel 4300 5100 3    50   Input ~ 0
PROGRAMMER_VCC
Wire Wire Line
	2250 1700 2250 1750
Wire Wire Line
	2250 1900 2250 1950
Connection ~ 2250 1750
Wire Wire Line
	2250 1750 2250 1800
Connection ~ 2250 1950
Wire Wire Line
	2250 1950 2250 2000
Text HLabel 2650 1750 2    50   Input ~ 0
USB_D-
Text HLabel 2650 1950 2    50   Input ~ 0
USB_D+
Connection ~ 5950 5100
Wire Wire Line
	5950 5100 6400 5100
Connection ~ 6400 5100
Wire Wire Line
	6400 5100 6500 5100
$Comp
L SparkFun-PowerSymbols:GND #GND033
U 1 1 5BCFA076
P 8100 6250
F 0 "#GND033" H 8150 6200 45  0001 L BNN
F 1 "GND" H 8100 6080 45  0000 C CNN
F 2 "" H 8100 6150 60  0001 C CNN
F 3 "" H 8100 6150 60  0001 C CNN
	1    8100 6250
	1    0    0    -1  
$EndComp
$Comp
L SparkFun-PowerSymbols:GND #GND027
U 1 1 5BCFB982
P 5500 5600
F 0 "#GND027" H 5550 5550 45  0001 L BNN
F 1 "GND" H 5500 5430 45  0000 C CNN
F 2 "" H 5500 5500 60  0001 C CNN
F 3 "" H 5500 5500 60  0001 C CNN
	1    5500 5600
	1    0    0    -1  
$EndComp
$Comp
L SparkFun-PowerSymbols:GND #GND028
U 1 1 5BCFB9F2
P 5950 5600
F 0 "#GND028" H 6000 5550 45  0001 L BNN
F 1 "GND" H 5950 5430 45  0000 C CNN
F 2 "" H 5950 5500 60  0001 C CNN
F 3 "" H 5950 5500 60  0001 C CNN
	1    5950 5600
	1    0    0    -1  
$EndComp
$Comp
L SparkFun-PowerSymbols:GND #GND029
U 1 1 5BCFBC02
P 6400 5600
F 0 "#GND029" H 6450 5550 45  0001 L BNN
F 1 "GND" H 6400 5430 45  0000 C CNN
F 2 "" H 6400 5500 60  0001 C CNN
F 3 "" H 6400 5500 60  0001 C CNN
	1    6400 5600
	1    0    0    -1  
$EndComp
$Comp
L SparkFun-PowerSymbols:GND #GND031
U 1 1 5BCFBC7C
P 7750 4550
F 0 "#GND031" H 7800 4500 45  0001 L BNN
F 1 "GND" V 7750 4422 45  0000 R CNN
F 2 "" H 7750 4450 60  0001 C CNN
F 3 "" H 7750 4450 60  0001 C CNN
	1    7750 4550
	0    -1   -1   0   
$EndComp
$Comp
L SparkFun-PowerSymbols:GND #GND035
U 1 1 5BCFBD2A
P 8850 2750
F 0 "#GND035" H 8900 2700 45  0001 L BNN
F 1 "GND" H 8850 2580 45  0000 C CNN
F 2 "" H 8850 2650 60  0001 C CNN
F 3 "" H 8850 2650 60  0001 C CNN
	1    8850 2750
	1    0    0    -1  
$EndComp
$Comp
L SparkFun-PowerSymbols:GND #GND037
U 1 1 5BCFBDA0
P 9650 1950
F 0 "#GND037" H 9700 1900 45  0001 L BNN
F 1 "GND" H 9650 1780 45  0000 C CNN
F 2 "" H 9650 1850 60  0001 C CNN
F 3 "" H 9650 1850 60  0001 C CNN
	1    9650 1950
	1    0    0    -1  
$EndComp
$Comp
L SparkFun-PowerSymbols:GND #GND030
U 1 1 5BCFBE2C
P 6500 1600
F 0 "#GND030" H 6550 1550 45  0001 L BNN
F 1 "GND" H 6500 1430 45  0000 C CNN
F 2 "" H 6500 1500 60  0001 C CNN
F 3 "" H 6500 1500 60  0001 C CNN
	1    6500 1600
	1    0    0    -1  
$EndComp
$Comp
L SparkFun-PowerSymbols:GND #GND025
U 1 1 5BCFBE98
P 2400 1450
F 0 "#GND025" H 2450 1400 45  0001 L BNN
F 1 "GND" V 2400 1322 45  0000 R CNN
F 2 "" H 2400 1350 60  0001 C CNN
F 3 "" H 2400 1350 60  0001 C CNN
	1    2400 1450
	0    -1   -1   0   
$EndComp
$Comp
L SparkFun-PowerSymbols:GND #GND024
U 1 1 5BCFBF2C
P 1400 2700
F 0 "#GND024" H 1450 2650 45  0001 L BNN
F 1 "GND" H 1400 2530 45  0000 C CNN
F 2 "" H 1400 2600 60  0001 C CNN
F 3 "" H 1400 2600 60  0001 C CNN
	1    1400 2700
	1    0    0    -1  
$EndComp
$Comp
L SparkFun-PowerSymbols:GND #GND023
U 1 1 5BCFBFF2
P 1100 2700
F 0 "#GND023" H 1150 2650 45  0001 L BNN
F 1 "GND" H 1100 2530 45  0000 C CNN
F 2 "" H 1100 2600 60  0001 C CNN
F 3 "" H 1100 2600 60  0001 C CNN
	1    1100 2700
	1    0    0    -1  
$EndComp
$Comp
L SparkFun-PowerSymbols:GND #GND026
U 1 1 5BCFC0AA
P 4850 5500
F 0 "#GND026" H 4900 5450 45  0001 L BNN
F 1 "GND" H 4850 5330 45  0000 C CNN
F 2 "" H 4850 5400 60  0001 C CNN
F 3 "" H 4850 5400 60  0001 C CNN
	1    4850 5500
	1    0    0    -1  
$EndComp
$Comp
L SparkFun-PowerSymbols:GND #GND032
U 1 1 5BD00BE7
P 8050 1400
F 0 "#GND032" H 8100 1350 45  0001 L BNN
F 1 "GND" V 8050 1272 45  0000 R CNN
F 2 "" H 8050 1300 60  0001 C CNN
F 3 "" H 8050 1300 60  0001 C CNN
	1    8050 1400
	0    -1   -1   0   
$EndComp
$Comp
L SparkFun-Resistors:5.6KOHM-0603-1_10W-1% R16
U 1 1 5BE39A11
P 2200 1450
F 0 "R16" H 2100 1550 45  0000 C CNN
F 1 "5.6KΩ" H 2300 1550 45  0000 C CNN
F 2 "0603" H 2200 1600 20  0001 C CNN
F 3 "" H 2200 1450 60  0001 C CNN
F 4 "RES-12378" H 2200 1571 60  0001 C CNN "Field4"
	1    2200 1450
	1    0    0    -1  
$EndComp
Wire Wire Line
	2000 1400 2000 1450
Wire Wire Line
	2000 1500 2000 1450
Connection ~ 2000 1450
$Comp
L SparkFun-IC-Power:BQ27441-G1 U4
U 1 1 5BE56037
P 9800 5650
F 0 "U4" H 9800 6310 45  0000 C CNN
F 1 "BQ27441-G1" H 9800 6226 45  0000 C CNN
F 2 "PDSO-N12" H 9800 6150 20  0001 C CNN
F 3 "" H 9800 5650 60  0001 C CNN
F 4 "IC-13220" H 9800 6131 60  0000 C CNN "Field4"
	1    9800 5650
	1    0    0    -1  
$EndComp
$Comp
L SparkFun-Capacitors:470NF-0402-16V-10% C11
U 1 1 5BE66ED5
P 10350 5150
F 0 "C11" H 10458 5242 45  0000 L CNN
F 1 "470nF" H 10458 5158 45  0000 L CNN
F 2 "0402" H 10350 5400 20  0001 C CNN
F 3 "" H 10350 5150 50  0001 C CNN
F 4 "CAP-09041" H 10458 5116 60  0001 L CNN "Field4"
	1    10350 5150
	1    0    0    -1  
$EndComp
Wire Wire Line
	10250 5350 10350 5350
Wire Wire Line
	10350 5350 10350 5250
$Comp
L SparkFun-PowerSymbols:GND #GND038
U 1 1 5BE6BC8A
P 10350 4950
F 0 "#GND038" H 10400 4900 45  0001 L BNN
F 1 "GND" H 10350 4780 45  0000 C CNN
F 2 "" H 10350 4850 60  0001 C CNN
F 3 "" H 10350 4850 60  0001 C CNN
	1    10350 4950
	-1   0    0    1   
$EndComp
$Comp
L SparkFun-PowerSymbols:GND #GND036
U 1 1 5BE6DD56
P 9350 5900
F 0 "#GND036" H 9400 5850 45  0001 L BNN
F 1 "GND" V 9350 5773 45  0000 R CNN
F 2 "" H 9350 5800 60  0001 C CNN
F 3 "" H 9350 5800 60  0001 C CNN
	1    9350 5900
	0    1    1    0   
$EndComp
Wire Wire Line
	10250 5550 10750 5550
Wire Wire Line
	10250 5650 10850 5650
Wire Wire Line
	10250 5850 10950 5850
$Comp
L SparkFun-Resistors:4.7KOHM-0603-1_10W-1% R23
U 1 1 5BEACCC4
P 10750 4300
F 0 "R23" H 10650 4350 45  0000 R CNN
F 1 "4.7KΩ" H 11050 4350 45  0000 R CNN
F 2 "0603" H 10750 4450 20  0001 C CNN
F 3 "" H 10750 4300 60  0001 C CNN
F 4 "RES-07857" V 10666 4232 60  0001 R CNN "Field4"
	1    10750 4300
	0    -1   -1   0   
$EndComp
Wire Wire Line
	10250 5950 11050 5950
$Comp
L SparkFun-Resistors:1MOHM-0603-1_4W-5% R26
U 1 1 5BEB7059
P 11050 4300
F 0 "R26" H 11150 4250 45  0000 L CNN
F 1 "1.8MΩ" H 10750 4250 45  0000 L CNN
F 2 "0603" H 11050 4450 20  0001 C CNN
F 3 "" H 11050 4300 60  0001 C CNN
F 4 "RES-07868" V 11134 4368 60  0001 L CNN "Field4"
	1    11050 4300
	0    1    1    0   
$EndComp
Wire Wire Line
	11050 4500 11050 5950
$Comp
L SparkFun-Resistors:4.7KOHM-0603-1_10W-1% R24
U 1 1 5BED883D
P 10850 4300
F 0 "R24" H 10750 4350 45  0000 R CNN
F 1 "4.7KΩ" H 11150 4350 45  0000 R CNN
F 2 "0603" H 10850 4450 20  0001 C CNN
F 3 "" H 10850 4300 60  0001 C CNN
F 4 "RES-07857" V 10766 4232 60  0001 R CNN "Field4"
	1    10850 4300
	0    -1   -1   0   
$EndComp
$Comp
L SparkFun-Resistors:4.7KOHM-0603-1_10W-1% R25
U 1 1 5BEDC40D
P 10950 4300
F 0 "R25" H 10850 4350 45  0000 R CNN
F 1 "4.7KΩ" H 11250 4350 45  0000 R CNN
F 2 "0603" H 10950 4450 20  0001 C CNN
F 3 "" H 10950 4300 60  0001 C CNN
F 4 "RES-07857" V 10866 4232 60  0001 R CNN "Field4"
	1    10950 4300
	0    -1   -1   0   
$EndComp
Wire Wire Line
	10750 4100 10750 3850
Wire Wire Line
	11050 3850 11050 4100
Wire Wire Line
	10850 4100 10850 3850
Wire Wire Line
	10950 4100 10950 3850
$Comp
L SparkFun-PowerSymbols:3.3V #SUPPLY012
U 1 1 5BF04A61
P 10000 3850
F 0 "#SUPPLY012" H 10050 3850 45  0001 L BNN
F 1 "3.3V" V 10000 3978 45  0000 L CNN
F 2 "XXX-00000" V 9958 3977 60  0001 L CNN
F 3 "" H 10000 3850 60  0001 C CNN
	1    10000 3850
	0    -1   -1   0   
$EndComp
Connection ~ 10950 3850
Wire Wire Line
	10950 3850 11050 3850
Wire Wire Line
	10950 4500 10950 5850
Connection ~ 10850 3850
Wire Wire Line
	10850 3850 10950 3850
Wire Wire Line
	10000 3850 10750 3850
Wire Wire Line
	10850 4500 10850 5650
Connection ~ 10750 3850
Wire Wire Line
	10750 3850 10850 3850
Wire Wire Line
	10750 4500 10750 5550
$Comp
L SparkFun-Resistors:RESISTOR0603 R22
U 1 1 5BF3FFBB
P 9000 5450
F 0 "R22" H 8900 5350 45  0000 C CNN
F 1 "0.01Ω" H 9100 5350 45  0000 C CNN
F 2 "0603" H 9000 5600 20  0001 C CNN
F 3 "" H 9000 5450 60  0001 C CNN
F 4 " " H 9000 5571 60  0000 C CNN "Field4"
	1    9000 5450
	1    0    0    -1  
$EndComp
Wire Wire Line
	9200 5450 9350 5450
Wire Wire Line
	8800 5450 8800 5350
Wire Wire Line
	8800 5350 9200 5350
Wire Wire Line
	9350 5650 9350 5450
Connection ~ 9350 5450
Wire Wire Line
	9350 5950 9350 5900
Wire Wire Line
	9350 5850 9350 5900
Connection ~ 9350 5900
Wire Wire Line
	9350 5650 8750 5650
Connection ~ 9350 5650
$Comp
L SparkFun-Capacitors:1.0UF-0603-16V-10% C9
U 1 1 5BF65EF4
P 8750 5850
F 0 "C9" H 8858 5942 45  0000 L CNN
F 1 "1.0µF" H 8858 5858 45  0000 L CNN
F 2 "0603" H 8750 6100 20  0001 C CNN
F 3 "" H 8750 5850 50  0001 C CNN
F 4 "CAP-00868" H 8858 5816 60  0001 L CNN "Field4"
	1    8750 5850
	1    0    0    -1  
$EndComp
Connection ~ 8750 5650
$Comp
L SparkFun-PowerSymbols:GND #GND039
U 1 1 5BF7179A
P 12000 20550
F 0 "#GND039" H 12050 20500 45  0001 L BNN
F 1 "GND" V 12000 20423 45  0000 R CNN
F 2 "" H 12000 20450 60  0001 C CNN
F 3 "" H 12000 20450 60  0001 C CNN
	1    12000 20550
	1    0    0    -1  
$EndComp
$Comp
L SparkFun-PowerSymbols:GND #GND034
U 1 1 5BF77A68
P 8750 6000
F 0 "#GND034" H 8800 5950 45  0001 L BNN
F 1 "GND" H 8750 5830 45  0000 C CNN
F 2 "" H 8750 5900 60  0001 C CNN
F 3 "" H 8750 5900 60  0001 C CNN
	1    8750 6000
	1    0    0    -1  
$EndComp
Wire Wire Line
	8750 5950 8750 6000
Wire Wire Line
	7950 5900 8350 5900
Wire Wire Line
	8350 5650 8750 5650
$Comp
L SparkFun-Connectors:CONN_03JST-SMD J6
U 1 1 5BF932E0
P 7850 6100
F 0 "J6" H 7808 6610 45  0000 C CNN
F 1 "CONN_03JST-SMD" H 7808 6526 45  0000 C CNN
F 2 "JST-3-SMD" H 7850 6500 20  0001 C CNN
F 3 "" H 7850 6100 50  0001 C CNN
F 4 "CONN-12591" H 7808 6431 60  0000 C CNN "Field4"
	1    7850 6100
	1    0    0    -1  
$EndComp
Text Label 8100 6000 2    50   ~ 0
BIN
Wire Wire Line
	8100 6000 7950 6000
Text Label 11050 5950 2    50   ~ 0
BIN
$Comp
L SparkFun-PowerSymbols:V_BATT #SUPPLY011
U 1 1 5BFA1DB0
P 9200 5300
F 0 "#SUPPLY011" H 9250 5300 45  0001 L BNN
F 1 "V_BATT" H 9200 5470 45  0000 C CNN
F 2 "XXX-00000" H 9200 5481 60  0001 C CNN
F 3 "" H 9200 5300 60  0001 C CNN
	1    9200 5300
	1    0    0    -1  
$EndComp
Wire Wire Line
	9200 5300 9200 5350
Connection ~ 9200 5350
Wire Wire Line
	9200 5350 9350 5350
$Comp
L SparkFun-PowerSymbols:V_BATT #SUPPLY010
U 1 1 5BFAC130
P 3800 5200
F 0 "#SUPPLY010" H 3850 5200 45  0001 L BNN
F 1 "V_BATT" V 3800 5327 45  0000 L CNN
F 2 "XXX-00000" V 3758 5327 60  0001 L CNN
F 3 "" H 3800 5200 60  0001 C CNN
	1    3800 5200
	0    -1   -1   0   
$EndComp
NoConn ~ 3800 5000
Text HLabel 10700 5550 1    50   Input ~ 0
SDA
Text HLabel 10800 5650 1    50   Input ~ 0
SCL
Text HLabel 10900 5850 1    50   Input ~ 0
GPOUT
Wire Wire Line
	6150 1200 6250 1200
Wire Wire Line
	7250 1400 7250 2200
Wire Wire Line
	6250 1750 6250 1200
Connection ~ 6250 1200
Wire Wire Line
	6250 1200 6500 1200
Wire Wire Line
	8350 5900 8350 5650
$EndSCHEMATC
