EESchema Schematic File Version 4
EELAYER 28 0
EELAYER END
$Descr A4 11693 8268
encoding utf-8
Sheet 2 3
Title "Bike Turn Signals"
Date ""
Rev "1"
Comp "demilleTech LLC"
Comment1 "Credit to SparkFun and their Fio v3 for the base microcontroller setup."
Comment2 ""
Comment3 ""
Comment4 ""
$EndDescr
Wire Wire Line
	4650 5800 3600 5800
Wire Wire Line
	3600 5600 4650 5600
$Comp
L SparkFun-Capacitors:22PF-0603-50V-5% C1
U 1 1 5BDEB958
P 3400 5600
F 0 "C1" V 3250 5550 45  0000 C CNN
F 1 "22pF" V 3250 5700 45  0000 C CNN
F 2 "0603" H 3400 5850 20  0001 C CNN
F 3 "" H 3400 5600 50  0001 C CNN
F 4 "CAP-07876" V 3239 5650 60  0001 C CNN "Field4"
	1    3400 5600
	0    1    1    0   
$EndComp
$Comp
L SparkFun-Capacitors:22PF-0603-50V-5% C2
U 1 1 5BDEB95F
P 3400 5800
F 0 "C2" V 3550 5750 45  0000 C CNN
F 1 "22pF" V 3550 5900 45  0000 C CNN
F 2 "0603" H 3400 6050 20  0001 C CNN
F 3 "" H 3400 5800 50  0001 C CNN
F 4 "CAP-07876" V 3239 5850 60  0001 C CNN "Field4"
	1    3400 5800
	0    1    1    0   
$EndComp
$Comp
L SparkFun-Connectors:AVR_SPI_PROG_3X22X3_LOCK J4
U 1 1 5BDEB966
P 8200 3850
F 0 "J4" H 8200 4260 45  0000 C CNN
F 1 "AVR_SPI_PROG_3X22X3_LOCK" H 8200 4176 45  0000 C CNN
F 2 "2X3_LOCK" H 8200 4150 20  0001 C CNN
F 3 "" H 8200 3850 50  0001 C CNN
F 4 "XXX-00000" H 8200 4081 60  0001 C CNN "Field4"
	1    8200 3850
	1    0    0    -1  
$EndComp
$Comp
L SparkFun-Clocks:CRYSTAL-8MHZSMD-5X3.2 Y1
U 1 1 5BDEB96D
P 3600 5700
F 0 "Y1" V 3600 5800 45  0000 L CNN
F 1 "8MHz" V 3600 5900 45  0000 L CNN
F 2 "CRYSTAL-SMD-5X3.2-4PAD" H 3600 5900 20  0001 C CNN
F 3 "" H 3600 5700 50  0001 C CNN
F 4 "XTAL-09431" V 3684 5798 60  0001 L CNN "Field4"
	1    3600 5700
	0    1    1    0   
$EndComp
Wire Wire Line
	4650 4200 4550 4200
Wire Wire Line
	4550 4200 4550 4100
Wire Wire Line
	4550 4100 4650 4100
Wire Wire Line
	4550 4100 4550 4050
Wire Wire Line
	4550 4000 4650 4000
Connection ~ 4550 4100
Wire Wire Line
	4550 4000 4550 3900
Wire Wire Line
	4550 3900 4650 3900
Connection ~ 4550 4000
Wire Wire Line
	4550 4050 4200 4050
Connection ~ 4550 4050
Wire Wire Line
	4550 4050 4550 4000
$Comp
L SparkFun-PowerSymbols:3.3V #SUPPLY07
U 1 1 5BDEB97F
P 4200 4050
F 0 "#SUPPLY07" H 4200 4050 45  0001 L BNN
F 1 "3.3V" V 4200 4179 45  0000 L CNN
F 2 "" V 4158 4178 60  0001 L CNN
F 3 "" H 4200 4050 50  0001 C CNN
	1    4200 4050
	0    -1   -1   0   
$EndComp
Wire Wire Line
	4550 6300 4650 6300
Wire Wire Line
	4650 6000 4550 6000
Connection ~ 4550 6300
Wire Wire Line
	4650 6400 4550 6400
Connection ~ 4550 6400
Wire Wire Line
	4550 6400 4550 6300
Wire Wire Line
	4650 6500 4550 6500
Connection ~ 4550 6500
Wire Wire Line
	4550 6500 4550 6400
Wire Wire Line
	4650 6600 4550 6600
Connection ~ 4550 6600
Wire Wire Line
	4550 6600 4550 6500
Wire Wire Line
	4650 4800 4550 4800
Wire Wire Line
	4550 4700 4650 4700
Wire Wire Line
	4650 3800 3350 3800
$Comp
L SparkFun-Resistors:10KOHM-0603-1_10W-1% R7
U 1 1 5BDEB995
P 3350 3400
F 0 "R7" V 3255 3468 45  0000 L CNN
F 1 "10KΩ" V 3339 3468 45  0000 L CNN
F 2 "0603" H 3350 3550 20  0001 C CNN
F 3 "" H 3350 3400 60  0001 C CNN
F 4 "RES-00824" V 3434 3468 60  0001 L CNN "Field4"
	1    3350 3400
	0    1    1    0   
$EndComp
Wire Wire Line
	3350 3600 3350 3800
$Comp
L SparkFun-PowerSymbols:3.3V #SUPPLY06
U 1 1 5BDEB99C
P 3350 3200
F 0 "#SUPPLY06" H 3350 3200 45  0001 L BNN
F 1 "3.3V" H 3350 3371 45  0000 C CNN
F 2 "" H 3350 3382 60  0001 C CNN
F 3 "" H 3350 3200 50  0001 C CNN
	1    3350 3200
	1    0    0    -1  
$EndComp
$Comp
L SparkFun-Resistors:330OHM-0603-1_10W-1% R14
U 1 1 5BDEB9A3
P 9850 5400
F 0 "R14" H 9950 5300 45  0000 C CNN
F 1 "330Ω" H 9750 5300 45  0000 C CNN
F 2 "0603" H 9850 5550 20  0001 C CNN
F 3 "" H 9850 5400 60  0001 C CNN
F 4 "RES-00818" H 9850 5279 60  0001 C CNN "Field4"
	1    9850 5400
	-1   0    0    1   
$EndComp
$Comp
L SparkFun-Resistors:330OHM-0603-1_10W-1% R15
U 1 1 5BDEB9AA
P 9850 5800
F 0 "R15" H 9750 5700 45  0000 C CNN
F 1 "330Ω" H 9950 5700 45  0000 C CNN
F 2 "0603" H 9850 5950 20  0001 C CNN
F 3 "" H 9850 5800 60  0001 C CNN
F 4 "RES-00818" H 9850 5921 60  0001 C CNN "Field4"
	1    9850 5800
	1    0    0    -1  
$EndComp
$Comp
L SparkFun-LED:LED-BLUE0603 D5
U 1 1 5BDEB9B1
P 10600 5400
F 0 "D5" V 10700 5550 45  0000 C CNN
F 1 "LED-BLUE0603" V 10700 5200 45  0000 C CNN
F 2 "LED-0603" V 10900 5400 20  0001 C CNN
F 3 "" H 10600 5400 50  0001 C CNN
F 4 "DIO-08575" V 10731 5350 60  0001 C CNN "Field4"
	1    10600 5400
	0    -1   -1   0   
$EndComp
$Comp
L SparkFun-LED:LED-YELLOW0603 D6
U 1 1 5BDEB9B8
P 10600 5800
F 0 "D6" V 10400 5950 45  0000 C CNN
F 1 "LED-YELLOW0603" V 10400 5550 45  0000 C CNN
F 2 "LED-0603" V 10400 5800 20  0001 C CNN
F 3 "" H 10600 5800 50  0001 C CNN
F 4 "DIO-09003" V 10731 5750 60  0001 C CNN "Field4"
	1    10600 5800
	0    -1   -1   0   
$EndComp
Wire Wire Line
	4550 4700 4550 4750
$Comp
L SparkFun-PowerSymbols:V_USB #SUPPLY08
U 1 1 5BDEB9BF
P 4550 4750
F 0 "#SUPPLY08" H 4550 4750 45  0001 L BNN
F 1 "V_USB" V 4550 4900 45  0000 L CNN
F 2 "XXX-00000" V 4508 4879 60  0001 L CNN
F 3 "" H 4550 4750 50  0001 C CNN
	1    4550 4750
	0    -1   -1   0   
$EndComp
Connection ~ 4550 4750
Wire Wire Line
	4550 4750 4550 4800
Wire Wire Line
	1400 6200 1900 6200
Wire Wire Line
	1900 6200 1900 5950
$Comp
L SparkFun-PowerSymbols:V_USB #SUPPLY04
U 1 1 5BDEB9D2
P 1900 5950
F 0 "#SUPPLY04" H 1900 5950 45  0001 L BNN
F 1 "V_USB" H 1900 6121 45  0000 C CNN
F 2 "XXX-00000" H 1900 6132 60  0001 C CNN
F 3 "" H 1900 5950 50  0001 C CNN
	1    1900 5950
	1    0    0    -1  
$EndComp
Wire Wire Line
	1400 6350 1900 6350
Text Label 1900 6350 2    50   ~ 0
CHARGE_STAT
Wire Wire Line
	1400 6500 2200 6500
$Comp
L SparkFun-PowerSymbols:3.3V #SUPPLY05
U 1 1 5BDEB9DB
P 2200 6500
F 0 "#SUPPLY05" H 2200 6500 45  0001 L BNN
F 1 "3.3V" V 2200 6628 45  0000 L CNN
F 2 "XXX-00000" V 2242 6629 60  0001 L CNN
F 3 "" H 2200 6500 50  0001 C CNN
	1    2200 6500
	0    1    1    0   
$EndComp
Wire Wire Line
	1400 6650 2200 6650
Wire Wire Line
	2200 6650 2200 7050
Text Label 2200 7050 1    50   ~ 0
SPI_VCC
Wire Wire Line
	8500 3750 9400 3750
Text Label 9400 3750 2    50   ~ 0
SPI_VCC
$Comp
L SparkFun-DiscreteSemi:MOSFET-NCH-AO3404A Q2
U 1 1 5BDEB9E7
P 5450 1350
F 0 "Q2" V 5741 1350 45  0000 C CNN
F 1 "MOSFET-NCH-AO3404A" V 5657 1350 45  0000 C CNN
F 2 "SOT23-3" H 5450 1600 20  0001 C CNN
F 3 "" H 5450 1350 50  0001 C CNN
F 4 "TRANS-12988" V 5668 1350 60  0001 C CNN "Field4"
	1    5450 1350
	0    -1   -1   0   
$EndComp
Text Label 9400 5400 0    50   ~ 0
RXLED
Wire Wire Line
	9400 5400 9650 5400
Wire Wire Line
	9650 5800 9400 5800
Text Label 9400 5800 0    50   ~ 0
TXLED
$Comp
L SparkFun-IC-Microcontroller:ATMEGA32U4 U1
U 1 1 5BDEB9F6
P 5350 5250
F 0 "U1" H 5820 7060 45  0000 C CNN
F 1 "ATMEGA32U4" H 5820 6976 45  0000 C CNN
F 2 "Package_DFN_QFN:QFN-44-1EP_7x7mm_P0.5mm_EP5.2x5.2mm" H 5350 6900 20  0001 C CNN
F 3 "" H 5350 5250 50  0001 C CNN
F 4 "IC-10828" H 5820 6881 60  0000 C CNN "Field4"
	1    5350 5250
	1    0    0    -1  
$EndComp
Wire Wire Line
	6050 6100 6500 6100
Text Label 6500 6100 2    50   ~ 0
RXLED
Wire Wire Line
	6050 6600 6500 6600
Text Label 6500 6600 2    50   ~ 0
TXLED
Connection ~ 3600 5600
Connection ~ 3600 5800
Wire Wire Line
	1400 6800 2000 6800
Wire Wire Line
	1400 6950 2000 6950
Text Label 2000 6800 2    50   ~ 0
USB_D-
Text Label 2000 6950 2    50   ~ 0
USB_D+
Text Label 4350 5100 0    50   ~ 0
USB_D+
Wire Wire Line
	4350 5100 4650 5100
Text Label 4350 5200 0    50   ~ 0
USB_D-
Wire Wire Line
	4350 5200 4650 5200
Wire Wire Line
	6050 6200 6500 6200
Wire Wire Line
	6050 6300 6500 6300
Wire Wire Line
	6050 6400 6500 6400
Text Label 6500 6200 2    50   ~ 0
SCK
Text Label 6500 6300 2    50   ~ 0
MOSI
Text Label 6500 6400 2    50   ~ 0
MISO
Text Label 4200 3800 0    50   ~ 0
RST
Text Label 7700 3750 0    50   ~ 0
MISO
Text Label 7700 3850 0    50   ~ 0
SCK
Text Label 7700 3950 0    50   ~ 0
RST
Text Label 8700 3850 2    50   ~ 0
MOSI
Wire Wire Line
	8700 3850 8500 3850
Wire Wire Line
	7900 3950 7700 3950
Wire Wire Line
	7700 3850 7900 3850
Wire Wire Line
	7700 3750 7900 3750
Wire Wire Line
	10050 5800 10500 5800
Wire Wire Line
	10050 5400 10500 5400
$Comp
L SparkFun-Aesthetics:OSHW-LOGOL LOGO1
U 1 1 5BDEBA1C
P 10750 6800
F 0 "LOGO1" H 10750 7050 45  0001 C CNN
F 1 "OSHW-LOGOL" H 10750 6400 45  0001 C CNN
F 2 "OSHW-LOGO-L" H 10750 7100 20  0001 C CNN
F 3 "" H 10750 6800 50  0001 C CNN
F 4 "XXX-00000" H 11228 6735 60  0001 L CNN "Field4"
	1    10750 6800
	1    0    0    -1  
$EndComp
$Comp
L SparkFun-Capacitors:0.1UF-0603-25V-5% C4
U 1 1 5BDEBA23
P 4450 4300
F 0 "C4" V 4600 4250 45  0000 C CNN
F 1 "0.1µF" V 4600 4450 45  0000 C CNN
F 2 "0603" H 4450 4550 20  0001 C CNN
F 3 "" H 4450 4300 50  0001 C CNN
F 4 "CAP-08604" V 4289 4350 60  0001 C CNN "Field4"
	1    4450 4300
	0    1    1    0   
$EndComp
$Comp
L SparkFun-Switches:MOMENTARY-SWITCH-SPST-SMD-4.5MM S1
U 1 1 5BDEBA2A
P 3350 4000
F 0 "S1" H 3350 4250 45  0000 R CNN
F 1 "MOMENTARY-SPST" H 3550 4150 45  0000 R CNN
F 2 "TACTILE_SWITCH_SMD_4.5MM" H 3350 4200 20  0001 C CNN
F 3 "" H 3350 4000 50  0001 C CNN
F 4 "SWCH-09213" V 3266 3956 60  0001 R CNN "Field4"
	1    3350 4000
	0    -1   -1   0   
$EndComp
Connection ~ 3350 3800
Wire Wire Line
	4650 4900 3750 4900
$Comp
L SparkFun-Capacitors:1.0UF-0603-16V-10% C3
U 1 1 5BDEBA33
P 3550 4900
F 0 "C3" V 3400 4850 45  0000 C CNN
F 1 "1µF" V 3400 5050 45  0000 C CNN
F 2 "0603" H 3550 5150 20  0001 C CNN
F 3 "" H 3550 4900 50  0001 C CNN
F 4 "CAP-00868" V 3389 4950 60  0001 C CNN "Field4"
	1    3550 4900
	0    1    1    0   
$EndComp
$Comp
L SparkFun-DiscreteSemi:MOSFET-NCH-AO3404A Q3
U 1 1 5BDEBA3A
P 6500 1350
F 0 "Q3" V 6791 1350 45  0000 C CNN
F 1 "MOSFET-NCH-AO3404A" V 6707 1350 45  0000 C CNN
F 2 "SOT23-3" H 6500 1600 20  0001 C CNN
F 3 "" H 6500 1350 50  0001 C CNN
F 4 "TRANS-12988" V 6718 1350 60  0001 C CNN "Field4"
	1    6500 1350
	0    -1   -1   0   
$EndComp
$Comp
L SparkFun-DiscreteSemi:MOSFET-NCH-AO3404A Q4
U 1 1 5BDEBA41
P 7500 1350
F 0 "Q4" V 7791 1350 45  0000 C CNN
F 1 "MOSFET-NCH-AO3404A" V 7707 1350 45  0000 C CNN
F 2 "SOT23-3" H 7500 1600 20  0001 C CNN
F 3 "" H 7500 1350 50  0001 C CNN
F 4 "TRANS-12988" V 7718 1350 60  0001 C CNN "Field4"
	1    7500 1350
	0    -1   -1   0   
$EndComp
$Comp
L SparkFun-DiscreteSemi:MOSFET-NCH-AO3404A Q1
U 1 1 5BDEBA48
P 4450 1350
F 0 "Q1" V 4741 1350 45  0000 C CNN
F 1 "MOSFET-NCH-AO3404A" V 4657 1350 45  0000 C CNN
F 2 "SOT23-3" H 4450 1600 20  0001 C CNN
F 3 "" H 4450 1350 50  0001 C CNN
F 4 "TRANS-12988" V 4668 1350 60  0001 C CNN "Field4"
	1    4450 1350
	0    -1   -1   0   
$EndComp
$Comp
L SparkFun-PowerSymbols:3.3V #SUPPLY03
U 1 1 5BDEBA4E
P 1050 4600
F 0 "#SUPPLY03" H 1050 4600 45  0001 L BNN
F 1 "3.3V" V 1050 4728 45  0000 L CNN
F 2 "XXX-00000" V 1008 4729 60  0001 L CNN
F 3 "" H 1050 4600 50  0001 C CNN
	1    1050 4600
	0    1    1    0   
$EndComp
$Comp
L SparkFun-Connectors:CONN_07 J3
U 1 1 5BDEBA55
P 950 5200
F 0 "J3" H 908 6004 45  0000 C CNN
F 1 "CONN_07" H 908 5920 45  0000 C CNN
F 2 "1X07" H 950 6000 20  0001 C CNN
F 3 "" H 950 5200 50  0001 C CNN
F 4 "XXX-00000" H 908 5931 60  0001 C CNN "Field4"
	1    950  5200
	1    0    0    -1  
$EndComp
Text Label 1500 5200 2    50   ~ 0
FL_HIGH
Text Label 1500 5100 2    50   ~ 0
FL_LOW
Text Label 1500 5000 2    50   ~ 0
TURN_L
Text Label 1500 4900 2    50   ~ 0
TURN_R
Text Label 1500 4700 2    50   ~ 0
BRAKE
Text Label 1500 4800 2    50   ~ 0
TURN_BOTH
Wire Wire Line
	1050 4700 1500 4700
Wire Wire Line
	1050 4800 1500 4800
Wire Wire Line
	1050 4900 1500 4900
Wire Wire Line
	1050 5000 1500 5000
Wire Wire Line
	1050 5100 1500 5100
Wire Wire Line
	1050 5200 1500 5200
Wire Wire Line
	5250 1250 5000 1250
Wire Wire Line
	5000 1250 5000 550 
Text Label 5000 550  3    50   ~ 0
BRAKE_LED
Wire Wire Line
	6300 1250 6050 1250
Wire Wire Line
	6050 1250 6050 550 
Text Label 6050 550  3    50   ~ 0
LEFT_LED
Wire Wire Line
	7300 1250 7050 1250
Wire Wire Line
	7050 1250 7050 550 
Text Label 7050 550  3    50   ~ 0
RIGHT_LED
Wire Wire Line
	4250 1250 4000 1250
Wire Wire Line
	4000 1250 4000 550 
Text Label 4000 550  3    50   ~ 0
FRONT_LED
Text Label 4550 1750 1    50   ~ 0
F_CTL
Wire Wire Line
	4550 1550 4550 1750
Wire Wire Line
	5550 1550 5550 1750
Wire Wire Line
	6600 1550 6600 1750
Wire Wire Line
	7600 1550 7600 1750
Text Label 7600 1750 1    50   ~ 0
R_CTL
Text Label 6600 1750 1    50   ~ 0
L_CTL
Text Label 5550 1750 1    50   ~ 0
B_CTL
$Comp
L SparkFun-Connectors:CONN_02 J2
U 1 1 5BDEBA7C
P 950 4300
F 0 "J2" H 908 4604 45  0000 C CNN
F 1 "CONN_02" H 908 4520 45  0000 C CNN
F 2 "1X02" H 950 4550 20  0001 C CNN
F 3 "" H 950 4300 50  0001 C CNN
F 4 "XXX-00000" H 908 4531 60  0001 C CNN "Field4"
	1    950  4300
	1    0    0    -1  
$EndComp
$Comp
L SparkFun-PowerSymbols:3.3V #SUPPLY02
U 1 1 5BDEBA82
P 1050 4200
F 0 "#SUPPLY02" H 1050 4200 45  0001 L BNN
F 1 "3.3V" V 1050 4328 45  0000 L CNN
F 2 "XXX-00000" V 1092 4329 60  0001 L CNN
F 3 "" H 1050 4200 50  0001 C CNN
	1    1050 4200
	0    1    1    0   
$EndComp
Text Label 1500 4300 2    50   ~ 0
FRONT_LED
Wire Wire Line
	1500 4300 1050 4300
$Comp
L SparkFun-Connectors:CONN_04 J1
U 1 1 5BDEBA8B
P 950 3900
F 0 "J1" H 908 4404 45  0000 C CNN
F 1 "CONN_04" H 908 4320 45  0000 C CNN
F 2 "1X04" H 950 4400 20  0001 C CNN
F 3 "" H 950 3900 50  0001 C CNN
F 4 "CONN-09696" H 908 4331 60  0001 C CNN "Field4"
	1    950  3900
	1    0    0    -1  
$EndComp
$Comp
L SparkFun-PowerSymbols:3.3V #SUPPLY01
U 1 1 5BDEBA91
P 1050 3600
F 0 "#SUPPLY01" H 1050 3600 45  0001 L BNN
F 1 "3.3V" V 1050 3728 45  0000 L CNN
F 2 "XXX-00000" V 1092 3729 60  0001 L CNN
F 3 "" H 1050 3600 50  0001 C CNN
	1    1050 3600
	0    1    1    0   
$EndComp
Text Label 1500 3700 2    50   ~ 0
BRAKE_LED
Text Label 1500 3800 2    50   ~ 0
LEFT_LED
Text Label 1500 3900 2    50   ~ 0
RIGHT_LED
Wire Wire Line
	1500 3900 1050 3900
Wire Wire Line
	1500 3800 1050 3800
Wire Wire Line
	1500 3700 1050 3700
Wire Wire Line
	6050 4700 6500 4700
Wire Wire Line
	6050 4800 6500 4800
Wire Wire Line
	6050 4900 6500 4900
Wire Wire Line
	6050 5100 6500 5100
Wire Wire Line
	6050 5200 6500 5200
Wire Wire Line
	6050 5300 6500 5300
Wire Wire Line
	6050 5400 6500 5400
Text Label 6500 5800 2    50   ~ 0
F_CTL
Text Label 6500 5700 2    50   ~ 0
B_CTL
Text Label 6500 4800 2    50   ~ 0
L_CTL
Text Label 6500 4700 2    50   ~ 0
R_CTL
Text Label 6500 5100 2    50   ~ 0
BRAKE
Text Label 6500 5200 2    50   ~ 0
TURN_BOTH
Text Label 6500 5300 2    50   ~ 0
TURN_L
Text Label 6500 5400 2    50   ~ 0
TURN_R
Wire Wire Line
	6050 5500 6500 5500
Wire Wire Line
	6050 5600 6500 5600
Text Label 6500 5500 2    50   ~ 0
FL_LOW
Text Label 6500 5600 2    50   ~ 0
FL_HIGH
Wire Wire Line
	4550 6600 4550 6700
Wire Wire Line
	4550 6000 4550 6300
Wire Wire Line
	4650 6700 4550 6700
Connection ~ 4550 6700
Wire Wire Line
	4550 6700 4550 6750
$Comp
L SparkFun-PowerSymbols:GND #GND022
U 1 1 5BDEBAB6
P 10800 5800
F 0 "#GND022" H 10850 5750 45  0001 L BNN
F 1 "GND" V 10800 5672 45  0000 R CNN
F 2 "" H 10800 5700 60  0001 C CNN
F 3 "" H 10800 5700 60  0001 C CNN
	1    10800 5800
	0    -1   -1   0   
$EndComp
$Comp
L SparkFun-PowerSymbols:GND #GND021
U 1 1 5BDEBABC
P 10800 5400
F 0 "#GND021" H 10850 5350 45  0001 L BNN
F 1 "GND" V 10800 5272 45  0000 R CNN
F 2 "" H 10800 5300 60  0001 C CNN
F 3 "" H 10800 5300 60  0001 C CNN
	1    10800 5400
	0    -1   -1   0   
$EndComp
$Comp
L SparkFun-PowerSymbols:GND #GND05
U 1 1 5BDEBAC2
P 3300 5800
F 0 "#GND05" H 3350 5750 45  0001 L BNN
F 1 "GND" V 3300 5673 45  0000 R CNN
F 2 "" H 3300 5700 60  0001 C CNN
F 3 "" H 3300 5700 60  0001 C CNN
	1    3300 5800
	0    1    1    0   
$EndComp
$Comp
L SparkFun-PowerSymbols:GND #GND04
U 1 1 5BDEBAC8
P 3300 5600
F 0 "#GND04" H 3350 5550 45  0001 L BNN
F 1 "GND" V 3300 5473 45  0000 R CNN
F 2 "" H 3300 5500 60  0001 C CNN
F 3 "" H 3300 5500 60  0001 C CNN
	1    3300 5600
	0    1    1    0   
$EndComp
$Comp
L SparkFun-PowerSymbols:GND #GND07
U 1 1 5BDEBACE
P 3450 4900
F 0 "#GND07" H 3500 4850 45  0001 L BNN
F 1 "GND" V 3450 4773 45  0000 R CNN
F 2 "" H 3450 4800 60  0001 C CNN
F 3 "" H 3450 4800 60  0001 C CNN
	1    3450 4900
	0    1    1    0   
$EndComp
$Comp
L SparkFun-PowerSymbols:GND #GND08
U 1 1 5BDEBAD4
P 4350 4300
F 0 "#GND08" H 4400 4250 45  0001 L BNN
F 1 "GND" V 4350 4173 45  0000 R CNN
F 2 "" H 4350 4200 60  0001 C CNN
F 3 "" H 4350 4200 60  0001 C CNN
	1    4350 4300
	0    1    1    0   
$EndComp
$Comp
L SparkFun-PowerSymbols:GND #GND06
U 1 1 5BDEBADA
P 3350 4200
F 0 "#GND06" H 3400 4150 45  0001 L BNN
F 1 "GND" H 3350 4030 45  0000 C CNN
F 2 "" H 3350 4100 60  0001 C CNN
F 3 "" H 3350 4100 60  0001 C CNN
	1    3350 4200
	1    0    0    -1  
$EndComp
$Comp
L SparkFun-PowerSymbols:GND #GND010
U 1 1 5BDEBAE0
P 4650 1250
F 0 "#GND010" H 4700 1200 45  0001 L BNN
F 1 "GND" V 4650 1122 45  0000 R CNN
F 2 "" H 4650 1150 60  0001 C CNN
F 3 "" H 4650 1150 60  0001 C CNN
	1    4650 1250
	0    -1   -1   0   
$EndComp
$Comp
L SparkFun-PowerSymbols:GND #GND011
U 1 1 5BDEBAE6
P 5650 1250
F 0 "#GND011" H 5700 1200 45  0001 L BNN
F 1 "GND" V 5650 1122 45  0000 R CNN
F 2 "" H 5650 1150 60  0001 C CNN
F 3 "" H 5650 1150 60  0001 C CNN
	1    5650 1250
	0    -1   -1   0   
$EndComp
$Comp
L SparkFun-PowerSymbols:GND #GND017
U 1 1 5BDEBAEC
P 6700 1250
F 0 "#GND017" H 6750 1200 45  0001 L BNN
F 1 "GND" V 6700 1122 45  0000 R CNN
F 2 "" H 6700 1150 60  0001 C CNN
F 3 "" H 6700 1150 60  0001 C CNN
	1    6700 1250
	0    -1   -1   0   
$EndComp
$Comp
L SparkFun-PowerSymbols:GND #GND018
U 1 1 5BDEBAF2
P 7700 1250
F 0 "#GND018" H 7750 1200 45  0001 L BNN
F 1 "GND" V 7700 1122 45  0000 R CNN
F 2 "" H 7700 1150 60  0001 C CNN
F 3 "" H 7700 1150 60  0001 C CNN
	1    7700 1250
	0    -1   -1   0   
$EndComp
$Comp
L SparkFun-PowerSymbols:GND #GND09
U 1 1 5BDEBAF8
P 4550 6750
F 0 "#GND09" H 4600 6700 45  0001 L BNN
F 1 "GND" H 4550 6580 45  0000 C CNN
F 2 "" H 4550 6650 60  0001 C CNN
F 3 "" H 4550 6650 60  0001 C CNN
	1    4550 6750
	1    0    0    -1  
$EndComp
$Comp
L SparkFun-PowerSymbols:GND #GND019
U 1 1 5BDEBAFE
P 8500 3950
F 0 "#GND019" H 8550 3900 45  0001 L BNN
F 1 "GND" H 8500 3780 45  0000 C CNN
F 2 "" H 8500 3850 60  0001 C CNN
F 3 "" H 8500 3850 60  0001 C CNN
	1    8500 3950
	1    0    0    -1  
$EndComp
$Sheet
S 550  6150 850  1350
U 5BDEB9CA
F0 "sheet5BDEB94F" 50
F1 "USB_And_Power_Handler.sch" 50
F2 "USB_VCC" I R 1400 6200 50 
F3 "CHARGE_STAT" I R 1400 6350 50 
F4 "3.3V" I R 1400 6500 50 
F5 "PROGRAMMER_VCC" I R 1400 6650 50 
F6 "USB_D-" I R 1400 6800 50 
F7 "USB_D+" I R 1400 6950 50 
F8 "SDA" I R 1400 7100 50 
F9 "SCL" I R 1400 7250 50 
F10 "GPOUT" I R 1400 7400 50 
$EndSheet
Text Label 2000 7100 2    50   ~ 0
SDA
Text Label 2000 7250 2    50   ~ 0
SCL
Text Label 2000 7400 2    50   ~ 0
FG_INT
Wire Wire Line
	1400 7400 2000 7400
Wire Wire Line
	2000 7250 1400 7250
Wire Wire Line
	1400 7100 2000 7100
Text Label 6500 4900 2    50   ~ 0
SDA
Text Label 6500 5000 2    50   ~ 0
SCL
Text Label 6500 5900 2    50   ~ 0
FG_INT
Wire Wire Line
	6500 5900 6050 5900
Wire Wire Line
	6050 5800 6500 5800
Wire Wire Line
	6500 5700 6050 5700
Wire Wire Line
	6500 6000 6050 6000
Wire Wire Line
	6050 5000 6500 5000
$Comp
L SparkFun-LED:LED-BLUE1206 D4
U 1 1 5C0B4068
P 5850 3300
F 0 "D4" V 5750 3100 45  0000 C CNN
F 1 "BLUE1206" V 5750 3450 45  0000 C CNN
F 2 "LED-1206" V 5650 3300 20  0001 C CNN
F 3 "" H 5850 3300 50  0001 C CNN
F 4 "DIO-09911" H 5687 3334 60  0001 R CNN "Field4"
	1    5850 3300
	0    1    1    0   
$EndComp
$Comp
L SparkFun-LED:LED-BLUE1206 D3
U 1 1 5C0CBD64
P 5850 3100
F 0 "D3" V 5750 2900 45  0000 C CNN
F 1 "BLUE1206" V 5750 3250 45  0000 C CNN
F 2 "LED-1206" V 5650 3100 20  0001 C CNN
F 3 "" H 5850 3100 50  0001 C CNN
F 4 "DIO-09911" H 5687 3134 60  0001 R CNN "Field4"
	1    5850 3100
	0    1    1    0   
$EndComp
$Comp
L SparkFun-LED:LED-BLUE1206 D2
U 1 1 5C0D1314
P 5850 2900
F 0 "D2" V 5750 2700 45  0000 C CNN
F 1 "BLUE1206" V 5750 3050 45  0000 C CNN
F 2 "LED-1206" V 5650 2900 20  0001 C CNN
F 3 "" H 5850 2900 50  0001 C CNN
F 4 "DIO-09911" H 5687 2934 60  0001 R CNN "Field4"
	1    5850 2900
	0    1    1    0   
$EndComp
$Comp
L SparkFun-LED:LED-BLUE1206 D1
U 1 1 5C0D5B04
P 5850 2700
F 0 "D1" V 5750 2500 45  0000 C CNN
F 1 "BLUE1206" V 5750 2850 45  0000 C CNN
F 2 "LED-1206" V 5650 2700 20  0001 C CNN
F 3 "" H 5850 2700 50  0001 C CNN
F 4 "DIO-09911" H 5687 2734 60  0001 R CNN "Field4"
	1    5850 2700
	0    1    1    0   
$EndComp
$Comp
L SparkFun-Switches:MOMENTARY-SWITCH-SPST-SMD-RIGHT-ANGLE S2
U 1 1 5C0E69ED
P 5850 2500
F 0 "S2" H 5850 2704 45  0000 C CNN
F 1 "SPST-RIGHT" H 5850 2620 45  0000 C CNN
F 2 "TACTILE_SWITCH_SMD_RIGHT_ANGLE" H 5850 2700 20  0001 C CNN
F 3 "" H 5850 2500 50  0001 C CNN
F 4 "COMP-12265" H 5850 2631 60  0001 C CNN "Field4"
	1    5850 2500
	1    0    0    -1  
$EndComp
$Comp
L SparkFun-Resistors:220OHM-0603-1_10W-1% R8
U 1 1 5C0EB209
P 6150 2700
F 0 "R8" H 6300 2750 45  0000 C CNN
F 1 "220Ω" H 6350 2650 45  0000 C CNN
F 2 "0603" H 6150 2850 20  0001 C CNN
F 3 "" H 6150 2700 60  0001 C CNN
F 4 "RES-07861" H 6150 2821 60  0001 C CNN "Field4"
	1    6150 2700
	1    0    0    -1  
$EndComp
$Comp
L SparkFun-Resistors:220OHM-0603-1_10W-1% R9
U 1 1 5C0F5318
P 6150 2900
F 0 "R9" H 6300 2950 45  0000 C CNN
F 1 "220Ω" H 6350 2850 45  0000 C CNN
F 2 "0603" H 6150 3050 20  0001 C CNN
F 3 "" H 6150 2900 60  0001 C CNN
F 4 "RES-07861" H 6150 3021 60  0001 C CNN "Field4"
	1    6150 2900
	1    0    0    -1  
$EndComp
$Comp
L SparkFun-Resistors:220OHM-0603-1_10W-1% R10
U 1 1 5C0F96AC
P 6150 3100
F 0 "R10" H 6300 3150 45  0000 C CNN
F 1 "220Ω" H 6350 3050 45  0000 C CNN
F 2 "0603" H 6150 3250 20  0001 C CNN
F 3 "" H 6150 3100 60  0001 C CNN
F 4 "RES-07861" H 6150 3221 60  0001 C CNN "Field4"
	1    6150 3100
	1    0    0    -1  
$EndComp
$Comp
L SparkFun-Resistors:220OHM-0603-1_10W-1% R11
U 1 1 5C0FDB1A
P 6150 3300
F 0 "R11" H 6300 3350 45  0000 C CNN
F 1 "220Ω" H 6350 3250 45  0000 C CNN
F 2 "0603" H 6150 3450 20  0001 C CNN
F 3 "" H 6150 3300 60  0001 C CNN
F 4 "RES-07861" H 6150 3421 60  0001 C CNN "Field4"
	1    6150 3300
	1    0    0    -1  
$EndComp
Wire Wire Line
	6050 3800 6100 3800
Wire Wire Line
	6100 3800 6100 3400
Wire Wire Line
	6100 3400 6450 3400
Wire Wire Line
	6450 3400 6450 3300
Wire Wire Line
	6450 3300 6350 3300
Wire Wire Line
	6050 3900 6150 3900
Wire Wire Line
	6150 3900 6150 3450
Wire Wire Line
	6150 3450 6500 3450
Wire Wire Line
	6500 3450 6500 3100
Wire Wire Line
	6500 3100 6350 3100
Wire Wire Line
	6050 4000 6200 4000
Wire Wire Line
	6200 4000 6200 3500
Wire Wire Line
	6200 3500 6550 3500
Wire Wire Line
	6550 3500 6550 2900
Wire Wire Line
	6550 2900 6350 2900
Wire Wire Line
	6050 4100 6250 4100
Wire Wire Line
	6250 4100 6250 3550
Wire Wire Line
	6250 3550 6600 3550
Wire Wire Line
	6600 3550 6600 2700
Wire Wire Line
	6600 2700 6350 2700
Wire Wire Line
	6050 4200 6300 4200
Wire Wire Line
	6300 4200 6300 3600
Wire Wire Line
	6300 3600 6650 3600
Wire Wire Line
	6650 3600 6650 2500
Wire Wire Line
	6650 2500 6300 2500
$Comp
L SparkFun-Resistors:10KOHM-0603-1_10W-1% R12
U 1 1 5C13FD66
P 6300 2300
F 0 "R12" V 6258 2368 45  0000 L CNN
F 1 "10KΩ" V 6342 2368 45  0000 L CNN
F 2 "0603" H 6300 2450 20  0001 C CNN
F 3 "" H 6300 2300 60  0001 C CNN
F 4 "RES-00824" H 6300 2421 60  0001 C CNN "Field4"
	1    6300 2300
	0    1    1    0   
$EndComp
Connection ~ 6300 2500
Wire Wire Line
	6300 2500 6050 2500
$Comp
L SparkFun-PowerSymbols:GND #GND016
U 1 1 5C149C01
P 6300 2100
F 0 "#GND016" H 6350 2050 45  0001 L BNN
F 1 "GND" H 6300 1930 45  0000 C CNN
F 2 "" H 6300 2000 60  0001 C CNN
F 3 "" H 6300 2000 60  0001 C CNN
	1    6300 2100
	-1   0    0    1   
$EndComp
$Comp
L SparkFun-PowerSymbols:3.3V #SUPPLY09
U 1 1 5C14D017
P 5650 2500
F 0 "#SUPPLY09" H 5700 2500 45  0001 L BNN
F 1 "3.3V" V 5650 2628 45  0000 L CNN
F 2 "XXX-00000" V 5608 2627 60  0001 L CNN
F 3 "" H 5650 2500 60  0001 C CNN
	1    5650 2500
	0    -1   -1   0   
$EndComp
$Comp
L SparkFun-PowerSymbols:GND #GND012
U 1 1 5C14F6A0
P 5650 2700
F 0 "#GND012" H 5700 2650 45  0001 L BNN
F 1 "GND" V 5650 2573 45  0000 R CNN
F 2 "" H 5650 2600 60  0001 C CNN
F 3 "" H 5650 2600 60  0001 C CNN
	1    5650 2700
	0    1    1    0   
$EndComp
$Comp
L SparkFun-PowerSymbols:GND #GND013
U 1 1 5C1535A0
P 5650 2900
F 0 "#GND013" H 5700 2850 45  0001 L BNN
F 1 "GND" V 5650 2773 45  0000 R CNN
F 2 "" H 5650 2800 60  0001 C CNN
F 3 "" H 5650 2800 60  0001 C CNN
	1    5650 2900
	0    1    1    0   
$EndComp
$Comp
L SparkFun-PowerSymbols:GND #GND014
U 1 1 5C158B53
P 5650 3100
F 0 "#GND014" H 5700 3050 45  0001 L BNN
F 1 "GND" V 5650 2973 45  0000 R CNN
F 2 "" H 5650 3000 60  0001 C CNN
F 3 "" H 5650 3000 60  0001 C CNN
	1    5650 3100
	0    1    1    0   
$EndComp
$Comp
L SparkFun-PowerSymbols:GND #GND015
U 1 1 5C15EDAC
P 5650 3300
F 0 "#GND015" H 5700 3250 45  0001 L BNN
F 1 "GND" V 5650 3173 45  0000 R CNN
F 2 "" H 5650 3200 60  0001 C CNN
F 3 "" H 5650 3200 60  0001 C CNN
	1    5650 3300
	0    1    1    0   
$EndComp
$Comp
L SparkFun-Resistors:10KOHM-0603-1_10W-1% R1
U 1 1 5C1864CF
P 1700 4700
F 0 "R1" H 1800 4650 45  0000 L CNN
F 1 "10KΩ" H 1400 4650 45  0000 L CNN
F 2 "0603" H 1700 4850 20  0001 C CNN
F 3 "" H 1700 4700 60  0001 C CNN
F 4 "RES-00824" H 1700 4821 60  0001 C CNN "Field4"
	1    1700 4700
	-1   0    0    1   
$EndComp
$Comp
L SparkFun-Resistors:10KOHM-0603-1_10W-1% R2
U 1 1 5C1A284F
P 1700 4800
F 0 "R2" H 1800 4750 45  0000 L CNN
F 1 "10KΩ" H 1400 4750 45  0000 L CNN
F 2 "0603" H 1700 4950 20  0001 C CNN
F 3 "" H 1700 4800 60  0001 C CNN
F 4 "RES-00824" H 1700 4921 60  0001 C CNN "Field4"
	1    1700 4800
	-1   0    0    1   
$EndComp
Wire Wire Line
	1900 4700 2050 4700
Wire Wire Line
	2050 4700 2050 4800
Wire Wire Line
	1900 4800 2050 4800
$Comp
L SparkFun-Resistors:10KOHM-0603-1_10W-1% R3
U 1 1 5C1B99DF
P 1700 4900
F 0 "R3" H 1800 4850 45  0000 L CNN
F 1 "10KΩ" H 1400 4850 45  0000 L CNN
F 2 "0603" H 1700 5050 20  0001 C CNN
F 3 "" H 1700 4900 60  0001 C CNN
F 4 "RES-00824" H 1700 5021 60  0001 C CNN "Field4"
	1    1700 4900
	-1   0    0    1   
$EndComp
$Comp
L SparkFun-Resistors:10KOHM-0603-1_10W-1% R4
U 1 1 5C1B99E6
P 1700 5000
F 0 "R4" H 1800 4950 45  0000 L CNN
F 1 "10KΩ" H 1400 4950 45  0000 L CNN
F 2 "0603" H 1700 5150 20  0001 C CNN
F 3 "" H 1700 5000 60  0001 C CNN
F 4 "RES-00824" H 1700 5121 60  0001 C CNN "Field4"
	1    1700 5000
	-1   0    0    1   
$EndComp
Wire Wire Line
	1900 4900 2050 4900
Wire Wire Line
	1900 5000 2050 5000
$Comp
L SparkFun-Resistors:10KOHM-0603-1_10W-1% R5
U 1 1 5C1C0AAE
P 1700 5100
F 0 "R5" H 1800 5050 45  0000 L CNN
F 1 "10KΩ" H 1400 5050 45  0000 L CNN
F 2 "0603" H 1700 5250 20  0001 C CNN
F 3 "" H 1700 5100 60  0001 C CNN
F 4 "RES-00824" H 1700 5221 60  0001 C CNN "Field4"
	1    1700 5100
	-1   0    0    1   
$EndComp
$Comp
L SparkFun-Resistors:10KOHM-0603-1_10W-1% R6
U 1 1 5C1C0AB5
P 1700 5200
F 0 "R6" H 1800 5150 45  0000 L CNN
F 1 "10KΩ" H 1400 5150 45  0000 L CNN
F 2 "0603" H 1700 5350 20  0001 C CNN
F 3 "" H 1700 5200 60  0001 C CNN
F 4 "RES-00824" H 1700 5321 60  0001 C CNN "Field4"
	1    1700 5200
	-1   0    0    1   
$EndComp
Wire Wire Line
	1900 5100 2050 5100
Wire Wire Line
	1900 5200 2050 5200
Wire Wire Line
	2050 4800 2050 4900
Connection ~ 2050 4800
Wire Wire Line
	2050 5000 2050 5100
Wire Wire Line
	2050 5100 2050 5200
Connection ~ 2050 5100
Wire Wire Line
	2050 5000 2050 4900
Connection ~ 2050 5000
Connection ~ 2050 4900
$Comp
L SparkFun-PowerSymbols:GND #GND03
U 1 1 5C1E0644
P 2050 5200
F 0 "#GND03" H 2100 5150 45  0001 L BNN
F 1 "GND" H 2050 5030 45  0000 C CNN
F 2 "" H 2050 5100 60  0001 C CNN
F 3 "" H 2050 5100 60  0001 C CNN
	1    2050 5200
	1    0    0    -1  
$EndComp
Connection ~ 2050 5200
$EndSCHEMATC
