<?xml version="1.0" encoding="UTF-8"?>
<svg viewBox="0 0 468.08 828.55" xmlns="http://www.w3.org/2000/svg">
 <g fill-rule="evenodd" stroke="#000" stroke-width=".919">
  <path d="m152.2 716.13l-1.7839 28.943c-1.0388 18.444-54.425 55.272-48.102 75.145 14.544 18.936 31.81-2.54 38.563 0.042175 25.142 9.8782 32.348 4.0192 43.974-7.04 12.258-8.976 42.347 22.758 50.346-2.35 4.3631-14.017-51.592-46.896-53.462-69.029l-1.3474-25.957-28.187 0.2459z"/>
  <path d="m322.39 707.73l2.2855 43.281c2.2855 13.034 44.689 38.124 44.67 50.659-1.4544 17.952-39.684 8.3612-39.684 8.3612-8.3107 9.5907-34.067 7.8755-38.229-1.9674-6.4408 10.574-37.398 11.868-40.93 0-3.3243-15.001 29.088-26.067 41.554-63.938l-0.8311-39.838 31.165 3.4428z"/>
 </g>
 <path d="m118.49 233.08c-17.919 32.881-31.953 70.042-44.44 99.51-19.382 54.363-62.462 102.21-69.076 161.36-14.328 73.296 7.5752 150.4 35.99 146.11 39.076-6.2305 16.199-69.178 21.335-91.322 3.918-8.8715 7.6037-17.898 11.275-26.909-0.12445-29.647 1.1601-61.954 3.7759-96.666 10.049-100.45 27.039-156.05 41.139-192.08zm217.92 60.1c15.453 33.368 31.838 75.334 41.958 128.45 7.8154 41.021 11.142 88.259 9.7435 133.42 12.072 18.906 18.902 31.561 20.015 33.566 6.5923 15.471-0.83643 54.778 37.759 57.1 34.878-3.9109 19.836-98.306 9.189-136.55-15.214-59.802-34.569-78.776-65.775-126.58 0 0-23.621-41.672-52.89-89.416z" fill-rule="evenodd" stroke="#000" stroke-width=".919"/>
 <path d="m424.04 30.701c-8.549-26.12-41.687-17.208-41.687-17.208-7.334 4.4056-30.576 9.5689-37.304 4.1983-81.698-68.807-183.12-1.3674-188.7 136.52-1.119 40.614-45.787 68.79-65.01 260.95-14.181 188.18 11.134 305.95 84.297 309.76 51.068 0.61902 41.663-18.979 76.203-21.246 28.326-1.872 33.994 27.827 80.667 21.246 65.889-6.288 83.625-188.56 59.861-313.28-23.764-124.73-82.083-188.19-81.72-222.42-1.997-16.327 13.38-34.77 25.943-59.403 12.562-24.634 9.108-34.381 21.205-48.548 8.68-14.196 46.378-20.691 46.378-20.691s19.972-3.3085 19.864-29.872z" fill-rule="evenodd" stroke="#000" stroke-width=".919"/>
 <path d="m257.59 261.87c-104.66 1.185-168.25 196.36-170.21 297.44 14.016-101.91 86.616-251.78 170.21-254.78 63.702 0.46597 100.22 63.059 118.53 105.98-7.238-34.003-16.965-63.249-27.144-88.447-0.007996-0.011017-0.019012-0.019012-0.027008-0.031006-19.929-31.955-48.702-59.302-91.362-60.163zm0.529 56.663c-82.439 3.569-171.13 176.19-172.85 324.66 13.375 57.147 38.44 89.75 76.364 91.728 51.068 0.61902 41.665-18.984 76.205-21.252 28.326-1.872 33.995 27.833 80.668 21.252 54.674-5.217 76.173-131.6 68.337-245.74-22.153-117.68-78.777-168.94-128.72-170.64z" fill="#fff" fill-rule="evenodd" stroke="#000" stroke-width=".919"/>
 <g fill="#fff" stroke="#000">
  <path d="m288.06 4.0591l0.1056 0.6876c-13.414 16.284-56.44 28.8-67.412 38.285-58.814 48.037-49.809 195.44-9.2682 197.43 37.242 1.5137 66.445-57.34 86.714-54.224 4.1408-13.159 15.044-28.07 24.398-46.411 10.714-21.009 9.77-31.206 16.767-42.536-0.85181 0.24321-1.4506 0.43167-2.35 0.68758-35.77 10.177-59.163 76.118-91.837 67.57-43.644-20.4-20.975-124.34 39.212-135.8 8.0888-1.54 14.597 6.2062 23.738 1.4689 3.0986-1.6058 10.324-11.001 10.324-11.001l1.1354-1.1876c-10.368-7.0166-20.936-11.957-31.528-14.97z" fill-rule="evenodd" stroke-width=".919"/>
  <path d="m292.17 45.376a6.3456 7.5107 0 1 1 -12.691 0 6.3456 7.5107 0 1 1 12.691 0z" opacity=".99" stroke-linecap="round" stroke-width="2"/>
 </g>
</svg>
