{
	"gebied": "N:/Projects/11205000/11205236/C. Report - advise/3. Morfologie kust/Bodemdaling/Voor Erik - volumes/Deelgebieden shapefile/Deelgebieden_def.shp",
	"uitvoer": "N:/Projects/11205000/11205236/C. Report - advise/3. Morfologie kust/Bodemdaling/Voor Erik - volumes/tabel_test.csv",
	"kolomnaam_volgorde": "Number",
	"dst_crs": "28992",	
	"grid": [-10000, 280000, 360000, 640000, 100],
	"combinaties": {"Gecombineerd (zonder elastische respons)": [1, 1, 1, 0], "Gecombineerd (met elastische respons)": [1, 1 ,1, 1]},
	"rasters":
		{
			"Bodemdalingsvolume door winning (1991-2020)":
				{
					"locatie van rasterbestand": "n:/Projects/11205000/11205236/C. Report - advise/3. Morfologie kust/Bodemdaling/Voor Erik - volumes/Basiskaarten daling door winning/19872017_neg",
					"onzekerheid als fractie": 0.25,
					"periode in jaren": 31,
					"gegeven eenheid": "-2 m",
					"tabel eenheid": "6 m"
				},
			"Bodemdalingsvolume door tektoniek":
				{
					"locatie van rasterbestand": "n:/Projects/11205000/11205236/C. Report - advise/3. Morfologie kust/Bodemdaling/Voor Erik - volumes/tektoniek_basiskaart_mm_yr/tektoniek_nl",
					"onzekerheid als fractie": 0.5,
					"periode in jaren": 1,
					"gegeven eenheid": "-3 m",
					"tabel eenheid": "6 m"
				},
			"Bodemdalingsvolume door gia":
				{
					"locatie van rasterbestand": "n:/Projects/11205000/11205236/C. Report - advise/3. Morfologie kust/Bodemdaling/Voor Erik - volumes/GIA_basiskaart_mm_yr/gia_nl",
					"onzekerheid als fractie": 0.5,
					"periode in jaren": 1,
					"gegeven eenheid": "-3 m",
					"tabel eenheid": "6 m"
				},
			"Bodemdalingsvolume door elastische respons":
				{
					"locatie van rasterbestand": "n:/Projects/11205000/11205236/C. Report - advise/3. Morfologie kust/Bodemdaling/Voor Erik - volumes/e_laatste100t",
					"onzekerheid als fractie": 0.5,
					"periode in jaren": 1,
					"gegeven eenheid": "-3 m",
					"tabel eenheid": "6 m"
				}
			
		}
}	