# vtk DataFile Version 1.0
B38F1220.vtk
ASCII

DATASET UNSTRUCTURED_GRID
POINTS 32 float
133420.50 442260.50 0.57 133420.50 442265.50 0.57 133425.50 442265.50 0.57 133425.50 442260.50 0.57 133420.50 442260.50 -0.63 133420.50 442265.50 -0.63 133425.50 442265.50 -0.63 133425.50 442260.50 -0.63
133420.50 442260.50 -0.63 133420.50 442265.50 -0.63 133425.50 442265.50 -0.63 133425.50 442260.50 -0.63 133420.50 442260.50 -2.33 133420.50 442265.50 -2.33 133425.50 442265.50 -2.33 133425.50 442260.50 -2.33
133420.50 442260.50 -2.33 133420.50 442265.50 -2.33 133425.50 442265.50 -2.33 133425.50 442260.50 -2.33 133420.50 442260.50 -2.83 133420.50 442265.50 -2.83 133425.50 442265.50 -2.83 133425.50 442260.50 -2.83
133420.50 442260.50 -2.83 133420.50 442265.50 -2.83 133425.50 442265.50 -2.83 133425.50 442260.50 -2.83 133420.50 442260.50 -3.51 133420.50 442265.50 -3.51 133425.50 442265.50 -3.51 133425.50 442260.50 -3.51

CELLS 4 36
8 4 7 6 5 0 3 2 1
8 12 15 14 13 8 11 10 9
8 20 23 22 21 16 19 18 17
8 28 31 30 29 24 27 26 25

CELL_TYPES 4
12
12
12
12

CELL_DATA 4
SCALARS Property_0 float
LOOKUP_TABLE custom_table
6.00
3.00
6.00
0.00
