# vtk DataFile Version 1.0
B38F2000.vtk
ASCII

DATASET UNSTRUCTURED_GRID
POINTS 112 float
134097.50 444969.50 4.18 134097.50 444974.50 4.18 134102.50 444974.50 4.18 134102.50 444969.50 4.18 134097.50 444969.50 3.48 134097.50 444974.50 3.48 134102.50 444974.50 3.48 134102.50 444969.50 3.48
134097.50 444969.50 3.48 134097.50 444974.50 3.48 134102.50 444974.50 3.48 134102.50 444969.50 3.48 134097.50 444969.50 1.08 134097.50 444974.50 1.08 134102.50 444974.50 1.08 134102.50 444969.50 1.08
134097.50 444969.50 1.08 134097.50 444974.50 1.08 134102.50 444974.50 1.08 134102.50 444969.50 1.08 134097.50 444969.50 0.58 134097.50 444974.50 0.58 134102.50 444974.50 0.58 134102.50 444969.50 0.58
134097.50 444969.50 0.58 134097.50 444974.50 0.58 134102.50 444974.50 0.58 134102.50 444969.50 0.58 134097.50 444969.50 -0.32 134097.50 444974.50 -0.32 134102.50 444974.50 -0.32 134102.50 444969.50 -0.32
134097.50 444969.50 -0.32 134097.50 444974.50 -0.32 134102.50 444974.50 -0.32 134102.50 444969.50 -0.32 134097.50 444969.50 -0.72 134097.50 444974.50 -0.72 134102.50 444974.50 -0.72 134102.50 444969.50 -0.72
134097.50 444969.50 -0.72 134097.50 444974.50 -0.72 134102.50 444974.50 -0.72 134102.50 444969.50 -0.72 134097.50 444969.50 -4.12 134097.50 444974.50 -4.12 134102.50 444974.50 -4.12 134102.50 444969.50 -4.12
134097.50 444969.50 -4.12 134097.50 444974.50 -4.12 134102.50 444974.50 -4.12 134102.50 444969.50 -4.12 134097.50 444969.50 -4.92 134097.50 444974.50 -4.92 134102.50 444974.50 -4.92 134102.50 444969.50 -4.92
134097.50 444969.50 -4.92 134097.50 444974.50 -4.92 134102.50 444974.50 -4.92 134102.50 444969.50 -4.92 134097.50 444969.50 -5.17 134097.50 444974.50 -5.17 134102.50 444974.50 -5.17 134102.50 444969.50 -5.17
134097.50 444969.50 -5.17 134097.50 444974.50 -5.17 134102.50 444974.50 -5.17 134102.50 444969.50 -5.17 134097.50 444969.50 -6.57 134097.50 444974.50 -6.57 134102.50 444974.50 -6.57 134102.50 444969.50 -6.57
134097.50 444969.50 -6.57 134097.50 444974.50 -6.57 134102.50 444974.50 -6.57 134102.50 444969.50 -6.57 134097.50 444969.50 -6.92 134097.50 444974.50 -6.92 134102.50 444974.50 -6.92 134102.50 444969.50 -6.92
134097.50 444969.50 -6.92 134097.50 444974.50 -6.92 134102.50 444974.50 -6.92 134102.50 444969.50 -6.92 134097.50 444969.50 -7.82 134097.50 444974.50 -7.82 134102.50 444974.50 -7.82 134102.50 444969.50 -7.82
134097.50 444969.50 -7.82 134097.50 444974.50 -7.82 134102.50 444974.50 -7.82 134102.50 444969.50 -7.82 134097.50 444969.50 -8.32 134097.50 444974.50 -8.32 134102.50 444974.50 -8.32 134102.50 444969.50 -8.32
134097.50 444969.50 -8.32 134097.50 444974.50 -8.32 134102.50 444974.50 -8.32 134102.50 444969.50 -8.32 134097.50 444969.50 -9.32 134097.50 444974.50 -9.32 134102.50 444974.50 -9.32 134102.50 444969.50 -9.32
134097.50 444969.50 -9.32 134097.50 444974.50 -9.32 134102.50 444974.50 -9.32 134102.50 444969.50 -9.32 134097.50 444969.50 -12.02 134097.50 444974.50 -12.02 134102.50 444974.50 -12.02 134102.50 444969.50 -12.02

CELLS 14 126
8 4 7 6 5 0 3 2 1
8 12 15 14 13 8 11 10 9
8 20 23 22 21 16 19 18 17
8 28 31 30 29 24 27 26 25
8 36 39 38 37 32 35 34 33
8 44 47 46 45 40 43 42 41
8 52 55 54 53 48 51 50 49
8 60 63 62 61 56 59 58 57
8 68 71 70 69 64 67 66 65
8 76 79 78 77 72 75 74 73
8 84 87 86 85 80 83 82 81
8 92 95 94 93 88 91 90 89
8 100 103 102 101 96 99 98 97
8 108 111 110 109 104 107 106 105

CELL_TYPES 14
12
12
12
12
12
12
12
12
12
12
12
12
12
12

CELL_DATA 14
SCALARS Property_0 float
LOOKUP_TABLE custom_table
1.00
4.00
6.00
4.00
3.00
1.00
3.00
1.00
6.00
5.00
1.00
6.00
4.00
5.00
