# vtk DataFile Version 1.0
B38F0390.vtk
ASCII

DATASET UNSTRUCTURED_GRID
POINTS 184 float
137197.50 446357.50 2.00 137197.50 446362.50 2.00 137202.50 446362.50 2.00 137202.50 446357.50 2.00 137197.50 446357.50 -0.25 137197.50 446362.50 -0.25 137202.50 446362.50 -0.25 137202.50 446357.50 -0.25
137197.50 446357.50 -0.25 137197.50 446362.50 -0.25 137202.50 446362.50 -0.25 137202.50 446357.50 -0.25 137197.50 446357.50 -2.60 137197.50 446362.50 -2.60 137202.50 446362.50 -2.60 137202.50 446357.50 -2.60
137197.50 446357.50 -2.60 137197.50 446362.50 -2.60 137202.50 446362.50 -2.60 137202.50 446357.50 -2.60 137197.50 446357.50 -7.25 137197.50 446362.50 -7.25 137202.50 446362.50 -7.25 137202.50 446357.50 -7.25
137197.50 446357.50 -7.25 137197.50 446362.50 -7.25 137202.50 446362.50 -7.25 137202.50 446357.50 -7.25 137197.50 446357.50 -11.25 137197.50 446362.50 -11.25 137202.50 446362.50 -11.25 137202.50 446357.50 -11.25
137197.50 446357.50 -11.25 137197.50 446362.50 -11.25 137202.50 446362.50 -11.25 137202.50 446357.50 -11.25 137197.50 446357.50 -22.30 137197.50 446362.50 -22.30 137202.50 446362.50 -22.30 137202.50 446357.50 -22.30
137197.50 446357.50 -22.30 137197.50 446362.50 -22.30 137202.50 446362.50 -22.30 137202.50 446357.50 -22.30 137197.50 446357.50 -24.80 137197.50 446362.50 -24.80 137202.50 446362.50 -24.80 137202.50 446357.50 -24.80
137197.50 446357.50 -24.80 137197.50 446362.50 -24.80 137202.50 446362.50 -24.80 137202.50 446357.50 -24.80 137197.50 446357.50 -31.00 137197.50 446362.50 -31.00 137202.50 446362.50 -31.00 137202.50 446357.50 -31.00
137197.50 446357.50 -31.00 137197.50 446362.50 -31.00 137202.50 446362.50 -31.00 137202.50 446357.50 -31.00 137197.50 446357.50 -40.00 137197.50 446362.50 -40.00 137202.50 446362.50 -40.00 137202.50 446357.50 -40.00
137197.50 446357.50 -40.00 137197.50 446362.50 -40.00 137202.50 446362.50 -40.00 137202.50 446357.50 -40.00 137197.50 446357.50 -45.50 137197.50 446362.50 -45.50 137202.50 446362.50 -45.50 137202.50 446357.50 -45.50
137197.50 446357.50 -45.50 137197.50 446362.50 -45.50 137202.50 446362.50 -45.50 137202.50 446357.50 -45.50 137197.50 446357.50 -48.50 137197.50 446362.50 -48.50 137202.50 446362.50 -48.50 137202.50 446357.50 -48.50
137197.50 446357.50 -48.50 137197.50 446362.50 -48.50 137202.50 446362.50 -48.50 137202.50 446357.50 -48.50 137197.50 446357.50 -53.75 137197.50 446362.50 -53.75 137202.50 446362.50 -53.75 137202.50 446357.50 -53.75
137197.50 446357.50 -53.75 137197.50 446362.50 -53.75 137202.50 446362.50 -53.75 137202.50 446357.50 -53.75 137197.50 446357.50 -55.50 137197.50 446362.50 -55.50 137202.50 446362.50 -55.50 137202.50 446357.50 -55.50
137197.50 446357.50 -55.50 137197.50 446362.50 -55.50 137202.50 446362.50 -55.50 137202.50 446357.50 -55.50 137197.50 446357.50 -59.25 137197.50 446362.50 -59.25 137202.50 446362.50 -59.25 137202.50 446357.50 -59.25
137197.50 446357.50 -59.25 137197.50 446362.50 -59.25 137202.50 446362.50 -59.25 137202.50 446357.50 -59.25 137197.50 446357.50 -82.00 137197.50 446362.50 -82.00 137202.50 446362.50 -82.00 137202.50 446357.50 -82.00
137197.50 446357.50 -82.00 137197.50 446362.50 -82.00 137202.50 446362.50 -82.00 137202.50 446357.50 -82.00 137197.50 446357.50 -85.00 137197.50 446362.50 -85.00 137202.50 446362.50 -85.00 137202.50 446357.50 -85.00
137197.50 446357.50 -85.00 137197.50 446362.50 -85.00 137202.50 446362.50 -85.00 137202.50 446357.50 -85.00 137197.50 446357.50 -89.75 137197.50 446362.50 -89.75 137202.50 446362.50 -89.75 137202.50 446357.50 -89.75
137197.50 446357.50 -89.75 137197.50 446362.50 -89.75 137202.50 446362.50 -89.75 137202.50 446357.50 -89.75 137197.50 446357.50 -91.50 137197.50 446362.50 -91.50 137202.50 446362.50 -91.50 137202.50 446357.50 -91.50
137197.50 446357.50 -91.50 137197.50 446362.50 -91.50 137202.50 446362.50 -91.50 137202.50 446357.50 -91.50 137197.50 446357.50 -93.25 137197.50 446362.50 -93.25 137202.50 446362.50 -93.25 137202.50 446357.50 -93.25
137197.50 446357.50 -93.25 137197.50 446362.50 -93.25 137202.50 446362.50 -93.25 137202.50 446357.50 -93.25 137197.50 446357.50 -96.00 137197.50 446362.50 -96.00 137202.50 446362.50 -96.00 137202.50 446357.50 -96.00
137197.50 446357.50 -96.00 137197.50 446362.50 -96.00 137202.50 446362.50 -96.00 137202.50 446357.50 -96.00 137197.50 446357.50 -115.50 137197.50 446362.50 -115.50 137202.50 446362.50 -115.50 137202.50 446357.50 -115.50
137197.50 446357.50 -115.50 137197.50 446362.50 -115.50 137202.50 446362.50 -115.50 137202.50 446357.50 -115.50 137197.50 446357.50 -117.00 137197.50 446362.50 -117.00 137202.50 446362.50 -117.00 137202.50 446357.50 -117.00
137197.50 446357.50 -117.00 137197.50 446362.50 -117.00 137202.50 446362.50 -117.00 137202.50 446357.50 -117.00 137197.50 446357.50 -122.00 137197.50 446362.50 -122.00 137202.50 446362.50 -122.00 137202.50 446357.50 -122.00
137197.50 446357.50 -122.00 137197.50 446362.50 -122.00 137202.50 446362.50 -122.00 137202.50 446357.50 -122.00 137197.50 446357.50 -146.80 137197.50 446362.50 -146.80 137202.50 446362.50 -146.80 137202.50 446357.50 -146.80

CELLS 23 207
8 4 7 6 5 0 3 2 1
8 12 15 14 13 8 11 10 9
8 20 23 22 21 16 19 18 17
8 28 31 30 29 24 27 26 25
8 36 39 38 37 32 35 34 33
8 44 47 46 45 40 43 42 41
8 52 55 54 53 48 51 50 49
8 60 63 62 61 56 59 58 57
8 68 71 70 69 64 67 66 65
8 76 79 78 77 72 75 74 73
8 84 87 86 85 80 83 82 81
8 92 95 94 93 88 91 90 89
8 100 103 102 101 96 99 98 97
8 108 111 110 109 104 107 106 105
8 116 119 118 117 112 115 114 113
8 124 127 126 125 120 123 122 121
8 132 135 134 133 128 131 130 129
8 140 143 142 141 136 139 138 137
8 148 151 150 149 144 147 146 145
8 156 159 158 157 152 155 154 153
8 164 167 166 165 160 163 162 161
8 172 175 174 173 168 171 170 169
8 180 183 182 181 176 179 178 177

CELL_TYPES 23
12
12
12
12
12
12
12
12
12
12
12
12
12
12
12
12
12
12
12
12
12
12
12

CELL_DATA 23
SCALARS Property_0 float
LOOKUP_TABLE custom_table
6.00
8.00
5.00
5.00
5.00
6.00
5.00
5.00
4.00
5.00
4.00
5.00
4.00
6.00
4.00
5.00
4.00
5.00
4.00
5.00
4.00
5.00
4.00
