# vtk DataFile Version 1.0
B38F1880.vtk
ASCII

DATASET UNSTRUCTURED_GRID
POINTS 40 float
133380.50 444573.50 1.12 133380.50 444578.50 1.12 133385.50 444578.50 1.12 133385.50 444573.50 1.12 133380.50 444573.50 0.22 133380.50 444578.50 0.22 133385.50 444578.50 0.22 133385.50 444573.50 0.22
133380.50 444573.50 0.22 133380.50 444578.50 0.22 133385.50 444578.50 0.22 133385.50 444573.50 0.22 133380.50 444573.50 -0.63 133380.50 444578.50 -0.63 133385.50 444578.50 -0.63 133385.50 444573.50 -0.63
133380.50 444573.50 -0.63 133380.50 444578.50 -0.63 133385.50 444578.50 -0.63 133385.50 444573.50 -0.63 133380.50 444573.50 -0.94 133380.50 444578.50 -0.94 133385.50 444578.50 -0.94 133385.50 444573.50 -0.94
133380.50 444573.50 -0.94 133380.50 444578.50 -0.94 133385.50 444578.50 -0.94 133385.50 444573.50 -0.94 133380.50 444573.50 -3.08 133380.50 444578.50 -3.08 133385.50 444578.50 -3.08 133385.50 444573.50 -3.08
133380.50 444573.50 -3.08 133380.50 444578.50 -3.08 133385.50 444578.50 -3.08 133385.50 444573.50 -3.08 133380.50 444573.50 -3.92 133380.50 444578.50 -3.92 133385.50 444578.50 -3.92 133385.50 444573.50 -3.92

CELLS 5 45
8 4 7 6 5 0 3 2 1
8 12 15 14 13 8 11 10 9
8 20 23 22 21 16 19 18 17
8 28 31 30 29 24 27 26 25
8 36 39 38 37 32 35 34 33

CELL_TYPES 5
12
12
12
12
12

CELL_DATA 5
SCALARS Property_0 float
LOOKUP_TABLE custom_table
0.00
1.00
6.00
0.00
0.00
