# vtk DataFile Version 1.0
B38F1865.vtk
ASCII

DATASET UNSTRUCTURED_GRID
POINTS 104 float
137186.50 444954.50 7.13 137186.50 444959.50 7.13 137191.50 444959.50 7.13 137191.50 444954.50 7.13 137186.50 444954.50 5.51 137186.50 444959.50 5.51 137191.50 444959.50 5.51 137191.50 444954.50 5.51
137186.50 444954.50 5.51 137186.50 444959.50 5.51 137191.50 444959.50 5.51 137191.50 444954.50 5.51 137186.50 444954.50 4.53 137186.50 444959.50 4.53 137191.50 444959.50 4.53 137191.50 444954.50 4.53
137186.50 444954.50 4.53 137186.50 444959.50 4.53 137191.50 444959.50 4.53 137191.50 444954.50 4.53 137186.50 444954.50 -1.09 137186.50 444959.50 -1.09 137191.50 444959.50 -1.09 137191.50 444954.50 -1.09
137186.50 444954.50 -1.09 137186.50 444959.50 -1.09 137191.50 444959.50 -1.09 137191.50 444954.50 -1.09 137186.50 444954.50 -2.04 137186.50 444959.50 -2.04 137191.50 444959.50 -2.04 137191.50 444954.50 -2.04
137186.50 444954.50 -2.04 137186.50 444959.50 -2.04 137191.50 444959.50 -2.04 137191.50 444954.50 -2.04 137186.50 444954.50 -4.07 137186.50 444959.50 -4.07 137191.50 444959.50 -4.07 137191.50 444954.50 -4.07
137186.50 444954.50 -4.07 137186.50 444959.50 -4.07 137191.50 444959.50 -4.07 137191.50 444954.50 -4.07 137186.50 444954.50 -4.42 137186.50 444959.50 -4.42 137191.50 444959.50 -4.42 137191.50 444954.50 -4.42
137186.50 444954.50 -4.42 137186.50 444959.50 -4.42 137191.50 444959.50 -4.42 137191.50 444954.50 -4.42 137186.50 444954.50 -4.89 137186.50 444959.50 -4.89 137191.50 444959.50 -4.89 137191.50 444954.50 -4.89
137186.50 444954.50 -4.89 137186.50 444959.50 -4.89 137191.50 444959.50 -4.89 137191.50 444954.50 -4.89 137186.50 444954.50 -5.32 137186.50 444959.50 -5.32 137191.50 444959.50 -5.32 137191.50 444954.50 -5.32
137186.50 444954.50 -5.32 137186.50 444959.50 -5.32 137191.50 444959.50 -5.32 137191.50 444954.50 -5.32 137186.50 444954.50 -5.59 137186.50 444959.50 -5.59 137191.50 444959.50 -5.59 137191.50 444954.50 -5.59
137186.50 444954.50 -5.59 137186.50 444959.50 -5.59 137191.50 444959.50 -5.59 137191.50 444954.50 -5.59 137186.50 444954.50 -6.24 137186.50 444959.50 -6.24 137191.50 444959.50 -6.24 137191.50 444954.50 -6.24
137186.50 444954.50 -6.24 137186.50 444959.50 -6.24 137191.50 444959.50 -6.24 137191.50 444954.50 -6.24 137186.50 444954.50 -6.91 137186.50 444959.50 -6.91 137191.50 444959.50 -6.91 137191.50 444954.50 -6.91
137186.50 444954.50 -6.91 137186.50 444959.50 -6.91 137191.50 444959.50 -6.91 137191.50 444954.50 -6.91 137186.50 444954.50 -7.16 137186.50 444959.50 -7.16 137191.50 444959.50 -7.16 137191.50 444954.50 -7.16
137186.50 444954.50 -7.16 137186.50 444959.50 -7.16 137191.50 444959.50 -7.16 137191.50 444954.50 -7.16 137186.50 444954.50 -10.02 137186.50 444959.50 -10.02 137191.50 444959.50 -10.02 137191.50 444954.50 -10.02

CELLS 13 117
8 4 7 6 5 0 3 2 1
8 12 15 14 13 8 11 10 9
8 20 23 22 21 16 19 18 17
8 28 31 30 29 24 27 26 25
8 36 39 38 37 32 35 34 33
8 44 47 46 45 40 43 42 41
8 52 55 54 53 48 51 50 49
8 60 63 62 61 56 59 58 57
8 68 71 70 69 64 67 66 65
8 76 79 78 77 72 75 74 73
8 84 87 86 85 80 83 82 81
8 92 95 94 93 88 91 90 89
8 100 103 102 101 96 99 98 97

CELL_TYPES 13
12
12
12
12
12
12
12
12
12
12
12
12
12

CELL_DATA 13
SCALARS Property_0 float
LOOKUP_TABLE custom_table
1.00
6.00
1.00
0.00
1.00
3.00
1.00
3.00
1.00
3.00
1.00
6.00
0.00
