# vtk DataFile Version 1.0
B38F1888.vtk
ASCII

DATASET UNSTRUCTURED_GRID
POINTS 40 float
137656.50 444351.50 7.50 137656.50 444356.50 7.50 137661.50 444356.50 7.50 137661.50 444351.50 7.50 137656.50 444351.50 6.75 137656.50 444356.50 6.75 137661.50 444356.50 6.75 137661.50 444351.50 6.75
137656.50 444351.50 6.75 137656.50 444356.50 6.75 137661.50 444356.50 6.75 137661.50 444351.50 6.75 137656.50 444351.50 4.38 137656.50 444356.50 4.38 137661.50 444356.50 4.38 137661.50 444351.50 4.38
137656.50 444351.50 4.38 137656.50 444356.50 4.38 137661.50 444356.50 4.38 137661.50 444351.50 4.38 137656.50 444351.50 1.65 137656.50 444356.50 1.65 137661.50 444356.50 1.65 137661.50 444351.50 1.65
137656.50 444351.50 1.65 137656.50 444356.50 1.65 137661.50 444356.50 1.65 137661.50 444351.50 1.65 137656.50 444351.50 0.33 137656.50 444356.50 0.33 137661.50 444356.50 0.33 137661.50 444351.50 0.33
137656.50 444351.50 0.33 137656.50 444356.50 0.33 137661.50 444356.50 0.33 137661.50 444351.50 0.33 137656.50 444351.50 -1.10 137656.50 444356.50 -1.10 137661.50 444356.50 -1.10 137661.50 444351.50 -1.10

CELLS 5 45
8 4 7 6 5 0 3 2 1
8 12 15 14 13 8 11 10 9
8 20 23 22 21 16 19 18 17
8 28 31 30 29 24 27 26 25
8 36 39 38 37 32 35 34 33

CELL_TYPES 5
12
12
12
12
12

CELL_DATA 5
SCALARS Property_0 float
LOOKUP_TABLE custom_table
0.00
1.00
6.00
1.00
0.00
