# vtk DataFile Version 1.0
B38F0186.vtk
ASCII

DATASET UNSTRUCTURED_GRID
POINTS 56 float
131794.50 443160.50 1.90 131794.50 443165.50 1.90 131799.50 443165.50 1.90 131799.50 443160.50 1.90 131794.50 443160.50 1.00 131794.50 443165.50 1.00 131799.50 443165.50 1.00 131799.50 443160.50 1.00
131794.50 443160.50 1.00 131794.50 443165.50 1.00 131799.50 443165.50 1.00 131799.50 443160.50 1.00 131794.50 443160.50 -2.90 131794.50 443165.50 -2.90 131799.50 443165.50 -2.90 131799.50 443160.50 -2.90
131794.50 443160.50 -2.90 131794.50 443165.50 -2.90 131799.50 443165.50 -2.90 131799.50 443160.50 -2.90 131794.50 443160.50 -6.90 131794.50 443165.50 -6.90 131799.50 443165.50 -6.90 131799.50 443160.50 -6.90
131794.50 443160.50 -6.90 131794.50 443165.50 -6.90 131799.50 443165.50 -6.90 131799.50 443160.50 -6.90 131794.50 443160.50 -9.70 131794.50 443165.50 -9.70 131799.50 443165.50 -9.70 131799.50 443160.50 -9.70
131794.50 443160.50 -9.70 131794.50 443165.50 -9.70 131799.50 443165.50 -9.70 131799.50 443160.50 -9.70 131794.50 443160.50 -13.10 131794.50 443165.50 -13.10 131799.50 443165.50 -13.10 131799.50 443160.50 -13.10
131794.50 443160.50 -13.10 131794.50 443165.50 -13.10 131799.50 443165.50 -13.10 131799.50 443160.50 -13.10 131794.50 443160.50 -13.30 131794.50 443165.50 -13.30 131799.50 443165.50 -13.30 131799.50 443160.50 -13.30
131794.50 443160.50 -13.30 131794.50 443165.50 -13.30 131799.50 443165.50 -13.30 131799.50 443160.50 -13.30 131794.50 443160.50 -16.34 131794.50 443165.50 -16.34 131799.50 443165.50 -16.34 131799.50 443160.50 -16.34

CELLS 7 63
8 4 7 6 5 0 3 2 1
8 12 15 14 13 8 11 10 9
8 20 23 22 21 16 19 18 17
8 28 31 30 29 24 27 26 25
8 36 39 38 37 32 35 34 33
8 44 47 46 45 40 43 42 41
8 52 55 54 53 48 51 50 49

CELL_TYPES 7
12
12
12
12
12
12
12

CELL_DATA 7
SCALARS Property_0 float
LOOKUP_TABLE custom_table
6.00
7.00
4.00
4.00
5.00
3.00
5.00
