# vtk DataFile Version 1.0
B38F1291.vtk
ASCII

DATASET UNSTRUCTURED_GRID
POINTS 24 float
136860.50 443662.50 2.40 136860.50 443667.50 2.40 136865.50 443667.50 2.40 136865.50 443662.50 2.40 136860.50 443662.50 0.40 136860.50 443667.50 0.40 136865.50 443667.50 0.40 136865.50 443662.50 0.40
136860.50 443662.50 0.40 136860.50 443667.50 0.40 136865.50 443667.50 0.40 136865.50 443662.50 0.40 136860.50 443662.50 0.10 136860.50 443667.50 0.10 136865.50 443667.50 0.10 136865.50 443662.50 0.10
136860.50 443662.50 0.10 136860.50 443667.50 0.10 136865.50 443667.50 0.10 136865.50 443662.50 0.10 136860.50 443662.50 -0.36 136860.50 443667.50 -0.36 136865.50 443667.50 -0.36 136865.50 443662.50 -0.36

CELLS 3 27
8 4 7 6 5 0 3 2 1
8 12 15 14 13 8 11 10 9
8 20 23 22 21 16 19 18 17

CELL_TYPES 3
12
12
12

CELL_DATA 3
SCALARS Property_0 float
LOOKUP_TABLE custom_table
1.00
6.00
5.00
