# vtk DataFile Version 1.0
B38F1260.vtk
ASCII

DATASET UNSTRUCTURED_GRID
POINTS 80 float
130086.50 443268.50 0.80 130086.50 443273.50 0.80 130091.50 443273.50 0.80 130091.50 443268.50 0.80 130086.50 443268.50 -0.10 130086.50 443273.50 -0.10 130091.50 443273.50 -0.10 130091.50 443268.50 -0.10
130086.50 443268.50 -0.10 130086.50 443273.50 -0.10 130091.50 443273.50 -0.10 130091.50 443268.50 -0.10 130086.50 443268.50 -3.30 130086.50 443273.50 -3.30 130091.50 443273.50 -3.30 130091.50 443268.50 -3.30
130086.50 443268.50 -3.30 130086.50 443273.50 -3.30 130091.50 443273.50 -3.30 130091.50 443268.50 -3.30 130086.50 443268.50 -5.30 130086.50 443273.50 -5.30 130091.50 443273.50 -5.30 130091.50 443268.50 -5.30
130086.50 443268.50 -5.30 130086.50 443273.50 -5.30 130091.50 443273.50 -5.30 130091.50 443268.50 -5.30 130086.50 443268.50 -5.70 130086.50 443273.50 -5.70 130091.50 443273.50 -5.70 130091.50 443268.50 -5.70
130086.50 443268.50 -5.70 130086.50 443273.50 -5.70 130091.50 443273.50 -5.70 130091.50 443268.50 -5.70 130086.50 443268.50 -6.70 130086.50 443273.50 -6.70 130091.50 443273.50 -6.70 130091.50 443268.50 -6.70
130086.50 443268.50 -6.70 130086.50 443273.50 -6.70 130091.50 443273.50 -6.70 130091.50 443268.50 -6.70 130086.50 443268.50 -6.90 130086.50 443273.50 -6.90 130091.50 443273.50 -6.90 130091.50 443268.50 -6.90
130086.50 443268.50 -6.90 130086.50 443273.50 -6.90 130091.50 443273.50 -6.90 130091.50 443268.50 -6.90 130086.50 443268.50 -7.10 130086.50 443273.50 -7.10 130091.50 443273.50 -7.10 130091.50 443268.50 -7.10
130086.50 443268.50 -7.10 130086.50 443273.50 -7.10 130091.50 443273.50 -7.10 130091.50 443268.50 -7.10 130086.50 443268.50 -7.50 130086.50 443273.50 -7.50 130091.50 443273.50 -7.50 130091.50 443268.50 -7.50
130086.50 443268.50 -7.50 130086.50 443273.50 -7.50 130091.50 443273.50 -7.50 130091.50 443268.50 -7.50 130086.50 443268.50 -7.70 130086.50 443273.50 -7.70 130091.50 443273.50 -7.70 130091.50 443268.50 -7.70
130086.50 443268.50 -7.70 130086.50 443273.50 -7.70 130091.50 443273.50 -7.70 130091.50 443268.50 -7.70 130086.50 443268.50 -9.40 130086.50 443273.50 -9.40 130091.50 443273.50 -9.40 130091.50 443268.50 -9.40

CELLS 10 90
8 4 7 6 5 0 3 2 1
8 12 15 14 13 8 11 10 9
8 20 23 22 21 16 19 18 17
8 28 31 30 29 24 27 26 25
8 36 39 38 37 32 35 34 33
8 44 47 46 45 40 43 42 41
8 52 55 54 53 48 51 50 49
8 60 63 62 61 56 59 58 57
8 68 71 70 69 64 67 66 65
8 76 79 78 77 72 75 74 73

CELL_TYPES 10
12
12
12
12
12
12
12
12
12
12

CELL_DATA 10
SCALARS Property_0 float
LOOKUP_TABLE custom_table
6.00
1.00
6.00
1.00
3.00
6.00
1.00
1.00
6.00
4.00
