# vtk DataFile Version 1.0
B38F0737.vtk
ASCII

DATASET UNSTRUCTURED_GRID
POINTS 320 float
133527.50 442677.50 0.50 133527.50 442682.50 0.50 133532.50 442682.50 0.50 133532.50 442677.50 0.50 133527.50 442677.50 -4.50 133527.50 442682.50 -4.50 133532.50 442682.50 -4.50 133532.50 442677.50 -4.50
133527.50 442677.50 -4.50 133527.50 442682.50 -4.50 133532.50 442682.50 -4.50 133532.50 442677.50 -4.50 133527.50 442677.50 -8.50 133527.50 442682.50 -8.50 133532.50 442682.50 -8.50 133532.50 442677.50 -8.50
133527.50 442677.50 -8.50 133527.50 442682.50 -8.50 133532.50 442682.50 -8.50 133532.50 442677.50 -8.50 133527.50 442677.50 -11.50 133527.50 442682.50 -11.50 133532.50 442682.50 -11.50 133532.50 442677.50 -11.50
133527.50 442677.50 -11.50 133527.50 442682.50 -11.50 133532.50 442682.50 -11.50 133532.50 442677.50 -11.50 133527.50 442677.50 -23.50 133527.50 442682.50 -23.50 133532.50 442682.50 -23.50 133532.50 442677.50 -23.50
133527.50 442677.50 -23.50 133527.50 442682.50 -23.50 133532.50 442682.50 -23.50 133532.50 442677.50 -23.50 133527.50 442677.50 -24.50 133527.50 442682.50 -24.50 133532.50 442682.50 -24.50 133532.50 442677.50 -24.50
133527.50 442677.50 -24.50 133527.50 442682.50 -24.50 133532.50 442682.50 -24.50 133532.50 442677.50 -24.50 133527.50 442677.50 -30.50 133527.50 442682.50 -30.50 133532.50 442682.50 -30.50 133532.50 442677.50 -30.50
133527.50 442677.50 -30.50 133527.50 442682.50 -30.50 133532.50 442682.50 -30.50 133532.50 442677.50 -30.50 133527.50 442677.50 -34.50 133527.50 442682.50 -34.50 133532.50 442682.50 -34.50 133532.50 442677.50 -34.50
133527.50 442677.50 -34.50 133527.50 442682.50 -34.50 133532.50 442682.50 -34.50 133532.50 442677.50 -34.50 133527.50 442677.50 -40.50 133527.50 442682.50 -40.50 133532.50 442682.50 -40.50 133532.50 442677.50 -40.50
133527.50 442677.50 -40.50 133527.50 442682.50 -40.50 133532.50 442682.50 -40.50 133532.50 442677.50 -40.50 133527.50 442677.50 -41.50 133527.50 442682.50 -41.50 133532.50 442682.50 -41.50 133532.50 442677.50 -41.50
133527.50 442677.50 -41.50 133527.50 442682.50 -41.50 133532.50 442682.50 -41.50 133532.50 442677.50 -41.50 133527.50 442677.50 -43.50 133527.50 442682.50 -43.50 133532.50 442682.50 -43.50 133532.50 442677.50 -43.50
133527.50 442677.50 -43.50 133527.50 442682.50 -43.50 133532.50 442682.50 -43.50 133532.50 442677.50 -43.50 133527.50 442677.50 -56.50 133527.50 442682.50 -56.50 133532.50 442682.50 -56.50 133532.50 442677.50 -56.50
133527.50 442677.50 -56.50 133527.50 442682.50 -56.50 133532.50 442682.50 -56.50 133532.50 442677.50 -56.50 133527.50 442677.50 -64.50 133527.50 442682.50 -64.50 133532.50 442682.50 -64.50 133532.50 442677.50 -64.50
133527.50 442677.50 -64.50 133527.50 442682.50 -64.50 133532.50 442682.50 -64.50 133532.50 442677.50 -64.50 133527.50 442677.50 -65.50 133527.50 442682.50 -65.50 133532.50 442682.50 -65.50 133532.50 442677.50 -65.50
133527.50 442677.50 -65.50 133527.50 442682.50 -65.50 133532.50 442682.50 -65.50 133532.50 442677.50 -65.50 133527.50 442677.50 -66.50 133527.50 442682.50 -66.50 133532.50 442682.50 -66.50 133532.50 442677.50 -66.50
133527.50 442677.50 -66.50 133527.50 442682.50 -66.50 133532.50 442682.50 -66.50 133532.50 442677.50 -66.50 133527.50 442677.50 -67.50 133527.50 442682.50 -67.50 133532.50 442682.50 -67.50 133532.50 442677.50 -67.50
133527.50 442677.50 -67.50 133527.50 442682.50 -67.50 133532.50 442682.50 -67.50 133532.50 442677.50 -67.50 133527.50 442677.50 -69.50 133527.50 442682.50 -69.50 133532.50 442682.50 -69.50 133532.50 442677.50 -69.50
133527.50 442677.50 -69.50 133527.50 442682.50 -69.50 133532.50 442682.50 -69.50 133532.50 442677.50 -69.50 133527.50 442677.50 -70.50 133527.50 442682.50 -70.50 133532.50 442682.50 -70.50 133532.50 442677.50 -70.50
133527.50 442677.50 -70.50 133527.50 442682.50 -70.50 133532.50 442682.50 -70.50 133532.50 442677.50 -70.50 133527.50 442677.50 -71.50 133527.50 442682.50 -71.50 133532.50 442682.50 -71.50 133532.50 442677.50 -71.50
133527.50 442677.50 -71.50 133527.50 442682.50 -71.50 133532.50 442682.50 -71.50 133532.50 442677.50 -71.50 133527.50 442677.50 -74.50 133527.50 442682.50 -74.50 133532.50 442682.50 -74.50 133532.50 442677.50 -74.50
133527.50 442677.50 -74.50 133527.50 442682.50 -74.50 133532.50 442682.50 -74.50 133532.50 442677.50 -74.50 133527.50 442677.50 -75.50 133527.50 442682.50 -75.50 133532.50 442682.50 -75.50 133532.50 442677.50 -75.50
133527.50 442677.50 -75.50 133527.50 442682.50 -75.50 133532.50 442682.50 -75.50 133532.50 442677.50 -75.50 133527.50 442677.50 -79.50 133527.50 442682.50 -79.50 133532.50 442682.50 -79.50 133532.50 442677.50 -79.50
133527.50 442677.50 -79.50 133527.50 442682.50 -79.50 133532.50 442682.50 -79.50 133532.50 442677.50 -79.50 133527.50 442677.50 -81.50 133527.50 442682.50 -81.50 133532.50 442682.50 -81.50 133532.50 442677.50 -81.50
133527.50 442677.50 -81.50 133527.50 442682.50 -81.50 133532.50 442682.50 -81.50 133532.50 442677.50 -81.50 133527.50 442677.50 -98.50 133527.50 442682.50 -98.50 133532.50 442682.50 -98.50 133532.50 442677.50 -98.50
133527.50 442677.50 -98.50 133527.50 442682.50 -98.50 133532.50 442682.50 -98.50 133532.50 442677.50 -98.50 133527.50 442677.50 -106.50 133527.50 442682.50 -106.50 133532.50 442682.50 -106.50 133532.50 442677.50 -106.50
133527.50 442677.50 -106.50 133527.50 442682.50 -106.50 133532.50 442682.50 -106.50 133532.50 442677.50 -106.50 133527.50 442677.50 -109.50 133527.50 442682.50 -109.50 133532.50 442682.50 -109.50 133532.50 442677.50 -109.50
133527.50 442677.50 -109.50 133527.50 442682.50 -109.50 133532.50 442682.50 -109.50 133532.50 442677.50 -109.50 133527.50 442677.50 -118.50 133527.50 442682.50 -118.50 133532.50 442682.50 -118.50 133532.50 442677.50 -118.50
133527.50 442677.50 -118.50 133527.50 442682.50 -118.50 133532.50 442682.50 -118.50 133532.50 442677.50 -118.50 133527.50 442677.50 -119.50 133527.50 442682.50 -119.50 133532.50 442682.50 -119.50 133532.50 442677.50 -119.50
133527.50 442677.50 -119.50 133527.50 442682.50 -119.50 133532.50 442682.50 -119.50 133532.50 442677.50 -119.50 133527.50 442677.50 -123.50 133527.50 442682.50 -123.50 133532.50 442682.50 -123.50 133532.50 442677.50 -123.50
133527.50 442677.50 -123.50 133527.50 442682.50 -123.50 133532.50 442682.50 -123.50 133532.50 442677.50 -123.50 133527.50 442677.50 -139.50 133527.50 442682.50 -139.50 133532.50 442682.50 -139.50 133532.50 442677.50 -139.50
133527.50 442677.50 -139.50 133527.50 442682.50 -139.50 133532.50 442682.50 -139.50 133532.50 442677.50 -139.50 133527.50 442677.50 -144.50 133527.50 442682.50 -144.50 133532.50 442682.50 -144.50 133532.50 442677.50 -144.50
133527.50 442677.50 -144.50 133527.50 442682.50 -144.50 133532.50 442682.50 -144.50 133532.50 442677.50 -144.50 133527.50 442677.50 -145.50 133527.50 442682.50 -145.50 133532.50 442682.50 -145.50 133532.50 442677.50 -145.50
133527.50 442677.50 -145.50 133527.50 442682.50 -145.50 133532.50 442682.50 -145.50 133532.50 442677.50 -145.50 133527.50 442677.50 -148.50 133527.50 442682.50 -148.50 133532.50 442682.50 -148.50 133532.50 442677.50 -148.50
133527.50 442677.50 -148.50 133527.50 442682.50 -148.50 133532.50 442682.50 -148.50 133532.50 442677.50 -148.50 133527.50 442677.50 -150.50 133527.50 442682.50 -150.50 133532.50 442682.50 -150.50 133532.50 442677.50 -150.50
133527.50 442677.50 -150.50 133527.50 442682.50 -150.50 133532.50 442682.50 -150.50 133532.50 442677.50 -150.50 133527.50 442677.50 -153.50 133527.50 442682.50 -153.50 133532.50 442682.50 -153.50 133532.50 442677.50 -153.50
133527.50 442677.50 -153.50 133527.50 442682.50 -153.50 133532.50 442682.50 -153.50 133532.50 442677.50 -153.50 133527.50 442677.50 -157.50 133527.50 442682.50 -157.50 133532.50 442682.50 -157.50 133532.50 442677.50 -157.50
133527.50 442677.50 -157.50 133527.50 442682.50 -157.50 133532.50 442682.50 -157.50 133532.50 442677.50 -157.50 133527.50 442677.50 -158.50 133527.50 442682.50 -158.50 133532.50 442682.50 -158.50 133532.50 442677.50 -158.50
133527.50 442677.50 -158.50 133527.50 442682.50 -158.50 133532.50 442682.50 -158.50 133532.50 442677.50 -158.50 133527.50 442677.50 -160.50 133527.50 442682.50 -160.50 133532.50 442682.50 -160.50 133532.50 442677.50 -160.50
133527.50 442677.50 -160.50 133527.50 442682.50 -160.50 133532.50 442682.50 -160.50 133532.50 442677.50 -160.50 133527.50 442677.50 -162.50 133527.50 442682.50 -162.50 133532.50 442682.50 -162.50 133532.50 442677.50 -162.50
133527.50 442677.50 -162.50 133527.50 442682.50 -162.50 133532.50 442682.50 -162.50 133532.50 442677.50 -162.50 133527.50 442677.50 -163.50 133527.50 442682.50 -163.50 133532.50 442682.50 -163.50 133532.50 442677.50 -163.50
133527.50 442677.50 -163.50 133527.50 442682.50 -163.50 133532.50 442682.50 -163.50 133532.50 442677.50 -163.50 133527.50 442677.50 -196.30 133527.50 442682.50 -196.30 133532.50 442682.50 -196.30 133532.50 442677.50 -196.30

CELLS 40 360
8 4 7 6 5 0 3 2 1
8 12 15 14 13 8 11 10 9
8 20 23 22 21 16 19 18 17
8 28 31 30 29 24 27 26 25
8 36 39 38 37 32 35 34 33
8 44 47 46 45 40 43 42 41
8 52 55 54 53 48 51 50 49
8 60 63 62 61 56 59 58 57
8 68 71 70 69 64 67 66 65
8 76 79 78 77 72 75 74 73
8 84 87 86 85 80 83 82 81
8 92 95 94 93 88 91 90 89
8 100 103 102 101 96 99 98 97
8 108 111 110 109 104 107 106 105
8 116 119 118 117 112 115 114 113
8 124 127 126 125 120 123 122 121
8 132 135 134 133 128 131 130 129
8 140 143 142 141 136 139 138 137
8 148 151 150 149 144 147 146 145
8 156 159 158 157 152 155 154 153
8 164 167 166 165 160 163 162 161
8 172 175 174 173 168 171 170 169
8 180 183 182 181 176 179 178 177
8 188 191 190 189 184 187 186 185
8 196 199 198 197 192 195 194 193
8 204 207 206 205 200 203 202 201
8 212 215 214 213 208 211 210 209
8 220 223 222 221 216 219 218 217
8 228 231 230 229 224 227 226 225
8 236 239 238 237 232 235 234 233
8 244 247 246 245 240 243 242 241
8 252 255 254 253 248 251 250 249
8 260 263 262 261 256 259 258 257
8 268 271 270 269 264 267 266 265
8 276 279 278 277 272 275 274 273
8 284 287 286 285 280 283 282 281
8 292 295 294 293 288 291 290 289
8 300 303 302 301 296 299 298 297
8 308 311 310 309 304 307 306 305
8 316 319 318 317 312 315 314 313

CELL_TYPES 40
12
12
12
12
12
12
12
12
12
12
12
12
12
12
12
12
12
12
12
12
12
12
12
12
12
12
12
12
12
12
12
12
12
12
12
12
12
12
12
12

CELL_DATA 40
SCALARS Property_0 float
LOOKUP_TABLE custom_table
1.00
6.00
4.00
5.00
4.00
5.00
5.00
4.00
5.00
4.00
5.00
4.00
6.00
1.00
6.00
4.00
6.00
1.00
6.00
4.00
5.00
4.00
5.00
1.00
6.00
5.00
4.00
5.00
4.00
6.00
0.00
1.00
6.00
5.00
4.00
1.00
4.00
1.00
5.00
4.00
