# vtk DataFile Version 1.0
B38F1709.vtk
ASCII

DATASET UNSTRUCTURED_GRID
POINTS 88 float
137666.50 444149.50 4.46 137666.50 444154.50 4.46 137671.50 444154.50 4.46 137671.50 444149.50 4.46 137666.50 444149.50 4.26 137666.50 444154.50 4.26 137671.50 444154.50 4.26 137671.50 444149.50 4.26
137666.50 444149.50 4.26 137666.50 444154.50 4.26 137671.50 444154.50 4.26 137671.50 444149.50 4.26 137666.50 444149.50 3.16 137666.50 444154.50 3.16 137671.50 444154.50 3.16 137671.50 444149.50 3.16
137666.50 444149.50 3.16 137666.50 444154.50 3.16 137671.50 444154.50 3.16 137671.50 444149.50 3.16 137666.50 444149.50 2.08 137666.50 444154.50 2.08 137671.50 444154.50 2.08 137671.50 444149.50 2.08
137666.50 444149.50 2.08 137666.50 444154.50 2.08 137671.50 444154.50 2.08 137671.50 444149.50 2.08 137666.50 444149.50 1.48 137666.50 444154.50 1.48 137671.50 444154.50 1.48 137671.50 444149.50 1.48
137666.50 444149.50 1.48 137666.50 444154.50 1.48 137671.50 444154.50 1.48 137671.50 444149.50 1.48 137666.50 444149.50 -0.94 137666.50 444154.50 -0.94 137671.50 444154.50 -0.94 137671.50 444149.50 -0.94
137666.50 444149.50 -0.94 137666.50 444154.50 -0.94 137671.50 444154.50 -0.94 137671.50 444149.50 -0.94 137666.50 444149.50 -1.20 137666.50 444154.50 -1.20 137671.50 444154.50 -1.20 137671.50 444149.50 -1.20
137666.50 444149.50 -1.20 137666.50 444154.50 -1.20 137671.50 444154.50 -1.20 137671.50 444149.50 -1.20 137666.50 444149.50 -3.24 137666.50 444154.50 -3.24 137671.50 444154.50 -3.24 137671.50 444149.50 -3.24
137666.50 444149.50 -3.24 137666.50 444154.50 -3.24 137671.50 444154.50 -3.24 137671.50 444149.50 -3.24 137666.50 444149.50 -4.31 137666.50 444154.50 -4.31 137671.50 444154.50 -4.31 137671.50 444149.50 -4.31
137666.50 444149.50 -4.31 137666.50 444154.50 -4.31 137671.50 444154.50 -4.31 137671.50 444149.50 -4.31 137666.50 444149.50 -4.68 137666.50 444154.50 -4.68 137671.50 444154.50 -4.68 137671.50 444149.50 -4.68
137666.50 444149.50 -4.68 137666.50 444154.50 -4.68 137671.50 444154.50 -4.68 137671.50 444149.50 -4.68 137666.50 444149.50 -5.03 137666.50 444154.50 -5.03 137671.50 444154.50 -5.03 137671.50 444149.50 -5.03
137666.50 444149.50 -5.03 137666.50 444154.50 -5.03 137671.50 444154.50 -5.03 137671.50 444149.50 -5.03 137666.50 444149.50 -6.93 137666.50 444154.50 -6.93 137671.50 444154.50 -6.93 137671.50 444149.50 -6.93

CELLS 11 99
8 4 7 6 5 0 3 2 1
8 12 15 14 13 8 11 10 9
8 20 23 22 21 16 19 18 17
8 28 31 30 29 24 27 26 25
8 36 39 38 37 32 35 34 33
8 44 47 46 45 40 43 42 41
8 52 55 54 53 48 51 50 49
8 60 63 62 61 56 59 58 57
8 68 71 70 69 64 67 66 65
8 76 79 78 77 72 75 74 73
8 84 87 86 85 80 83 82 81

CELL_TYPES 11
12
12
12
12
12
12
12
12
12
12
12

CELL_DATA 11
SCALARS Property_0 float
LOOKUP_TABLE custom_table
1.00
6.00
1.00
6.00
0.00
1.00
0.00
3.00
1.00
0.00
0.00
