# vtk DataFile Version 1.0
B38F0224.vtk
ASCII

DATASET UNSTRUCTURED_GRID
POINTS 56 float
131847.50 443517.50 2.20 131847.50 443522.50 2.20 131852.50 443522.50 2.20 131852.50 443517.50 2.20 131847.50 443517.50 1.60 131847.50 443522.50 1.60 131852.50 443522.50 1.60 131852.50 443517.50 1.60
131847.50 443517.50 1.60 131847.50 443522.50 1.60 131852.50 443522.50 1.60 131852.50 443517.50 1.60 131847.50 443517.50 1.20 131847.50 443522.50 1.20 131852.50 443522.50 1.20 131852.50 443517.50 1.20
131847.50 443517.50 1.20 131847.50 443522.50 1.20 131852.50 443522.50 1.20 131852.50 443517.50 1.20 131847.50 443517.50 0.70 131847.50 443522.50 0.70 131852.50 443522.50 0.70 131852.50 443517.50 0.70
131847.50 443517.50 0.70 131847.50 443522.50 0.70 131852.50 443522.50 0.70 131852.50 443517.50 0.70 131847.50 443517.50 0.20 131847.50 443522.50 0.20 131852.50 443522.50 0.20 131852.50 443517.50 0.20
131847.50 443517.50 0.20 131847.50 443522.50 0.20 131852.50 443522.50 0.20 131852.50 443517.50 0.20 131847.50 443517.50 -3.50 131847.50 443522.50 -3.50 131852.50 443522.50 -3.50 131852.50 443517.50 -3.50
131847.50 443517.50 -3.50 131847.50 443522.50 -3.50 131852.50 443522.50 -3.50 131852.50 443517.50 -3.50 131847.50 443517.50 -8.00 131847.50 443522.50 -8.00 131852.50 443522.50 -8.00 131852.50 443517.50 -8.00
131847.50 443517.50 -8.00 131847.50 443522.50 -8.00 131852.50 443522.50 -8.00 131852.50 443517.50 -8.00 131847.50 443517.50 -10.04 131847.50 443522.50 -10.04 131852.50 443522.50 -10.04 131852.50 443517.50 -10.04

CELLS 7 63
8 4 7 6 5 0 3 2 1
8 12 15 14 13 8 11 10 9
8 20 23 22 21 16 19 18 17
8 28 31 30 29 24 27 26 25
8 36 39 38 37 32 35 34 33
8 44 47 46 45 40 43 42 41
8 52 55 54 53 48 51 50 49

CELL_TYPES 7
12
12
12
12
12
12
12

CELL_DATA 7
SCALARS Property_0 float
LOOKUP_TABLE custom_table
1.00
6.00
7.00
1.00
7.00
1.00
8.00
