# vtk DataFile Version 1.0
B38F0326.vtk
ASCII

DATASET UNSTRUCTURED_GRID
POINTS 72 float
137701.50 444519.50 2.65 137701.50 444524.50 2.65 137706.50 444524.50 2.65 137706.50 444519.50 2.65 137701.50 444519.50 2.35 137701.50 444524.50 2.35 137706.50 444524.50 2.35 137706.50 444519.50 2.35
137701.50 444519.50 2.35 137701.50 444524.50 2.35 137706.50 444524.50 2.35 137706.50 444519.50 2.35 137701.50 444519.50 1.95 137701.50 444524.50 1.95 137706.50 444524.50 1.95 137706.50 444519.50 1.95
137701.50 444519.50 1.95 137701.50 444524.50 1.95 137706.50 444524.50 1.95 137706.50 444519.50 1.95 137701.50 444519.50 1.55 137701.50 444524.50 1.55 137706.50 444524.50 1.55 137706.50 444519.50 1.55
137701.50 444519.50 1.55 137701.50 444524.50 1.55 137706.50 444524.50 1.55 137706.50 444519.50 1.55 137701.50 444519.50 1.45 137701.50 444524.50 1.45 137706.50 444524.50 1.45 137706.50 444519.50 1.45
137701.50 444519.50 1.45 137701.50 444524.50 1.45 137706.50 444524.50 1.45 137706.50 444519.50 1.45 137701.50 444519.50 1.15 137701.50 444524.50 1.15 137706.50 444524.50 1.15 137706.50 444519.50 1.15
137701.50 444519.50 1.15 137701.50 444524.50 1.15 137706.50 444524.50 1.15 137706.50 444519.50 1.15 137701.50 444519.50 0.95 137701.50 444524.50 0.95 137706.50 444524.50 0.95 137706.50 444519.50 0.95
137701.50 444519.50 0.95 137701.50 444524.50 0.95 137706.50 444524.50 0.95 137706.50 444519.50 0.95 137701.50 444519.50 -4.75 137701.50 444524.50 -4.75 137706.50 444524.50 -4.75 137706.50 444519.50 -4.75
137701.50 444519.50 -4.75 137701.50 444524.50 -4.75 137706.50 444524.50 -4.75 137706.50 444519.50 -4.75 137701.50 444519.50 -5.25 137701.50 444524.50 -5.25 137706.50 444524.50 -5.25 137706.50 444519.50 -5.25
137701.50 444519.50 -5.25 137701.50 444524.50 -5.25 137706.50 444524.50 -5.25 137706.50 444519.50 -5.25 137701.50 444519.50 -6.83 137701.50 444524.50 -6.83 137706.50 444524.50 -6.83 137706.50 444519.50 -6.83

CELLS 9 81
8 4 7 6 5 0 3 2 1
8 12 15 14 13 8 11 10 9
8 20 23 22 21 16 19 18 17
8 28 31 30 29 24 27 26 25
8 36 39 38 37 32 35 34 33
8 44 47 46 45 40 43 42 41
8 52 55 54 53 48 51 50 49
8 60 63 62 61 56 59 58 57
8 68 71 70 69 64 67 66 65

CELL_TYPES 9
12
12
12
12
12
12
12
12
12

CELL_DATA 9
SCALARS Property_0 float
LOOKUP_TABLE custom_table
1.00
6.00
5.00
6.00
5.00
6.00
5.00
3.00
6.00
