# vtk DataFile Version 1.0
B38F1787.vtk
ASCII

DATASET UNSTRUCTURED_GRID
POINTS 40 float
130939.50 441824.50 2.00 130939.50 441829.50 2.00 130944.50 441829.50 2.00 130944.50 441824.50 2.00 130939.50 441824.50 1.35 130939.50 441829.50 1.35 130944.50 441829.50 1.35 130944.50 441824.50 1.35
130939.50 441824.50 1.35 130939.50 441829.50 1.35 130944.50 441829.50 1.35 130944.50 441824.50 1.35 130939.50 441824.50 0.02 130939.50 441829.50 0.02 130944.50 441829.50 0.02 130944.50 441824.50 0.02
130939.50 441824.50 0.02 130939.50 441829.50 0.02 130944.50 441829.50 0.02 130944.50 441824.50 0.02 130939.50 441824.50 -3.44 130939.50 441829.50 -3.44 130944.50 441829.50 -3.44 130944.50 441824.50 -3.44
130939.50 441824.50 -3.44 130939.50 441829.50 -3.44 130944.50 441829.50 -3.44 130944.50 441824.50 -3.44 130939.50 441824.50 -8.45 130939.50 441829.50 -8.45 130944.50 441829.50 -8.45 130944.50 441824.50 -8.45
130939.50 441824.50 -8.45 130939.50 441829.50 -8.45 130944.50 441829.50 -8.45 130944.50 441824.50 -8.45 130939.50 441824.50 -10.54 130939.50 441829.50 -10.54 130944.50 441829.50 -10.54 130944.50 441824.50 -10.54

CELLS 5 45
8 4 7 6 5 0 3 2 1
8 12 15 14 13 8 11 10 9
8 20 23 22 21 16 19 18 17
8 28 31 30 29 24 27 26 25
8 36 39 38 37 32 35 34 33

CELL_TYPES 5
12
12
12
12
12

CELL_DATA 5
SCALARS Property_0 float
LOOKUP_TABLE custom_table
0.00
6.00
1.00
0.00
0.00
