# vtk DataFile Version 1.0
B38F1794.vtk
ASCII

DATASET UNSTRUCTURED_GRID
POINTS 64 float
131389.50 442222.50 1.62 131389.50 442227.50 1.62 131394.50 442227.50 1.62 131394.50 442222.50 1.62 131389.50 442222.50 0.52 131389.50 442227.50 0.52 131394.50 442227.50 0.52 131394.50 442222.50 0.52
131389.50 442222.50 0.52 131389.50 442227.50 0.52 131394.50 442227.50 0.52 131394.50 442222.50 0.52 131389.50 442222.50 0.07 131389.50 442227.50 0.07 131394.50 442227.50 0.07 131394.50 442222.50 0.07
131389.50 442222.50 0.07 131389.50 442227.50 0.07 131394.50 442227.50 0.07 131394.50 442222.50 0.07 131389.50 442222.50 -2.72 131389.50 442227.50 -2.72 131394.50 442227.50 -2.72 131394.50 442222.50 -2.72
131389.50 442222.50 -2.72 131389.50 442227.50 -2.72 131394.50 442227.50 -2.72 131394.50 442222.50 -2.72 131389.50 442222.50 -4.01 131389.50 442227.50 -4.01 131394.50 442227.50 -4.01 131394.50 442222.50 -4.01
131389.50 442222.50 -4.01 131389.50 442227.50 -4.01 131394.50 442227.50 -4.01 131394.50 442222.50 -4.01 131389.50 442222.50 -5.23 131389.50 442227.50 -5.23 131394.50 442227.50 -5.23 131394.50 442222.50 -5.23
131389.50 442222.50 -5.23 131389.50 442227.50 -5.23 131394.50 442227.50 -5.23 131394.50 442222.50 -5.23 131389.50 442222.50 -5.75 131389.50 442227.50 -5.75 131394.50 442227.50 -5.75 131394.50 442222.50 -5.75
131389.50 442222.50 -5.75 131389.50 442227.50 -5.75 131394.50 442227.50 -5.75 131394.50 442222.50 -5.75 131389.50 442222.50 -6.97 131389.50 442227.50 -6.97 131394.50 442227.50 -6.97 131394.50 442222.50 -6.97
131389.50 442222.50 -6.97 131389.50 442227.50 -6.97 131394.50 442227.50 -6.97 131394.50 442222.50 -6.97 131389.50 442222.50 -8.69 131389.50 442227.50 -8.69 131394.50 442227.50 -8.69 131394.50 442222.50 -8.69

CELLS 8 72
8 4 7 6 5 0 3 2 1
8 12 15 14 13 8 11 10 9
8 20 23 22 21 16 19 18 17
8 28 31 30 29 24 27 26 25
8 36 39 38 37 32 35 34 33
8 44 47 46 45 40 43 42 41
8 52 55 54 53 48 51 50 49
8 60 63 62 61 56 59 58 57

CELL_TYPES 8
12
12
12
12
12
12
12
12

CELL_DATA 8
SCALARS Property_0 float
LOOKUP_TABLE custom_table
1.00
6.00
1.00
3.00
1.00
6.00
1.00
0.00
