# vtk DataFile Version 1.0
B38F1367.vtk
ASCII

DATASET UNSTRUCTURED_GRID
POINTS 32 float
130477.50 445843.50 -0.25 130477.50 445848.50 -0.25 130482.50 445848.50 -0.25 130482.50 445843.50 -0.25 130477.50 445843.50 -1.15 130477.50 445848.50 -1.15 130482.50 445848.50 -1.15 130482.50 445843.50 -1.15
130477.50 445843.50 -1.15 130477.50 445848.50 -1.15 130482.50 445848.50 -1.15 130482.50 445843.50 -1.15 130477.50 445843.50 -3.75 130477.50 445848.50 -3.75 130482.50 445848.50 -3.75 130482.50 445843.50 -3.75
130477.50 445843.50 -3.75 130477.50 445848.50 -3.75 130482.50 445848.50 -3.75 130482.50 445843.50 -3.75 130477.50 445843.50 -5.90 130477.50 445848.50 -5.90 130482.50 445848.50 -5.90 130482.50 445843.50 -5.90
130477.50 445843.50 -5.90 130477.50 445848.50 -5.90 130482.50 445848.50 -5.90 130482.50 445843.50 -5.90 130477.50 445843.50 -7.03 130477.50 445848.50 -7.03 130482.50 445848.50 -7.03 130482.50 445843.50 -7.03

CELLS 4 36
8 4 7 6 5 0 3 2 1
8 12 15 14 13 8 11 10 9
8 20 23 22 21 16 19 18 17
8 28 31 30 29 24 27 26 25

CELL_TYPES 4
12
12
12
12

CELL_DATA 4
SCALARS Property_0 float
LOOKUP_TABLE custom_table
6.00
3.00
6.00
0.00
