# vtk DataFile Version 1.0
B38F1270.vtk
ASCII

DATASET UNSTRUCTURED_GRID
POINTS 40 float
133266.50 443823.50 2.30 133266.50 443828.50 2.30 133271.50 443828.50 2.30 133271.50 443823.50 2.30 133266.50 443823.50 1.80 133266.50 443828.50 1.80 133271.50 443828.50 1.80 133271.50 443823.50 1.80
133266.50 443823.50 1.80 133266.50 443828.50 1.80 133271.50 443828.50 1.80 133271.50 443823.50 1.80 133266.50 443823.50 1.40 133266.50 443828.50 1.40 133271.50 443828.50 1.40 133271.50 443823.50 1.40
133266.50 443823.50 1.40 133266.50 443828.50 1.40 133271.50 443828.50 1.40 133271.50 443823.50 1.40 133266.50 443823.50 0.20 133266.50 443828.50 0.20 133271.50 443828.50 0.20 133271.50 443823.50 0.20
133266.50 443823.50 0.20 133266.50 443828.50 0.20 133271.50 443828.50 0.20 133271.50 443823.50 0.20 133266.50 443823.50 -1.00 133266.50 443828.50 -1.00 133271.50 443828.50 -1.00 133271.50 443823.50 -1.00
133266.50 443823.50 -1.00 133266.50 443828.50 -1.00 133271.50 443828.50 -1.00 133271.50 443823.50 -1.00 133266.50 443823.50 -1.66 133266.50 443828.50 -1.66 133271.50 443828.50 -1.66 133271.50 443823.50 -1.66

CELLS 5 45
8 4 7 6 5 0 3 2 1
8 12 15 14 13 8 11 10 9
8 20 23 22 21 16 19 18 17
8 28 31 30 29 24 27 26 25
8 36 39 38 37 32 35 34 33

CELL_TYPES 5
12
12
12
12
12

CELL_DATA 5
SCALARS Property_0 float
LOOKUP_TABLE custom_table
6.00
7.00
4.00
7.00
4.00
