# vtk DataFile Version 1.0
B38F1237.vtk
ASCII

DATASET UNSTRUCTURED_GRID
POINTS 40 float
136771.50 442973.50 0.95 136771.50 442978.50 0.95 136776.50 442978.50 0.95 136776.50 442973.50 0.95 136771.50 442973.50 0.15 136771.50 442978.50 0.15 136776.50 442978.50 0.15 136776.50 442973.50 0.15
136771.50 442973.50 0.15 136771.50 442978.50 0.15 136776.50 442978.50 0.15 136776.50 442973.50 0.15 136771.50 442973.50 -0.75 136771.50 442978.50 -0.75 136776.50 442978.50 -0.75 136776.50 442973.50 -0.75
136771.50 442973.50 -0.75 136771.50 442978.50 -0.75 136776.50 442978.50 -0.75 136776.50 442973.50 -0.75 136771.50 442973.50 -1.45 136771.50 442978.50 -1.45 136776.50 442978.50 -1.45 136776.50 442973.50 -1.45
136771.50 442973.50 -1.45 136771.50 442978.50 -1.45 136776.50 442978.50 -1.45 136776.50 442973.50 -1.45 136771.50 442973.50 -2.95 136771.50 442978.50 -2.95 136776.50 442978.50 -2.95 136776.50 442973.50 -2.95
136771.50 442973.50 -2.95 136771.50 442978.50 -2.95 136776.50 442978.50 -2.95 136776.50 442973.50 -2.95 136771.50 442973.50 -3.73 136771.50 442978.50 -3.73 136776.50 442978.50 -3.73 136776.50 442973.50 -3.73

CELLS 5 45
8 4 7 6 5 0 3 2 1
8 12 15 14 13 8 11 10 9
8 20 23 22 21 16 19 18 17
8 28 31 30 29 24 27 26 25
8 36 39 38 37 32 35 34 33

CELL_TYPES 5
12
12
12
12
12

CELL_DATA 5
SCALARS Property_0 float
LOOKUP_TABLE custom_table
6.00
1.00
3.00
6.00
8.00
