# vtk DataFile Version 1.0
B38F1987.vtk
ASCII

DATASET UNSTRUCTURED_GRID
POINTS 56 float
131285.50 442030.50 2.52 131285.50 442035.50 2.52 131290.50 442035.50 2.52 131290.50 442030.50 2.52 131285.50 442030.50 2.27 131285.50 442035.50 2.27 131290.50 442035.50 2.27 131290.50 442030.50 2.27
131285.50 442030.50 2.27 131285.50 442035.50 2.27 131290.50 442035.50 2.27 131290.50 442030.50 2.27 131285.50 442030.50 2.07 131285.50 442035.50 2.07 131290.50 442035.50 2.07 131290.50 442030.50 2.07
131285.50 442030.50 2.07 131285.50 442035.50 2.07 131290.50 442035.50 2.07 131290.50 442030.50 2.07 131285.50 442030.50 1.72 131285.50 442035.50 1.72 131290.50 442035.50 1.72 131290.50 442030.50 1.72
131285.50 442030.50 1.72 131285.50 442035.50 1.72 131290.50 442035.50 1.72 131290.50 442030.50 1.72 131285.50 442030.50 0.62 131285.50 442035.50 0.62 131290.50 442035.50 0.62 131290.50 442030.50 0.62
131285.50 442030.50 0.62 131285.50 442035.50 0.62 131290.50 442035.50 0.62 131290.50 442030.50 0.62 131285.50 442030.50 -8.28 131285.50 442035.50 -8.28 131290.50 442035.50 -8.28 131290.50 442030.50 -8.28
131285.50 442030.50 -8.28 131285.50 442035.50 -8.28 131290.50 442035.50 -8.28 131290.50 442030.50 -8.28 131285.50 442030.50 -9.48 131285.50 442035.50 -9.48 131290.50 442035.50 -9.48 131290.50 442030.50 -9.48
131285.50 442030.50 -9.48 131285.50 442035.50 -9.48 131290.50 442035.50 -9.48 131290.50 442030.50 -9.48 131285.50 442030.50 -11.88 131285.50 442035.50 -11.88 131290.50 442035.50 -11.88 131290.50 442030.50 -11.88

CELLS 7 63
8 4 7 6 5 0 3 2 1
8 12 15 14 13 8 11 10 9
8 20 23 22 21 16 19 18 17
8 28 31 30 29 24 27 26 25
8 36 39 38 37 32 35 34 33
8 44 47 46 45 40 43 42 41
8 52 55 54 53 48 51 50 49

CELL_TYPES 7
12
12
12
12
12
12
12

CELL_DATA 7
SCALARS Property_0 float
LOOKUP_TABLE custom_table
4.00
0.00
4.00
6.00
4.00
5.00
5.00
