# vtk DataFile Version 1.0
B38F0250.vtk
ASCII

DATASET UNSTRUCTURED_GRID
POINTS 64 float
134013.50 442927.50 0.50 134013.50 442932.50 0.50 134018.50 442932.50 0.50 134018.50 442927.50 0.50 134013.50 442927.50 -0.70 134013.50 442932.50 -0.70 134018.50 442932.50 -0.70 134018.50 442927.50 -0.70
134013.50 442927.50 -0.70 134013.50 442932.50 -0.70 134018.50 442932.50 -0.70 134018.50 442927.50 -0.70 134013.50 442927.50 -2.90 134013.50 442932.50 -2.90 134018.50 442932.50 -2.90 134018.50 442927.50 -2.90
134013.50 442927.50 -2.90 134013.50 442932.50 -2.90 134018.50 442932.50 -2.90 134018.50 442927.50 -2.90 134013.50 442927.50 -3.20 134013.50 442932.50 -3.20 134018.50 442932.50 -3.20 134018.50 442927.50 -3.20
134013.50 442927.50 -3.20 134013.50 442932.50 -3.20 134018.50 442932.50 -3.20 134018.50 442927.50 -3.20 134013.50 442927.50 -4.70 134013.50 442932.50 -4.70 134018.50 442932.50 -4.70 134018.50 442927.50 -4.70
134013.50 442927.50 -4.70 134013.50 442932.50 -4.70 134018.50 442932.50 -4.70 134018.50 442927.50 -4.70 134013.50 442927.50 -6.50 134013.50 442932.50 -6.50 134018.50 442932.50 -6.50 134018.50 442927.50 -6.50
134013.50 442927.50 -6.50 134013.50 442932.50 -6.50 134018.50 442932.50 -6.50 134018.50 442927.50 -6.50 134013.50 442927.50 -8.70 134013.50 442932.50 -8.70 134018.50 442932.50 -8.70 134018.50 442927.50 -8.70
134013.50 442927.50 -8.70 134013.50 442932.50 -8.70 134018.50 442932.50 -8.70 134018.50 442927.50 -8.70 134013.50 442927.50 -11.00 134013.50 442932.50 -11.00 134018.50 442932.50 -11.00 134018.50 442927.50 -11.00
134013.50 442927.50 -11.00 134013.50 442932.50 -11.00 134018.50 442932.50 -11.00 134018.50 442927.50 -11.00 134013.50 442927.50 -13.30 134013.50 442932.50 -13.30 134018.50 442932.50 -13.30 134018.50 442927.50 -13.30

CELLS 8 72
8 4 7 6 5 0 3 2 1
8 12 15 14 13 8 11 10 9
8 20 23 22 21 16 19 18 17
8 28 31 30 29 24 27 26 25
8 36 39 38 37 32 35 34 33
8 44 47 46 45 40 43 42 41
8 52 55 54 53 48 51 50 49
8 60 63 62 61 56 59 58 57

CELL_TYPES 8
12
12
12
12
12
12
12
12

CELL_DATA 8
SCALARS Property_0 float
LOOKUP_TABLE custom_table
1.00
3.00
7.00
4.00
3.00
6.00
4.00
5.00
