# vtk DataFile Version 1.0
B38F0273.vtk
ASCII

DATASET UNSTRUCTURED_GRID
POINTS 120 float
137707.50 444847.50 2.55 137707.50 444852.50 2.55 137712.50 444852.50 2.55 137712.50 444847.50 2.55 137707.50 444847.50 -0.95 137707.50 444852.50 -0.95 137712.50 444852.50 -0.95 137712.50 444847.50 -0.95
137707.50 444847.50 -0.95 137707.50 444852.50 -0.95 137712.50 444852.50 -0.95 137712.50 444847.50 -0.95 137707.50 444847.50 -3.25 137707.50 444852.50 -3.25 137712.50 444852.50 -3.25 137712.50 444847.50 -3.25
137707.50 444847.50 -3.25 137707.50 444852.50 -3.25 137712.50 444852.50 -3.25 137712.50 444847.50 -3.25 137707.50 444847.50 -4.25 137707.50 444852.50 -4.25 137712.50 444852.50 -4.25 137712.50 444847.50 -4.25
137707.50 444847.50 -4.25 137707.50 444852.50 -4.25 137712.50 444852.50 -4.25 137712.50 444847.50 -4.25 137707.50 444847.50 -6.05 137707.50 444852.50 -6.05 137712.50 444852.50 -6.05 137712.50 444847.50 -6.05
137707.50 444847.50 -6.05 137707.50 444852.50 -6.05 137712.50 444852.50 -6.05 137712.50 444847.50 -6.05 137707.50 444847.50 -6.95 137707.50 444852.50 -6.95 137712.50 444852.50 -6.95 137712.50 444847.50 -6.95
137707.50 444847.50 -6.95 137707.50 444852.50 -6.95 137712.50 444852.50 -6.95 137712.50 444847.50 -6.95 137707.50 444847.50 -8.45 137707.50 444852.50 -8.45 137712.50 444852.50 -8.45 137712.50 444847.50 -8.45
137707.50 444847.50 -8.45 137707.50 444852.50 -8.45 137712.50 444852.50 -8.45 137712.50 444847.50 -8.45 137707.50 444847.50 -15.95 137707.50 444852.50 -15.95 137712.50 444852.50 -15.95 137712.50 444847.50 -15.95
137707.50 444847.50 -15.95 137707.50 444852.50 -15.95 137712.50 444852.50 -15.95 137712.50 444847.50 -15.95 137707.50 444847.50 -16.45 137707.50 444852.50 -16.45 137712.50 444852.50 -16.45 137712.50 444847.50 -16.45
137707.50 444847.50 -16.45 137707.50 444852.50 -16.45 137712.50 444852.50 -16.45 137712.50 444847.50 -16.45 137707.50 444847.50 -16.95 137707.50 444852.50 -16.95 137712.50 444852.50 -16.95 137712.50 444847.50 -16.95
137707.50 444847.50 -16.95 137707.50 444852.50 -16.95 137712.50 444852.50 -16.95 137712.50 444847.50 -16.95 137707.50 444847.50 -18.15 137707.50 444852.50 -18.15 137712.50 444852.50 -18.15 137712.50 444847.50 -18.15
137707.50 444847.50 -18.15 137707.50 444852.50 -18.15 137712.50 444852.50 -18.15 137712.50 444847.50 -18.15 137707.50 444847.50 -23.45 137707.50 444852.50 -23.45 137712.50 444852.50 -23.45 137712.50 444847.50 -23.45
137707.50 444847.50 -23.45 137707.50 444852.50 -23.45 137712.50 444852.50 -23.45 137712.50 444847.50 -23.45 137707.50 444847.50 -29.45 137707.50 444852.50 -29.45 137712.50 444852.50 -29.45 137712.50 444847.50 -29.45
137707.50 444847.50 -29.45 137707.50 444852.50 -29.45 137712.50 444852.50 -29.45 137712.50 444847.50 -29.45 137707.50 444847.50 -30.95 137707.50 444852.50 -30.95 137712.50 444852.50 -30.95 137712.50 444847.50 -30.95
137707.50 444847.50 -30.95 137707.50 444852.50 -30.95 137712.50 444852.50 -30.95 137712.50 444847.50 -30.95 137707.50 444847.50 -35.45 137707.50 444852.50 -35.45 137712.50 444852.50 -35.45 137712.50 444847.50 -35.45
137707.50 444847.50 -35.45 137707.50 444852.50 -35.45 137712.50 444852.50 -35.45 137712.50 444847.50 -35.45 137707.50 444847.50 -43.05 137707.50 444852.50 -43.05 137712.50 444852.50 -43.05 137712.50 444847.50 -43.05

CELLS 15 135
8 4 7 6 5 0 3 2 1
8 12 15 14 13 8 11 10 9
8 20 23 22 21 16 19 18 17
8 28 31 30 29 24 27 26 25
8 36 39 38 37 32 35 34 33
8 44 47 46 45 40 43 42 41
8 52 55 54 53 48 51 50 49
8 60 63 62 61 56 59 58 57
8 68 71 70 69 64 67 66 65
8 76 79 78 77 72 75 74 73
8 84 87 86 85 80 83 82 81
8 92 95 94 93 88 91 90 89
8 100 103 102 101 96 99 98 97
8 108 111 110 109 104 107 106 105
8 116 119 118 117 112 115 114 113

CELL_TYPES 15
12
12
12
12
12
12
12
12
12
12
12
12
12
12
12

CELL_DATA 15
SCALARS Property_0 float
LOOKUP_TABLE custom_table
6.00
0.00
6.00
3.00
6.00
0.00
5.00
0.00
8.00
4.00
5.00
4.00
5.00
8.00
5.00
