# vtk DataFile Version 1.0
B38F1350.vtk
ASCII

DATASET UNSTRUCTURED_GRID
POINTS 56 float
136620.50 444090.50 2.40 136620.50 444095.50 2.40 136625.50 444095.50 2.40 136625.50 444090.50 2.40 136620.50 444090.50 1.30 136620.50 444095.50 1.30 136625.50 444095.50 1.30 136625.50 444090.50 1.30
136620.50 444090.50 1.30 136620.50 444095.50 1.30 136625.50 444095.50 1.30 136625.50 444090.50 1.30 136620.50 444090.50 -0.10 136620.50 444095.50 -0.10 136625.50 444095.50 -0.10 136625.50 444090.50 -0.10
136620.50 444090.50 -0.10 136620.50 444095.50 -0.10 136625.50 444095.50 -0.10 136625.50 444090.50 -0.10 136620.50 444090.50 -1.90 136620.50 444095.50 -1.90 136625.50 444095.50 -1.90 136625.50 444090.50 -1.90
136620.50 444090.50 -1.90 136620.50 444095.50 -1.90 136625.50 444095.50 -1.90 136625.50 444090.50 -1.90 136620.50 444090.50 -3.30 136620.50 444095.50 -3.30 136625.50 444095.50 -3.30 136625.50 444090.50 -3.30
136620.50 444090.50 -3.30 136620.50 444095.50 -3.30 136625.50 444095.50 -3.30 136625.50 444090.50 -3.30 136620.50 444090.50 -3.50 136620.50 444095.50 -3.50 136625.50 444095.50 -3.50 136625.50 444090.50 -3.50
136620.50 444090.50 -3.50 136620.50 444095.50 -3.50 136625.50 444095.50 -3.50 136625.50 444090.50 -3.50 136620.50 444090.50 -4.30 136620.50 444095.50 -4.30 136625.50 444095.50 -4.30 136625.50 444090.50 -4.30
136620.50 444090.50 -4.30 136620.50 444095.50 -4.30 136625.50 444095.50 -4.30 136625.50 444090.50 -4.30 136620.50 444090.50 -5.64 136620.50 444095.50 -5.64 136625.50 444095.50 -5.64 136625.50 444090.50 -5.64

CELLS 7 63
8 4 7 6 5 0 3 2 1
8 12 15 14 13 8 11 10 9
8 20 23 22 21 16 19 18 17
8 28 31 30 29 24 27 26 25
8 36 39 38 37 32 35 34 33
8 44 47 46 45 40 43 42 41
8 52 55 54 53 48 51 50 49

CELL_TYPES 7
12
12
12
12
12
12
12

CELL_DATA 7
SCALARS Property_0 float
LOOKUP_TABLE custom_table
1.00
6.00
7.00
3.00
1.00
7.00
0.00
