# vtk DataFile Version 1.0
B38F1420.vtk
ASCII

DATASET UNSTRUCTURED_GRID
POINTS 48 float
132187.50 446086.50 0.90 132187.50 446091.50 0.90 132192.50 446091.50 0.90 132192.50 446086.50 0.90 132187.50 446086.50 -2.10 132187.50 446091.50 -2.10 132192.50 446091.50 -2.10 132192.50 446086.50 -2.10
132187.50 446086.50 -2.10 132187.50 446091.50 -2.10 132192.50 446091.50 -2.10 132192.50 446086.50 -2.10 132187.50 446086.50 -3.30 132187.50 446091.50 -3.30 132192.50 446091.50 -3.30 132192.50 446086.50 -3.30
132187.50 446086.50 -3.30 132187.50 446091.50 -3.30 132192.50 446091.50 -3.30 132192.50 446086.50 -3.30 132187.50 446086.50 -4.30 132187.50 446091.50 -4.30 132192.50 446091.50 -4.30 132192.50 446086.50 -4.30
132187.50 446086.50 -4.30 132187.50 446091.50 -4.30 132192.50 446091.50 -4.30 132192.50 446086.50 -4.30 132187.50 446086.50 -5.20 132187.50 446091.50 -5.20 132192.50 446091.50 -5.20 132192.50 446086.50 -5.20
132187.50 446086.50 -5.20 132187.50 446091.50 -5.20 132192.50 446091.50 -5.20 132192.50 446086.50 -5.20 132187.50 446086.50 -6.00 132187.50 446091.50 -6.00 132192.50 446091.50 -6.00 132192.50 446086.50 -6.00
132187.50 446086.50 -6.00 132187.50 446091.50 -6.00 132192.50 446091.50 -6.00 132192.50 446086.50 -6.00 132187.50 446086.50 -7.38 132187.50 446091.50 -7.38 132192.50 446091.50 -7.38 132192.50 446086.50 -7.38

CELLS 6 54
8 4 7 6 5 0 3 2 1
8 12 15 14 13 8 11 10 9
8 20 23 22 21 16 19 18 17
8 28 31 30 29 24 27 26 25
8 36 39 38 37 32 35 34 33
8 44 47 46 45 40 43 42 41

CELL_TYPES 6
12
12
12
12
12
12

CELL_DATA 6
SCALARS Property_0 float
LOOKUP_TABLE custom_table
6.00
3.00
6.00
0.00
7.00
0.00
