# vtk DataFile Version 1.0
B38F0199.vtk
ASCII

DATASET UNSTRUCTURED_GRID
POINTS 80 float
131622.50 443637.50 2.20 131622.50 443642.50 2.20 131627.50 443642.50 2.20 131627.50 443637.50 2.20 131622.50 443637.50 1.40 131622.50 443642.50 1.40 131627.50 443642.50 1.40 131627.50 443637.50 1.40
131622.50 443637.50 1.40 131622.50 443642.50 1.40 131627.50 443642.50 1.40 131627.50 443637.50 1.40 131622.50 443637.50 0.90 131622.50 443642.50 0.90 131627.50 443642.50 0.90 131627.50 443637.50 0.90
131622.50 443637.50 0.90 131622.50 443642.50 0.90 131627.50 443642.50 0.90 131627.50 443637.50 0.90 131622.50 443637.50 0.10 131622.50 443642.50 0.10 131627.50 443642.50 0.10 131627.50 443637.50 0.10
131622.50 443637.50 0.10 131622.50 443642.50 0.10 131627.50 443642.50 0.10 131627.50 443637.50 0.10 131622.50 443637.50 -1.00 131622.50 443642.50 -1.00 131627.50 443642.50 -1.00 131627.50 443637.50 -1.00
131622.50 443637.50 -1.00 131622.50 443642.50 -1.00 131627.50 443642.50 -1.00 131627.50 443637.50 -1.00 131622.50 443637.50 -4.40 131622.50 443642.50 -4.40 131627.50 443642.50 -4.40 131627.50 443637.50 -4.40
131622.50 443637.50 -4.40 131622.50 443642.50 -4.40 131627.50 443642.50 -4.40 131627.50 443637.50 -4.40 131622.50 443637.50 -7.30 131622.50 443642.50 -7.30 131627.50 443642.50 -7.30 131627.50 443637.50 -7.30
131622.50 443637.50 -7.30 131622.50 443642.50 -7.30 131627.50 443642.50 -7.30 131627.50 443637.50 -7.30 131622.50 443637.50 -9.50 131622.50 443642.50 -9.50 131627.50 443642.50 -9.50 131627.50 443637.50 -9.50
131622.50 443637.50 -9.50 131622.50 443642.50 -9.50 131627.50 443642.50 -9.50 131627.50 443637.50 -9.50 131622.50 443637.50 -9.60 131622.50 443642.50 -9.60 131627.50 443642.50 -9.60 131627.50 443637.50 -9.60
131622.50 443637.50 -9.60 131622.50 443642.50 -9.60 131627.50 443642.50 -9.60 131627.50 443637.50 -9.60 131622.50 443637.50 -12.10 131622.50 443642.50 -12.10 131627.50 443642.50 -12.10 131627.50 443637.50 -12.10
131622.50 443637.50 -12.10 131622.50 443642.50 -12.10 131627.50 443642.50 -12.10 131627.50 443637.50 -12.10 131622.50 443637.50 -14.96 131622.50 443642.50 -14.96 131627.50 443642.50 -14.96 131627.50 443637.50 -14.96

CELLS 10 90
8 4 7 6 5 0 3 2 1
8 12 15 14 13 8 11 10 9
8 20 23 22 21 16 19 18 17
8 28 31 30 29 24 27 26 25
8 36 39 38 37 32 35 34 33
8 44 47 46 45 40 43 42 41
8 52 55 54 53 48 51 50 49
8 60 63 62 61 56 59 58 57
8 68 71 70 69 64 67 66 65
8 76 79 78 77 72 75 74 73

CELL_TYPES 10
12
12
12
12
12
12
12
12
12
12

CELL_DATA 10
SCALARS Property_0 float
LOOKUP_TABLE custom_table
6.00
7.00
1.00
0.00
7.00
4.00
0.00
6.00
0.00
5.00
