# vtk DataFile Version 1.0
B38F1226.vtk
ASCII

DATASET UNSTRUCTURED_GRID
POINTS 40 float
134581.50 442545.50 0.74 134581.50 442550.50 0.74 134586.50 442550.50 0.74 134586.50 442545.50 0.74 134581.50 442545.50 0.34 134581.50 442550.50 0.34 134586.50 442550.50 0.34 134586.50 442545.50 0.34
134581.50 442545.50 0.34 134581.50 442550.50 0.34 134586.50 442550.50 0.34 134586.50 442545.50 0.34 134581.50 442545.50 -0.96 134581.50 442550.50 -0.96 134586.50 442550.50 -0.96 134586.50 442545.50 -0.96
134581.50 442545.50 -0.96 134581.50 442550.50 -0.96 134586.50 442550.50 -0.96 134586.50 442545.50 -0.96 134581.50 442545.50 -1.96 134581.50 442550.50 -1.96 134586.50 442550.50 -1.96 134586.50 442545.50 -1.96
134581.50 442545.50 -1.96 134581.50 442550.50 -1.96 134586.50 442550.50 -1.96 134586.50 442545.50 -1.96 134581.50 442545.50 -2.36 134581.50 442550.50 -2.36 134586.50 442550.50 -2.36 134586.50 442545.50 -2.36
134581.50 442545.50 -2.36 134581.50 442550.50 -2.36 134586.50 442550.50 -2.36 134586.50 442545.50 -2.36 134581.50 442545.50 -2.98 134581.50 442550.50 -2.98 134586.50 442550.50 -2.98 134586.50 442545.50 -2.98

CELLS 5 45
8 4 7 6 5 0 3 2 1
8 12 15 14 13 8 11 10 9
8 20 23 22 21 16 19 18 17
8 28 31 30 29 24 27 26 25
8 36 39 38 37 32 35 34 33

CELL_TYPES 5
12
12
12
12
12

CELL_DATA 5
SCALARS Property_0 float
LOOKUP_TABLE custom_table
6.00
1.00
3.00
6.00
5.00
