# vtk DataFile Version 1.0
B38F0284.vtk
ASCII

DATASET UNSTRUCTURED_GRID
POINTS 56 float
137477.50 444727.50 2.82 137477.50 444732.50 2.82 137482.50 444732.50 2.82 137482.50 444727.50 2.82 137477.50 444727.50 0.32 137477.50 444732.50 0.32 137482.50 444732.50 0.32 137482.50 444727.50 0.32
137477.50 444727.50 0.32 137477.50 444732.50 0.32 137482.50 444732.50 0.32 137482.50 444727.50 0.32 137477.50 444727.50 -3.08 137477.50 444732.50 -3.08 137482.50 444732.50 -3.08 137482.50 444727.50 -3.08
137477.50 444727.50 -3.08 137477.50 444732.50 -3.08 137482.50 444732.50 -3.08 137482.50 444727.50 -3.08 137477.50 444727.50 -3.28 137477.50 444732.50 -3.28 137482.50 444732.50 -3.28 137482.50 444727.50 -3.28
137477.50 444727.50 -3.28 137477.50 444732.50 -3.28 137482.50 444732.50 -3.28 137482.50 444727.50 -3.28 137477.50 444727.50 -4.98 137477.50 444732.50 -4.98 137482.50 444732.50 -4.98 137482.50 444727.50 -4.98
137477.50 444727.50 -4.98 137477.50 444732.50 -4.98 137482.50 444732.50 -4.98 137482.50 444727.50 -4.98 137477.50 444727.50 -5.88 137477.50 444732.50 -5.88 137482.50 444732.50 -5.88 137482.50 444727.50 -5.88
137477.50 444727.50 -5.88 137477.50 444732.50 -5.88 137482.50 444732.50 -5.88 137482.50 444727.50 -5.88 137477.50 444727.50 -9.68 137477.50 444732.50 -9.68 137482.50 444732.50 -9.68 137482.50 444727.50 -9.68
137477.50 444727.50 -9.68 137477.50 444732.50 -9.68 137482.50 444732.50 -9.68 137482.50 444727.50 -9.68 137477.50 444727.50 -12.18 137477.50 444732.50 -12.18 137482.50 444732.50 -12.18 137482.50 444727.50 -12.18

CELLS 7 63
8 4 7 6 5 0 3 2 1
8 12 15 14 13 8 11 10 9
8 20 23 22 21 16 19 18 17
8 28 31 30 29 24 27 26 25
8 36 39 38 37 32 35 34 33
8 44 47 46 45 40 43 42 41
8 52 55 54 53 48 51 50 49

CELL_TYPES 7
12
12
12
12
12
12
12

CELL_DATA 7
SCALARS Property_0 float
LOOKUP_TABLE custom_table
6.00
4.00
8.00
3.00
6.00
4.00
5.00
