# vtk DataFile Version 1.0
B38F1882.vtk
ASCII

DATASET UNSTRUCTURED_GRID
POINTS 96 float
136847.50 445128.50 7.15 136847.50 445133.50 7.15 136852.50 445133.50 7.15 136852.50 445128.50 7.15 136847.50 445128.50 6.58 136847.50 445133.50 6.58 136852.50 445133.50 6.58 136852.50 445128.50 6.58
136847.50 445128.50 6.58 136847.50 445133.50 6.58 136852.50 445133.50 6.58 136852.50 445128.50 6.58 136847.50 445128.50 0.18 136847.50 445133.50 0.18 136852.50 445133.50 0.18 136852.50 445128.50 0.18
136847.50 445128.50 0.18 136847.50 445133.50 0.18 136852.50 445133.50 0.18 136852.50 445128.50 0.18 136847.50 445128.50 -1.21 136847.50 445133.50 -1.21 136852.50 445133.50 -1.21 136852.50 445128.50 -1.21
136847.50 445128.50 -1.21 136847.50 445133.50 -1.21 136852.50 445133.50 -1.21 136852.50 445128.50 -1.21 136847.50 445128.50 -2.37 136847.50 445133.50 -2.37 136852.50 445133.50 -2.37 136852.50 445128.50 -2.37
136847.50 445128.50 -2.37 136847.50 445133.50 -2.37 136852.50 445133.50 -2.37 136852.50 445128.50 -2.37 136847.50 445128.50 -3.15 136847.50 445133.50 -3.15 136852.50 445133.50 -3.15 136852.50 445128.50 -3.15
136847.50 445128.50 -3.15 136847.50 445133.50 -3.15 136852.50 445133.50 -3.15 136852.50 445128.50 -3.15 136847.50 445128.50 -3.53 136847.50 445133.50 -3.53 136852.50 445133.50 -3.53 136852.50 445128.50 -3.53
136847.50 445128.50 -3.53 136847.50 445133.50 -3.53 136852.50 445133.50 -3.53 136852.50 445128.50 -3.53 136847.50 445128.50 -4.60 136847.50 445133.50 -4.60 136852.50 445133.50 -4.60 136852.50 445128.50 -4.60
136847.50 445128.50 -4.60 136847.50 445133.50 -4.60 136852.50 445133.50 -4.60 136852.50 445128.50 -4.60 136847.50 445128.50 -4.92 136847.50 445133.50 -4.92 136852.50 445133.50 -4.92 136852.50 445128.50 -4.92
136847.50 445128.50 -4.92 136847.50 445133.50 -4.92 136852.50 445133.50 -4.92 136852.50 445128.50 -4.92 136847.50 445128.50 -5.76 136847.50 445133.50 -5.76 136852.50 445133.50 -5.76 136852.50 445128.50 -5.76
136847.50 445128.50 -5.76 136847.50 445133.50 -5.76 136852.50 445133.50 -5.76 136852.50 445128.50 -5.76 136847.50 445128.50 -6.18 136847.50 445133.50 -6.18 136852.50 445133.50 -6.18 136852.50 445128.50 -6.18
136847.50 445128.50 -6.18 136847.50 445133.50 -6.18 136852.50 445133.50 -6.18 136852.50 445128.50 -6.18 136847.50 445128.50 -7.10 136847.50 445133.50 -7.10 136852.50 445133.50 -7.10 136852.50 445128.50 -7.10
136847.50 445128.50 -7.10 136847.50 445133.50 -7.10 136852.50 445133.50 -7.10 136852.50 445128.50 -7.10 136847.50 445128.50 -9.95 136847.50 445133.50 -9.95 136852.50 445133.50 -9.95 136852.50 445128.50 -9.95

CELLS 12 108
8 4 7 6 5 0 3 2 1
8 12 15 14 13 8 11 10 9
8 20 23 22 21 16 19 18 17
8 28 31 30 29 24 27 26 25
8 36 39 38 37 32 35 34 33
8 44 47 46 45 40 43 42 41
8 52 55 54 53 48 51 50 49
8 60 63 62 61 56 59 58 57
8 68 71 70 69 64 67 66 65
8 76 79 78 77 72 75 74 73
8 84 87 86 85 80 83 82 81
8 92 95 94 93 88 91 90 89

CELL_TYPES 12
12
12
12
12
12
12
12
12
12
12
12
12

CELL_DATA 12
SCALARS Property_0 float
LOOKUP_TABLE custom_table
0.00
6.00
1.00
6.00
1.00
3.00
1.00
3.00
1.00
3.00
1.00
0.00
