# vtk DataFile Version 1.0
B38F1189.vtk
ASCII

DATASET UNSTRUCTURED_GRID
POINTS 32 float
136593.50 441644.50 0.40 136593.50 441649.50 0.40 136598.50 441649.50 0.40 136598.50 441644.50 0.40 136593.50 441644.50 -0.10 136593.50 441649.50 -0.10 136598.50 441649.50 -0.10 136598.50 441644.50 -0.10
136593.50 441644.50 -0.10 136593.50 441649.50 -0.10 136598.50 441649.50 -0.10 136598.50 441644.50 -0.10 136593.50 441644.50 -2.80 136593.50 441649.50 -2.80 136598.50 441649.50 -2.80 136598.50 441644.50 -2.80
136593.50 441644.50 -2.80 136593.50 441649.50 -2.80 136598.50 441649.50 -2.80 136598.50 441644.50 -2.80 136593.50 441644.50 -3.10 136593.50 441649.50 -3.10 136598.50 441649.50 -3.10 136598.50 441644.50 -3.10
136593.50 441644.50 -3.10 136593.50 441649.50 -3.10 136598.50 441649.50 -3.10 136598.50 441644.50 -3.10 136593.50 441644.50 -3.80 136593.50 441649.50 -3.80 136598.50 441649.50 -3.80 136598.50 441644.50 -3.80

CELLS 4 36
8 4 7 6 5 0 3 2 1
8 12 15 14 13 8 11 10 9
8 20 23 22 21 16 19 18 17
8 28 31 30 29 24 27 26 25

CELL_TYPES 4
12
12
12
12

CELL_DATA 4
SCALARS Property_0 float
LOOKUP_TABLE custom_table
1.00
3.00
6.00
7.00
