# vtk DataFile Version 1.0
B38F0251.vtk
ASCII

DATASET UNSTRUCTURED_GRID
POINTS 24 float
132124.50 443123.50 1.10 132124.50 443128.50 1.10 132129.50 443128.50 1.10 132129.50 443123.50 1.10 132124.50 443123.50 -3.70 132124.50 443128.50 -3.70 132129.50 443128.50 -3.70 132129.50 443123.50 -3.70
132124.50 443123.50 -3.70 132124.50 443128.50 -3.70 132129.50 443128.50 -3.70 132129.50 443123.50 -3.70 132124.50 443123.50 -7.90 132124.50 443128.50 -7.90 132129.50 443128.50 -7.90 132129.50 443123.50 -7.90
132124.50 443123.50 -7.90 132124.50 443128.50 -7.90 132129.50 443128.50 -7.90 132129.50 443123.50 -7.90 132124.50 443123.50 -9.70 132124.50 443128.50 -9.70 132129.50 443128.50 -9.70 132129.50 443123.50 -9.70

CELLS 3 27
8 4 7 6 5 0 3 2 1
8 12 15 14 13 8 11 10 9
8 20 23 22 21 16 19 18 17

CELL_TYPES 3
12
12
12

CELL_DATA 3
SCALARS Property_0 float
LOOKUP_TABLE custom_table
1.00
6.00
4.00
