# vtk DataFile Version 1.0
B38F0565.vtk
ASCII

DATASET UNSTRUCTURED_GRID
POINTS 32 float
134607.50 445565.50 2.08 134607.50 445570.50 2.08 134612.50 445570.50 2.08 134612.50 445565.50 2.08 134607.50 445565.50 0.08 134607.50 445570.50 0.08 134612.50 445570.50 0.08 134612.50 445565.50 0.08
134607.50 445565.50 0.08 134607.50 445570.50 0.08 134612.50 445570.50 0.08 134612.50 445565.50 0.08 134607.50 445565.50 -0.92 134607.50 445570.50 -0.92 134612.50 445570.50 -0.92 134612.50 445565.50 -0.92
134607.50 445565.50 -0.92 134607.50 445570.50 -0.92 134612.50 445570.50 -0.92 134612.50 445565.50 -0.92 134607.50 445565.50 -6.92 134607.50 445570.50 -6.92 134612.50 445570.50 -6.92 134612.50 445565.50 -6.92
134607.50 445565.50 -6.92 134607.50 445570.50 -6.92 134612.50 445570.50 -6.92 134612.50 445565.50 -6.92 134607.50 445565.50 -8.72 134607.50 445570.50 -8.72 134612.50 445570.50 -8.72 134612.50 445565.50 -8.72

CELLS 4 36
8 4 7 6 5 0 3 2 1
8 12 15 14 13 8 11 10 9
8 20 23 22 21 16 19 18 17
8 28 31 30 29 24 27 26 25

CELL_TYPES 4
12
12
12
12

CELL_DATA 4
SCALARS Property_0 float
LOOKUP_TABLE custom_table
1.00
7.00
5.00
5.00
