# vtk DataFile Version 1.0
B38F0628.vtk
ASCII

DATASET UNSTRUCTURED_GRID
POINTS 24 float
135178.50 444909.50 1.81 135178.50 444914.50 1.81 135183.50 444914.50 1.81 135183.50 444909.50 1.81 135178.50 444909.50 -0.79 135178.50 444914.50 -0.79 135183.50 444914.50 -0.79 135183.50 444909.50 -0.79
135178.50 444909.50 -0.79 135178.50 444914.50 -0.79 135183.50 444914.50 -0.79 135183.50 444909.50 -0.79 135178.50 444909.50 -1.39 135178.50 444914.50 -1.39 135183.50 444914.50 -1.39 135183.50 444909.50 -1.39
135178.50 444909.50 -1.39 135178.50 444914.50 -1.39 135183.50 444914.50 -1.39 135183.50 444909.50 -1.39 135178.50 444909.50 -2.03 135178.50 444914.50 -2.03 135183.50 444914.50 -2.03 135183.50 444909.50 -2.03

CELLS 3 27
8 4 7 6 5 0 3 2 1
8 12 15 14 13 8 11 10 9
8 20 23 22 21 16 19 18 17

CELL_TYPES 3
12
12
12

CELL_DATA 3
SCALARS Property_0 float
LOOKUP_TABLE custom_table
6.00
4.00
6.00
