# vtk DataFile Version 1.0
B38F1886.vtk
ASCII

DATASET UNSTRUCTURED_GRID
POINTS 64 float
133334.50 444612.50 1.89 133334.50 444617.50 1.89 133339.50 444617.50 1.89 133339.50 444612.50 1.89 133334.50 444612.50 1.41 133334.50 444617.50 1.41 133339.50 444617.50 1.41 133339.50 444612.50 1.41
133334.50 444612.50 1.41 133334.50 444617.50 1.41 133339.50 444617.50 1.41 133339.50 444612.50 1.41 133334.50 444612.50 1.14 133334.50 444617.50 1.14 133339.50 444617.50 1.14 133339.50 444612.50 1.14
133334.50 444612.50 1.14 133334.50 444617.50 1.14 133339.50 444617.50 1.14 133339.50 444612.50 1.14 133334.50 444612.50 0.69 133334.50 444617.50 0.69 133339.50 444617.50 0.69 133339.50 444612.50 0.69
133334.50 444612.50 0.69 133334.50 444617.50 0.69 133339.50 444617.50 0.69 133339.50 444612.50 0.69 133334.50 444612.50 0.19 133334.50 444617.50 0.19 133339.50 444617.50 0.19 133339.50 444612.50 0.19
133334.50 444612.50 0.19 133334.50 444617.50 0.19 133339.50 444617.50 0.19 133339.50 444612.50 0.19 133334.50 444612.50 -0.63 133334.50 444617.50 -0.63 133339.50 444617.50 -0.63 133339.50 444612.50 -0.63
133334.50 444612.50 -0.63 133334.50 444617.50 -0.63 133339.50 444617.50 -0.63 133339.50 444612.50 -0.63 133334.50 444612.50 -2.86 133334.50 444617.50 -2.86 133339.50 444617.50 -2.86 133339.50 444612.50 -2.86
133334.50 444612.50 -2.86 133334.50 444617.50 -2.86 133339.50 444617.50 -2.86 133339.50 444612.50 -2.86 133334.50 444612.50 -3.16 133334.50 444617.50 -3.16 133339.50 444617.50 -3.16 133339.50 444612.50 -3.16
133334.50 444612.50 -3.16 133334.50 444617.50 -3.16 133339.50 444617.50 -3.16 133339.50 444612.50 -3.16 133334.50 444612.50 -4.17 133334.50 444617.50 -4.17 133339.50 444617.50 -4.17 133339.50 444612.50 -4.17

CELLS 8 72
8 4 7 6 5 0 3 2 1
8 12 15 14 13 8 11 10 9
8 20 23 22 21 16 19 18 17
8 28 31 30 29 24 27 26 25
8 36 39 38 37 32 35 34 33
8 44 47 46 45 40 43 42 41
8 52 55 54 53 48 51 50 49
8 60 63 62 61 56 59 58 57

CELL_TYPES 8
12
12
12
12
12
12
12
12

CELL_DATA 8
SCALARS Property_0 float
LOOKUP_TABLE custom_table
1.00
0.00
1.00
0.00
1.00
0.00
1.00
0.00
