# vtk DataFile Version 1.0
B38F0290.vtk
ASCII

DATASET UNSTRUCTURED_GRID
POINTS 56 float
137637.50 444867.50 2.59 137637.50 444872.50 2.59 137642.50 444872.50 2.59 137642.50 444867.50 2.59 137637.50 444867.50 -1.21 137637.50 444872.50 -1.21 137642.50 444872.50 -1.21 137642.50 444867.50 -1.21
137637.50 444867.50 -1.21 137637.50 444872.50 -1.21 137642.50 444872.50 -1.21 137642.50 444867.50 -1.21 137637.50 444867.50 -2.41 137637.50 444872.50 -2.41 137642.50 444872.50 -2.41 137642.50 444867.50 -2.41
137637.50 444867.50 -2.41 137637.50 444872.50 -2.41 137642.50 444872.50 -2.41 137642.50 444867.50 -2.41 137637.50 444867.50 -3.21 137637.50 444872.50 -3.21 137642.50 444872.50 -3.21 137642.50 444867.50 -3.21
137637.50 444867.50 -3.21 137637.50 444872.50 -3.21 137642.50 444872.50 -3.21 137642.50 444867.50 -3.21 137637.50 444867.50 -4.66 137637.50 444872.50 -4.66 137642.50 444872.50 -4.66 137642.50 444867.50 -4.66
137637.50 444867.50 -4.66 137637.50 444872.50 -4.66 137642.50 444872.50 -4.66 137642.50 444867.50 -4.66 137637.50 444867.50 -7.61 137637.50 444872.50 -7.61 137642.50 444872.50 -7.61 137642.50 444867.50 -7.61
137637.50 444867.50 -7.61 137637.50 444872.50 -7.61 137642.50 444872.50 -7.61 137642.50 444867.50 -7.61 137637.50 444867.50 -9.81 137637.50 444872.50 -9.81 137642.50 444872.50 -9.81 137642.50 444867.50 -9.81
137637.50 444867.50 -9.81 137637.50 444872.50 -9.81 137642.50 444872.50 -9.81 137642.50 444867.50 -9.81 137637.50 444867.50 -12.29 137637.50 444872.50 -12.29 137642.50 444872.50 -12.29 137642.50 444867.50 -12.29

CELLS 7 63
8 4 7 6 5 0 3 2 1
8 12 15 14 13 8 11 10 9
8 20 23 22 21 16 19 18 17
8 28 31 30 29 24 27 26 25
8 36 39 38 37 32 35 34 33
8 44 47 46 45 40 43 42 41
8 52 55 54 53 48 51 50 49

CELL_TYPES 7
12
12
12
12
12
12
12

CELL_DATA 7
SCALARS Property_0 float
LOOKUP_TABLE custom_table
4.00
5.00
6.00
3.00
6.00
4.00
5.00
