# vtk DataFile Version 1.0
B38F0207.vtk
ASCII

DATASET UNSTRUCTURED_GRID
POINTS 56 float
131587.50 443477.50 2.20 131587.50 443482.50 2.20 131592.50 443482.50 2.20 131592.50 443477.50 2.20 131587.50 443477.50 1.30 131587.50 443482.50 1.30 131592.50 443482.50 1.30 131592.50 443477.50 1.30
131587.50 443477.50 1.30 131587.50 443482.50 1.30 131592.50 443482.50 1.30 131592.50 443477.50 1.30 131587.50 443477.50 -2.60 131587.50 443482.50 -2.60 131592.50 443482.50 -2.60 131592.50 443477.50 -2.60
131587.50 443477.50 -2.60 131587.50 443482.50 -2.60 131592.50 443482.50 -2.60 131592.50 443477.50 -2.60 131587.50 443477.50 -6.60 131587.50 443482.50 -6.60 131592.50 443482.50 -6.60 131592.50 443477.50 -6.60
131587.50 443477.50 -6.60 131587.50 443482.50 -6.60 131592.50 443482.50 -6.60 131592.50 443477.50 -6.60 131587.50 443477.50 -7.00 131587.50 443482.50 -7.00 131592.50 443482.50 -7.00 131592.50 443477.50 -7.00
131587.50 443477.50 -7.00 131587.50 443482.50 -7.00 131592.50 443482.50 -7.00 131592.50 443477.50 -7.00 131587.50 443477.50 -8.30 131587.50 443482.50 -8.30 131592.50 443482.50 -8.30 131592.50 443477.50 -8.30
131587.50 443477.50 -8.30 131587.50 443482.50 -8.30 131592.50 443482.50 -8.30 131592.50 443477.50 -8.30 131587.50 443477.50 -9.20 131587.50 443482.50 -9.20 131592.50 443482.50 -9.20 131592.50 443477.50 -9.20
131587.50 443477.50 -9.20 131587.50 443482.50 -9.20 131592.50 443482.50 -9.20 131592.50 443477.50 -9.20 131587.50 443477.50 -11.48 131587.50 443482.50 -11.48 131592.50 443482.50 -11.48 131592.50 443477.50 -11.48

CELLS 7 63
8 4 7 6 5 0 3 2 1
8 12 15 14 13 8 11 10 9
8 20 23 22 21 16 19 18 17
8 28 31 30 29 24 27 26 25
8 36 39 38 37 32 35 34 33
8 44 47 46 45 40 43 42 41
8 52 55 54 53 48 51 50 49

CELL_TYPES 7
12
12
12
12
12
12
12

CELL_DATA 7
SCALARS Property_0 float
LOOKUP_TABLE custom_table
1.00
7.00
0.00
8.00
0.00
5.00
8.00
