# vtk DataFile Version 1.0
B38F1347.vtk
ASCII

DATASET UNSTRUCTURED_GRID
POINTS 24 float
135112.50 444421.50 1.60 135112.50 444426.50 1.60 135117.50 444426.50 1.60 135117.50 444421.50 1.60 135112.50 444421.50 -0.30 135112.50 444426.50 -0.30 135117.50 444426.50 -0.30 135117.50 444421.50 -0.30
135112.50 444421.50 -0.30 135112.50 444426.50 -0.30 135117.50 444426.50 -0.30 135117.50 444421.50 -0.30 135112.50 444421.50 -1.10 135112.50 444426.50 -1.10 135117.50 444426.50 -1.10 135117.50 444421.50 -1.10
135112.50 444421.50 -1.10 135112.50 444426.50 -1.10 135117.50 444426.50 -1.10 135117.50 444421.50 -1.10 135112.50 444421.50 -1.64 135112.50 444426.50 -1.64 135117.50 444426.50 -1.64 135117.50 444421.50 -1.64

CELLS 3 27
8 4 7 6 5 0 3 2 1
8 12 15 14 13 8 11 10 9
8 20 23 22 21 16 19 18 17

CELL_TYPES 3
12
12
12

CELL_DATA 3
SCALARS Property_0 float
LOOKUP_TABLE custom_table
6.00
7.00
0.00
