# vtk DataFile Version 1.0
B38F1925.vtk
ASCII

DATASET UNSTRUCTURED_GRID
POINTS 64 float
137851.50 443867.50 7.54 137851.50 443872.50 7.54 137856.50 443872.50 7.54 137856.50 443867.50 7.54 137851.50 443867.50 5.87 137851.50 443872.50 5.87 137856.50 443872.50 5.87 137856.50 443867.50 5.87
137851.50 443867.50 5.87 137851.50 443872.50 5.87 137856.50 443872.50 5.87 137856.50 443867.50 5.87 137851.50 443867.50 1.14 137851.50 443872.50 1.14 137856.50 443872.50 1.14 137856.50 443867.50 1.14
137851.50 443867.50 1.14 137851.50 443872.50 1.14 137856.50 443872.50 1.14 137856.50 443867.50 1.14 137851.50 443867.50 -1.11 137851.50 443872.50 -1.11 137856.50 443872.50 -1.11 137856.50 443867.50 -1.11
137851.50 443867.50 -1.11 137851.50 443872.50 -1.11 137856.50 443872.50 -1.11 137856.50 443867.50 -1.11 137851.50 443867.50 -2.94 137851.50 443872.50 -2.94 137856.50 443872.50 -2.94 137856.50 443867.50 -2.94
137851.50 443867.50 -2.94 137851.50 443872.50 -2.94 137856.50 443872.50 -2.94 137856.50 443867.50 -2.94 137851.50 443867.50 -4.31 137851.50 443872.50 -4.31 137856.50 443872.50 -4.31 137856.50 443867.50 -4.31
137851.50 443867.50 -4.31 137851.50 443872.50 -4.31 137856.50 443872.50 -4.31 137856.50 443867.50 -4.31 137851.50 443867.50 -4.61 137851.50 443872.50 -4.61 137856.50 443872.50 -4.61 137856.50 443867.50 -4.61
137851.50 443867.50 -4.61 137851.50 443872.50 -4.61 137856.50 443872.50 -4.61 137856.50 443867.50 -4.61 137851.50 443867.50 -6.16 137851.50 443872.50 -6.16 137856.50 443872.50 -6.16 137856.50 443867.50 -6.16
137851.50 443867.50 -6.16 137851.50 443872.50 -6.16 137856.50 443872.50 -6.16 137856.50 443867.50 -6.16 137851.50 443867.50 -8.90 137851.50 443872.50 -8.90 137856.50 443872.50 -8.90 137856.50 443867.50 -8.90

CELLS 8 72
8 4 7 6 5 0 3 2 1
8 12 15 14 13 8 11 10 9
8 20 23 22 21 16 19 18 17
8 28 31 30 29 24 27 26 25
8 36 39 38 37 32 35 34 33
8 44 47 46 45 40 43 42 41
8 52 55 54 53 48 51 50 49
8 60 63 62 61 56 59 58 57

CELL_TYPES 8
12
12
12
12
12
12
12
12

CELL_DATA 8
SCALARS Property_0 float
LOOKUP_TABLE custom_table
1.00
6.00
1.00
0.00
3.00
6.00
0.00
0.00
