# vtk DataFile Version 1.0
B38F1873.vtk
ASCII

DATASET UNSTRUCTURED_GRID
POINTS 56 float
132774.50 443368.50 6.94 132774.50 443373.50 6.94 132779.50 443373.50 6.94 132779.50 443368.50 6.94 132774.50 443368.50 6.39 132774.50 443373.50 6.39 132779.50 443373.50 6.39 132779.50 443368.50 6.39
132774.50 443368.50 6.39 132774.50 443373.50 6.39 132779.50 443373.50 6.39 132779.50 443368.50 6.39 132774.50 443368.50 5.92 132774.50 443373.50 5.92 132779.50 443373.50 5.92 132779.50 443368.50 5.92
132774.50 443368.50 5.92 132774.50 443373.50 5.92 132779.50 443373.50 5.92 132779.50 443368.50 5.92 132774.50 443368.50 5.15 132774.50 443373.50 5.15 132779.50 443373.50 5.15 132779.50 443368.50 5.15
132774.50 443368.50 5.15 132774.50 443373.50 5.15 132779.50 443373.50 5.15 132779.50 443368.50 5.15 132774.50 443368.50 2.65 132774.50 443373.50 2.65 132779.50 443373.50 2.65 132779.50 443368.50 2.65
132774.50 443368.50 2.65 132774.50 443373.50 2.65 132779.50 443373.50 2.65 132779.50 443368.50 2.65 132774.50 443368.50 -5.58 132774.50 443373.50 -5.58 132779.50 443373.50 -5.58 132779.50 443368.50 -5.58
132774.50 443368.50 -5.58 132774.50 443373.50 -5.58 132779.50 443373.50 -5.58 132779.50 443368.50 -5.58 132774.50 443368.50 -7.45 132774.50 443373.50 -7.45 132779.50 443373.50 -7.45 132779.50 443368.50 -7.45
132774.50 443368.50 -7.45 132774.50 443373.50 -7.45 132779.50 443373.50 -7.45 132779.50 443368.50 -7.45 132774.50 443368.50 -10.33 132774.50 443373.50 -10.33 132779.50 443373.50 -10.33 132779.50 443368.50 -10.33

CELLS 7 63
8 4 7 6 5 0 3 2 1
8 12 15 14 13 8 11 10 9
8 20 23 22 21 16 19 18 17
8 28 31 30 29 24 27 26 25
8 36 39 38 37 32 35 34 33
8 44 47 46 45 40 43 42 41
8 52 55 54 53 48 51 50 49

CELL_TYPES 7
12
12
12
12
12
12
12

CELL_DATA 7
SCALARS Property_0 float
LOOKUP_TABLE custom_table
0.00
1.00
6.00
1.00
0.00
1.00
0.00
