# vtk DataFile Version 1.0
B38F1762.vtk
ASCII

DATASET UNSTRUCTURED_GRID
POINTS 104 float
131688.50 442830.50 1.65 131688.50 442835.50 1.65 131693.50 442835.50 1.65 131693.50 442830.50 1.65 131688.50 442830.50 1.55 131688.50 442835.50 1.55 131693.50 442835.50 1.55 131693.50 442830.50 1.55
131688.50 442830.50 1.55 131688.50 442835.50 1.55 131693.50 442835.50 1.55 131693.50 442830.50 1.55 131688.50 442830.50 0.29 131688.50 442835.50 0.29 131693.50 442835.50 0.29 131693.50 442830.50 0.29
131688.50 442830.50 0.29 131688.50 442835.50 0.29 131693.50 442835.50 0.29 131693.50 442830.50 0.29 131688.50 442830.50 -1.35 131688.50 442835.50 -1.35 131693.50 442835.50 -1.35 131693.50 442830.50 -1.35
131688.50 442830.50 -1.35 131688.50 442835.50 -1.35 131693.50 442835.50 -1.35 131693.50 442830.50 -1.35 131688.50 442830.50 -2.06 131688.50 442835.50 -2.06 131693.50 442835.50 -2.06 131693.50 442830.50 -2.06
131688.50 442830.50 -2.06 131688.50 442835.50 -2.06 131693.50 442835.50 -2.06 131693.50 442830.50 -2.06 131688.50 442830.50 -2.84 131688.50 442835.50 -2.84 131693.50 442835.50 -2.84 131693.50 442830.50 -2.84
131688.50 442830.50 -2.84 131688.50 442835.50 -2.84 131693.50 442835.50 -2.84 131693.50 442830.50 -2.84 131688.50 442830.50 -3.34 131688.50 442835.50 -3.34 131693.50 442835.50 -3.34 131693.50 442830.50 -3.34
131688.50 442830.50 -3.34 131688.50 442835.50 -3.34 131693.50 442835.50 -3.34 131693.50 442830.50 -3.34 131688.50 442830.50 -4.38 131688.50 442835.50 -4.38 131693.50 442835.50 -4.38 131693.50 442830.50 -4.38
131688.50 442830.50 -4.38 131688.50 442835.50 -4.38 131693.50 442835.50 -4.38 131693.50 442830.50 -4.38 131688.50 442830.50 -4.59 131688.50 442835.50 -4.59 131693.50 442835.50 -4.59 131693.50 442830.50 -4.59
131688.50 442830.50 -4.59 131688.50 442835.50 -4.59 131693.50 442835.50 -4.59 131693.50 442830.50 -4.59 131688.50 442830.50 -5.79 131688.50 442835.50 -5.79 131693.50 442835.50 -5.79 131693.50 442830.50 -5.79
131688.50 442830.50 -5.79 131688.50 442835.50 -5.79 131693.50 442835.50 -5.79 131693.50 442830.50 -5.79 131688.50 442830.50 -6.31 131688.50 442835.50 -6.31 131693.50 442835.50 -6.31 131693.50 442830.50 -6.31
131688.50 442830.50 -6.31 131688.50 442835.50 -6.31 131693.50 442835.50 -6.31 131693.50 442830.50 -6.31 131688.50 442830.50 -6.59 131688.50 442835.50 -6.59 131693.50 442835.50 -6.59 131693.50 442830.50 -6.59
131688.50 442830.50 -6.59 131688.50 442835.50 -6.59 131693.50 442835.50 -6.59 131693.50 442830.50 -6.59 131688.50 442830.50 -7.06 131688.50 442835.50 -7.06 131693.50 442835.50 -7.06 131693.50 442830.50 -7.06
131688.50 442830.50 -7.06 131688.50 442835.50 -7.06 131693.50 442835.50 -7.06 131693.50 442830.50 -7.06 131688.50 442830.50 -8.80 131688.50 442835.50 -8.80 131693.50 442835.50 -8.80 131693.50 442830.50 -8.80

CELLS 13 117
8 4 7 6 5 0 3 2 1
8 12 15 14 13 8 11 10 9
8 20 23 22 21 16 19 18 17
8 28 31 30 29 24 27 26 25
8 36 39 38 37 32 35 34 33
8 44 47 46 45 40 43 42 41
8 52 55 54 53 48 51 50 49
8 60 63 62 61 56 59 58 57
8 68 71 70 69 64 67 66 65
8 76 79 78 77 72 75 74 73
8 84 87 86 85 80 83 82 81
8 92 95 94 93 88 91 90 89
8 100 103 102 101 96 99 98 97

CELL_TYPES 13
12
12
12
12
12
12
12
12
12
12
12
12
12

CELL_DATA 13
SCALARS Property_0 float
LOOKUP_TABLE custom_table
1.00
6.00
1.00
6.00
1.00
3.00
1.00
3.00
1.00
6.00
0.00
6.00
0.00
