# vtk DataFile Version 1.0
B38F1371.vtk
ASCII

DATASET UNSTRUCTURED_GRID
POINTS 56 float
130131.50 445568.50 -0.50 130131.50 445573.50 -0.50 130136.50 445573.50 -0.50 130136.50 445568.50 -0.50 130131.50 445568.50 -1.00 130131.50 445573.50 -1.00 130136.50 445573.50 -1.00 130136.50 445568.50 -1.00
130131.50 445568.50 -1.00 130131.50 445573.50 -1.00 130136.50 445573.50 -1.00 130136.50 445568.50 -1.00 130131.50 445568.50 -3.40 130131.50 445573.50 -3.40 130136.50 445573.50 -3.40 130136.50 445568.50 -3.40
130131.50 445568.50 -3.40 130131.50 445573.50 -3.40 130136.50 445573.50 -3.40 130136.50 445568.50 -3.40 130131.50 445568.50 -4.40 130131.50 445573.50 -4.40 130136.50 445573.50 -4.40 130136.50 445568.50 -4.40
130131.50 445568.50 -4.40 130131.50 445573.50 -4.40 130136.50 445573.50 -4.40 130136.50 445568.50 -4.40 130131.50 445568.50 -5.00 130131.50 445573.50 -5.00 130136.50 445573.50 -5.00 130136.50 445568.50 -5.00
130131.50 445568.50 -5.00 130131.50 445573.50 -5.00 130136.50 445573.50 -5.00 130136.50 445568.50 -5.00 130131.50 445568.50 -7.20 130131.50 445573.50 -7.20 130136.50 445573.50 -7.20 130136.50 445568.50 -7.20
130131.50 445568.50 -7.20 130131.50 445573.50 -7.20 130136.50 445573.50 -7.20 130136.50 445568.50 -7.20 130131.50 445568.50 -7.50 130131.50 445573.50 -7.50 130136.50 445573.50 -7.50 130136.50 445568.50 -7.50
130131.50 445568.50 -7.50 130131.50 445573.50 -7.50 130136.50 445573.50 -7.50 130136.50 445568.50 -7.50 130131.50 445568.50 -8.90 130131.50 445573.50 -8.90 130136.50 445573.50 -8.90 130136.50 445568.50 -8.90

CELLS 7 63
8 4 7 6 5 0 3 2 1
8 12 15 14 13 8 11 10 9
8 20 23 22 21 16 19 18 17
8 28 31 30 29 24 27 26 25
8 36 39 38 37 32 35 34 33
8 44 47 46 45 40 43 42 41
8 52 55 54 53 48 51 50 49

CELL_TYPES 7
12
12
12
12
12
12
12

CELL_DATA 7
SCALARS Property_0 float
LOOKUP_TABLE custom_table
1.00
3.00
1.00
6.00
1.00
6.00
5.00
