[
	{
		"Annotations" : 
		[
			"2",
			"antropogeen",
			"3",
			"veen",
			"1",
			"klei",
			"6",
			"zandige klei, keem if kleiig, fijn sand",
			"7",
			"zand fijn",
			"4",
			"zand midden",
			"5",
			"zang grove",
			"8",
			"grind",
			"0",
			"zand"
		],
		"IndexedColors" : 
		[
			0.78431372549019607,
			0.78431372549019607,
			0.78431372549019607,
			0.61568627450980395,
			0.30588235294117649,
			0.25098039215686274,
			0.0,
			0.5725490196078431,
			0.0,
			0.76078431372549016,
			0.81176470588235294,
			0.36078431372549019,
			1.0,
			1.0,
			0.0,
			0.95294117647058818,
			0.88235294117647056,
			0.023529411764705882,
			0.90588235294117647,
			0.76470588235294112,
			0.086274509803921567,
			0.84705882352941175,
			0.63921568627450975,
			0.12549019607843137,
			0.90588235294117647,
			0.76470588235294112,
			0.086274509803921567
		],
		"Name" : "Preset 4"
	}
]

