# vtk DataFile Version 1.0
B38F0491.vtk
ASCII

DATASET UNSTRUCTURED_GRID
POINTS 136 float
130407.50 442162.50 1.50 130407.50 442167.50 1.50 130412.50 442167.50 1.50 130412.50 442162.50 1.50 130407.50 442162.50 1.00 130407.50 442167.50 1.00 130412.50 442167.50 1.00 130412.50 442162.50 1.00
130407.50 442162.50 1.00 130407.50 442167.50 1.00 130412.50 442167.50 1.00 130412.50 442162.50 1.00 130407.50 442162.50 0.40 130407.50 442167.50 0.40 130412.50 442167.50 0.40 130412.50 442162.50 0.40
130407.50 442162.50 0.40 130407.50 442167.50 0.40 130412.50 442167.50 0.40 130412.50 442162.50 0.40 130407.50 442162.50 -3.90 130407.50 442167.50 -3.90 130412.50 442167.50 -3.90 130412.50 442162.50 -3.90
130407.50 442162.50 -3.90 130407.50 442167.50 -3.90 130412.50 442167.50 -3.90 130412.50 442162.50 -3.90 130407.50 442162.50 -7.10 130407.50 442167.50 -7.10 130412.50 442167.50 -7.10 130412.50 442162.50 -7.10
130407.50 442162.50 -7.10 130407.50 442167.50 -7.10 130412.50 442167.50 -7.10 130412.50 442162.50 -7.10 130407.50 442162.50 -7.50 130407.50 442167.50 -7.50 130412.50 442167.50 -7.50 130412.50 442162.50 -7.50
130407.50 442162.50 -7.50 130407.50 442167.50 -7.50 130412.50 442167.50 -7.50 130412.50 442162.50 -7.50 130407.50 442162.50 -7.80 130407.50 442167.50 -7.80 130412.50 442167.50 -7.80 130412.50 442162.50 -7.80
130407.50 442162.50 -7.80 130407.50 442167.50 -7.80 130412.50 442167.50 -7.80 130412.50 442162.50 -7.80 130407.50 442162.50 -8.60 130407.50 442167.50 -8.60 130412.50 442167.50 -8.60 130412.50 442162.50 -8.60
130407.50 442162.50 -8.60 130407.50 442167.50 -8.60 130412.50 442167.50 -8.60 130412.50 442162.50 -8.60 130407.50 442162.50 -9.00 130407.50 442167.50 -9.00 130412.50 442167.50 -9.00 130412.50 442162.50 -9.00
130407.50 442162.50 -9.00 130407.50 442167.50 -9.00 130412.50 442167.50 -9.00 130412.50 442162.50 -9.00 130407.50 442162.50 -10.30 130407.50 442167.50 -10.30 130412.50 442167.50 -10.30 130412.50 442162.50 -10.30
130407.50 442162.50 -10.30 130407.50 442167.50 -10.30 130412.50 442167.50 -10.30 130412.50 442162.50 -10.30 130407.50 442162.50 -13.20 130407.50 442167.50 -13.20 130412.50 442167.50 -13.20 130412.50 442162.50 -13.20
130407.50 442162.50 -13.20 130407.50 442167.50 -13.20 130412.50 442167.50 -13.20 130412.50 442162.50 -13.20 130407.50 442162.50 -14.40 130407.50 442167.50 -14.40 130412.50 442167.50 -14.40 130412.50 442162.50 -14.40
130407.50 442162.50 -14.40 130407.50 442167.50 -14.40 130412.50 442167.50 -14.40 130412.50 442162.50 -14.40 130407.50 442162.50 -16.30 130407.50 442167.50 -16.30 130412.50 442167.50 -16.30 130412.50 442162.50 -16.30
130407.50 442162.50 -16.30 130407.50 442167.50 -16.30 130412.50 442167.50 -16.30 130412.50 442162.50 -16.30 130407.50 442162.50 -17.00 130407.50 442167.50 -17.00 130412.50 442167.50 -17.00 130412.50 442162.50 -17.00
130407.50 442162.50 -17.00 130407.50 442167.50 -17.00 130412.50 442167.50 -17.00 130412.50 442162.50 -17.00 130407.50 442162.50 -17.90 130407.50 442167.50 -17.90 130412.50 442167.50 -17.90 130412.50 442162.50 -17.90
130407.50 442162.50 -17.90 130407.50 442167.50 -17.90 130412.50 442167.50 -17.90 130412.50 442162.50 -17.90 130407.50 442162.50 -19.50 130407.50 442167.50 -19.50 130412.50 442167.50 -19.50 130412.50 442162.50 -19.50
130407.50 442162.50 -19.50 130407.50 442167.50 -19.50 130412.50 442167.50 -19.50 130412.50 442162.50 -19.50 130407.50 442162.50 -21.00 130407.50 442167.50 -21.00 130412.50 442167.50 -21.00 130412.50 442162.50 -21.00
130407.50 442162.50 -21.00 130407.50 442167.50 -21.00 130412.50 442167.50 -21.00 130412.50 442162.50 -21.00 130407.50 442162.50 -25.50 130407.50 442167.50 -25.50 130412.50 442167.50 -25.50 130412.50 442162.50 -25.50

CELLS 17 153
8 4 7 6 5 0 3 2 1
8 12 15 14 13 8 11 10 9
8 20 23 22 21 16 19 18 17
8 28 31 30 29 24 27 26 25
8 36 39 38 37 32 35 34 33
8 44 47 46 45 40 43 42 41
8 52 55 54 53 48 51 50 49
8 60 63 62 61 56 59 58 57
8 68 71 70 69 64 67 66 65
8 76 79 78 77 72 75 74 73
8 84 87 86 85 80 83 82 81
8 92 95 94 93 88 91 90 89
8 100 103 102 101 96 99 98 97
8 108 111 110 109 104 107 106 105
8 116 119 118 117 112 115 114 113
8 124 127 126 125 120 123 122 121
8 132 135 134 133 128 131 130 129

CELL_TYPES 17
12
12
12
12
12
12
12
12
12
12
12
12
12
12
12
12
12

CELL_DATA 17
SCALARS Property_0 float
LOOKUP_TABLE custom_table
1.00
4.00
6.00
4.00
5.00
3.00
1.00
6.00
4.00
5.00
4.00
5.00
4.00
5.00
4.00
5.00
7.00
