# vtk DataFile Version 1.0
B38F0247.vtk
ASCII

DATASET UNSTRUCTURED_GRID
POINTS 48 float
132162.50 443437.50 2.20 132162.50 443442.50 2.20 132167.50 443442.50 2.20 132167.50 443437.50 2.20 132162.50 443437.50 1.60 132162.50 443442.50 1.60 132167.50 443442.50 1.60 132167.50 443437.50 1.60
132162.50 443437.50 1.60 132162.50 443442.50 1.60 132167.50 443442.50 1.60 132167.50 443437.50 1.60 132162.50 443437.50 -0.00 132162.50 443442.50 -0.00 132167.50 443442.50 -0.00 132167.50 443437.50 -0.00
132162.50 443437.50 -0.00 132162.50 443442.50 -0.00 132167.50 443442.50 -0.00 132167.50 443437.50 -0.00 132162.50 443437.50 -5.40 132162.50 443442.50 -5.40 132167.50 443442.50 -5.40 132167.50 443437.50 -5.40
132162.50 443437.50 -5.40 132162.50 443442.50 -5.40 132167.50 443442.50 -5.40 132167.50 443437.50 -5.40 132162.50 443437.50 -6.80 132162.50 443442.50 -6.80 132167.50 443442.50 -6.80 132167.50 443437.50 -6.80
132162.50 443437.50 -6.80 132162.50 443442.50 -6.80 132167.50 443442.50 -6.80 132167.50 443437.50 -6.80 132162.50 443437.50 -8.70 132162.50 443442.50 -8.70 132167.50 443442.50 -8.70 132167.50 443437.50 -8.70
132162.50 443437.50 -8.70 132162.50 443442.50 -8.70 132167.50 443442.50 -8.70 132167.50 443437.50 -8.70 132162.50 443437.50 -10.88 132162.50 443442.50 -10.88 132167.50 443442.50 -10.88 132167.50 443437.50 -10.88

CELLS 6 54
8 4 7 6 5 0 3 2 1
8 12 15 14 13 8 11 10 9
8 20 23 22 21 16 19 18 17
8 28 31 30 29 24 27 26 25
8 36 39 38 37 32 35 34 33
8 44 47 46 45 40 43 42 41

CELL_TYPES 6
12
12
12
12
12
12

CELL_DATA 6
SCALARS Property_0 float
LOOKUP_TABLE custom_table
1.00
6.00
7.00
0.00
4.00
1.00
