# vtk DataFile Version 1.0
B38F0028.vtk
ASCII

DATASET UNSTRUCTURED_GRID
POINTS 88 float
134473.50 446293.50 1.05 134473.50 446298.50 1.05 134478.50 446298.50 1.05 134478.50 446293.50 1.05 134473.50 446293.50 -0.10 134473.50 446298.50 -0.10 134478.50 446298.50 -0.10 134478.50 446293.50 -0.10
134473.50 446293.50 -0.10 134473.50 446298.50 -0.10 134478.50 446298.50 -0.10 134478.50 446293.50 -0.10 134473.50 446293.50 -0.40 134473.50 446298.50 -0.40 134478.50 446298.50 -0.40 134478.50 446293.50 -0.40
134473.50 446293.50 -0.40 134473.50 446298.50 -0.40 134478.50 446298.50 -0.40 134478.50 446293.50 -0.40 134473.50 446293.50 -2.75 134473.50 446298.50 -2.75 134478.50 446298.50 -2.75 134478.50 446293.50 -2.75
134473.50 446293.50 -2.75 134473.50 446298.50 -2.75 134478.50 446298.50 -2.75 134478.50 446293.50 -2.75 134473.50 446293.50 -3.25 134473.50 446298.50 -3.25 134478.50 446298.50 -3.25 134478.50 446293.50 -3.25
134473.50 446293.50 -3.25 134473.50 446298.50 -3.25 134478.50 446298.50 -3.25 134478.50 446293.50 -3.25 134473.50 446293.50 -3.60 134473.50 446298.50 -3.60 134478.50 446298.50 -3.60 134478.50 446293.50 -3.60
134473.50 446293.50 -3.60 134473.50 446298.50 -3.60 134478.50 446298.50 -3.60 134478.50 446293.50 -3.60 134473.50 446293.50 -7.30 134473.50 446298.50 -7.30 134478.50 446298.50 -7.30 134478.50 446293.50 -7.30
134473.50 446293.50 -7.30 134473.50 446298.50 -7.30 134478.50 446298.50 -7.30 134478.50 446293.50 -7.30 134473.50 446293.50 -13.70 134473.50 446298.50 -13.70 134478.50 446298.50 -13.70 134478.50 446293.50 -13.70
134473.50 446293.50 -13.70 134473.50 446298.50 -13.70 134478.50 446298.50 -13.70 134478.50 446293.50 -13.70 134473.50 446293.50 -16.50 134473.50 446298.50 -16.50 134478.50 446298.50 -16.50 134478.50 446293.50 -16.50
134473.50 446293.50 -16.50 134473.50 446298.50 -16.50 134478.50 446298.50 -16.50 134478.50 446293.50 -16.50 134473.50 446293.50 -17.10 134473.50 446298.50 -17.10 134478.50 446298.50 -17.10 134478.50 446293.50 -17.10
134473.50 446293.50 -17.10 134473.50 446298.50 -17.10 134478.50 446298.50 -17.10 134478.50 446293.50 -17.10 134473.50 446293.50 -18.70 134473.50 446298.50 -18.70 134478.50 446298.50 -18.70 134478.50 446293.50 -18.70
134473.50 446293.50 -18.70 134473.50 446298.50 -18.70 134478.50 446298.50 -18.70 134478.50 446293.50 -18.70 134473.50 446293.50 -22.65 134473.50 446298.50 -22.65 134478.50 446298.50 -22.65 134478.50 446293.50 -22.65

CELLS 11 99
8 4 7 6 5 0 3 2 1
8 12 15 14 13 8 11 10 9
8 20 23 22 21 16 19 18 17
8 28 31 30 29 24 27 26 25
8 36 39 38 37 32 35 34 33
8 44 47 46 45 40 43 42 41
8 52 55 54 53 48 51 50 49
8 60 63 62 61 56 59 58 57
8 68 71 70 69 64 67 66 65
8 76 79 78 77 72 75 74 73
8 84 87 86 85 80 83 82 81

CELL_TYPES 11
12
12
12
12
12
12
12
12
12
12
12

CELL_DATA 11
SCALARS Property_0 float
LOOKUP_TABLE custom_table
0.00
1.00
3.00
1.00
3.00
1.00
7.00
0.00
5.00
0.00
5.00
