# vtk DataFile Version 1.0
B38F1897.vtk
ASCII

DATASET UNSTRUCTURED_GRID
POINTS 64 float
137799.50 443863.50 1.91 137799.50 443868.50 1.91 137804.50 443868.50 1.91 137804.50 443863.50 1.91 137799.50 443863.50 0.81 137799.50 443868.50 0.81 137804.50 443868.50 0.81 137804.50 443863.50 0.81
137799.50 443863.50 0.81 137799.50 443868.50 0.81 137804.50 443868.50 0.81 137804.50 443863.50 0.81 137799.50 443863.50 0.28 137799.50 443868.50 0.28 137804.50 443868.50 0.28 137804.50 443863.50 0.28
137799.50 443863.50 0.28 137799.50 443868.50 0.28 137804.50 443868.50 0.28 137804.50 443863.50 0.28 137799.50 443863.50 -0.63 137799.50 443868.50 -0.63 137804.50 443868.50 -0.63 137804.50 443863.50 -0.63
137799.50 443863.50 -0.63 137799.50 443868.50 -0.63 137804.50 443868.50 -0.63 137804.50 443863.50 -0.63 137799.50 443863.50 -1.54 137799.50 443868.50 -1.54 137804.50 443868.50 -1.54 137804.50 443863.50 -1.54
137799.50 443863.50 -1.54 137799.50 443868.50 -1.54 137804.50 443868.50 -1.54 137804.50 443863.50 -1.54 137799.50 443863.50 -2.54 137799.50 443868.50 -2.54 137804.50 443868.50 -2.54 137804.50 443863.50 -2.54
137799.50 443863.50 -2.54 137799.50 443868.50 -2.54 137804.50 443868.50 -2.54 137804.50 443863.50 -2.54 137799.50 443863.50 -4.63 137799.50 443868.50 -4.63 137804.50 443868.50 -4.63 137804.50 443863.50 -4.63
137799.50 443863.50 -4.63 137799.50 443868.50 -4.63 137804.50 443868.50 -4.63 137804.50 443863.50 -4.63 137799.50 443863.50 -4.94 137799.50 443868.50 -4.94 137804.50 443868.50 -4.94 137804.50 443863.50 -4.94
137799.50 443863.50 -4.94 137799.50 443868.50 -4.94 137804.50 443868.50 -4.94 137804.50 443863.50 -4.94 137799.50 443863.50 -6.31 137799.50 443868.50 -6.31 137804.50 443868.50 -6.31 137804.50 443863.50 -6.31

CELLS 8 72
8 4 7 6 5 0 3 2 1
8 12 15 14 13 8 11 10 9
8 20 23 22 21 16 19 18 17
8 28 31 30 29 24 27 26 25
8 36 39 38 37 32 35 34 33
8 44 47 46 45 40 43 42 41
8 52 55 54 53 48 51 50 49
8 60 63 62 61 56 59 58 57

CELL_TYPES 8
12
12
12
12
12
12
12
12

CELL_DATA 8
SCALARS Property_0 float
LOOKUP_TABLE custom_table
1.00
6.00
1.00
0.00
1.00
3.00
1.00
0.00
