# vtk DataFile Version 1.0
B38F1855.vtk
ASCII

DATASET UNSTRUCTURED_GRID
POINTS 32 float
132949.50 443697.50 7.00 132949.50 443702.50 7.00 132954.50 443702.50 7.00 132954.50 443697.50 7.00 132949.50 443697.50 6.10 132949.50 443702.50 6.10 132954.50 443702.50 6.10 132954.50 443697.50 6.10
132949.50 443697.50 6.10 132949.50 443702.50 6.10 132954.50 443702.50 6.10 132954.50 443697.50 6.10 132949.50 443697.50 1.77 132949.50 443702.50 1.77 132954.50 443702.50 1.77 132954.50 443697.50 1.77
132949.50 443697.50 1.77 132949.50 443702.50 1.77 132954.50 443702.50 1.77 132954.50 443697.50 1.77 132949.50 443697.50 -6.70 132949.50 443702.50 -6.70 132954.50 443702.50 -6.70 132954.50 443697.50 -6.70
132949.50 443697.50 -6.70 132949.50 443702.50 -6.70 132954.50 443702.50 -6.70 132954.50 443697.50 -6.70 132949.50 443697.50 -9.44 132949.50 443702.50 -9.44 132954.50 443702.50 -9.44 132954.50 443697.50 -9.44

CELLS 4 36
8 4 7 6 5 0 3 2 1
8 12 15 14 13 8 11 10 9
8 20 23 22 21 16 19 18 17
8 28 31 30 29 24 27 26 25

CELL_TYPES 4
12
12
12
12

CELL_DATA 4
SCALARS Property_0 float
LOOKUP_TABLE custom_table
0.00
1.00
0.00
0.00
