# vtk DataFile Version 1.0
B38F2030.vtk
ASCII

DATASET UNSTRUCTURED_GRID
POINTS 16 float
137696.50 444047.50 3.87 137696.50 444052.50 3.87 137701.50 444052.50 3.87 137701.50 444047.50 3.87 137696.50 444047.50 3.27 137696.50 444052.50 3.27 137701.50 444052.50 3.27 137701.50 444047.50 3.27
137696.50 444047.50 3.27 137696.50 444052.50 3.27 137701.50 444052.50 3.27 137701.50 444047.50 3.27 137696.50 444047.50 3.15 137696.50 444052.50 3.15 137701.50 444052.50 3.15 137701.50 444047.50 3.15

CELLS 2 18
8 4 7 6 5 0 3 2 1
8 12 15 14 13 8 11 10 9

CELL_TYPES 2
12
12

CELL_DATA 2
SCALARS Property_0 float
LOOKUP_TABLE custom_table
6.00
4.00
