# vtk DataFile Version 1.0
B38F0205.vtk
ASCII

DATASET UNSTRUCTURED_GRID
POINTS 64 float
131662.50 443607.50 2.20 131662.50 443612.50 2.20 131667.50 443612.50 2.20 131667.50 443607.50 2.20 131662.50 443607.50 0.30 131662.50 443612.50 0.30 131667.50 443612.50 0.30 131667.50 443607.50 0.30
131662.50 443607.50 0.30 131662.50 443612.50 0.30 131667.50 443612.50 0.30 131667.50 443607.50 0.30 131662.50 443607.50 -2.10 131662.50 443612.50 -2.10 131667.50 443612.50 -2.10 131667.50 443607.50 -2.10
131662.50 443607.50 -2.10 131662.50 443612.50 -2.10 131667.50 443612.50 -2.10 131667.50 443607.50 -2.10 131662.50 443607.50 -2.30 131662.50 443612.50 -2.30 131667.50 443612.50 -2.30 131667.50 443607.50 -2.30
131662.50 443607.50 -2.30 131662.50 443612.50 -2.30 131667.50 443612.50 -2.30 131667.50 443607.50 -2.30 131662.50 443607.50 -3.90 131662.50 443612.50 -3.90 131667.50 443612.50 -3.90 131667.50 443607.50 -3.90
131662.50 443607.50 -3.90 131662.50 443612.50 -3.90 131667.50 443612.50 -3.90 131667.50 443607.50 -3.90 131662.50 443607.50 -5.80 131662.50 443612.50 -5.80 131667.50 443612.50 -5.80 131667.50 443607.50 -5.80
131662.50 443607.50 -5.80 131662.50 443612.50 -5.80 131667.50 443612.50 -5.80 131667.50 443607.50 -5.80 131662.50 443607.50 -7.60 131662.50 443612.50 -7.60 131667.50 443612.50 -7.60 131667.50 443607.50 -7.60
131662.50 443607.50 -7.60 131662.50 443612.50 -7.60 131667.50 443612.50 -7.60 131667.50 443607.50 -7.60 131662.50 443607.50 -8.60 131662.50 443612.50 -8.60 131667.50 443612.50 -8.60 131667.50 443607.50 -8.60
131662.50 443607.50 -8.60 131662.50 443612.50 -8.60 131667.50 443612.50 -8.60 131667.50 443607.50 -8.60 131662.50 443607.50 -10.76 131662.50 443612.50 -10.76 131667.50 443612.50 -10.76 131667.50 443607.50 -10.76

CELLS 8 72
8 4 7 6 5 0 3 2 1
8 12 15 14 13 8 11 10 9
8 20 23 22 21 16 19 18 17
8 28 31 30 29 24 27 26 25
8 36 39 38 37 32 35 34 33
8 44 47 46 45 40 43 42 41
8 52 55 54 53 48 51 50 49
8 60 63 62 61 56 59 58 57

CELL_TYPES 8
12
12
12
12
12
12
12
12

CELL_DATA 8
SCALARS Property_0 float
LOOKUP_TABLE custom_table
1.00
7.00
1.00
7.00
0.00
4.00
1.00
0.00
