# vtk DataFile Version 1.0
B38F0191.vtk
ASCII

DATASET UNSTRUCTURED_GRID
POINTS 56 float
132007.50 443662.50 2.30 132007.50 443667.50 2.30 132012.50 443667.50 2.30 132012.50 443662.50 2.30 132007.50 443662.50 1.55 132007.50 443667.50 1.55 132012.50 443667.50 1.55 132012.50 443662.50 1.55
132007.50 443662.50 1.55 132007.50 443667.50 1.55 132012.50 443667.50 1.55 132012.50 443662.50 1.55 132007.50 443662.50 -1.10 132007.50 443667.50 -1.10 132012.50 443667.50 -1.10 132012.50 443662.50 -1.10
132007.50 443662.50 -1.10 132007.50 443667.50 -1.10 132012.50 443667.50 -1.10 132012.50 443662.50 -1.10 132007.50 443662.50 -5.10 132007.50 443667.50 -5.10 132012.50 443667.50 -5.10 132012.50 443662.50 -5.10
132007.50 443662.50 -5.10 132007.50 443667.50 -5.10 132012.50 443667.50 -5.10 132012.50 443662.50 -5.10 132007.50 443662.50 -7.10 132007.50 443667.50 -7.10 132012.50 443667.50 -7.10 132012.50 443662.50 -7.10
132007.50 443662.50 -7.10 132007.50 443667.50 -7.10 132012.50 443667.50 -7.10 132012.50 443662.50 -7.10 132007.50 443662.50 -7.50 132007.50 443667.50 -7.50 132012.50 443667.50 -7.50 132012.50 443662.50 -7.50
132007.50 443662.50 -7.50 132007.50 443667.50 -7.50 132012.50 443667.50 -7.50 132012.50 443662.50 -7.50 132007.50 443662.50 -9.40 132007.50 443667.50 -9.40 132012.50 443667.50 -9.40 132012.50 443662.50 -9.40
132007.50 443662.50 -9.40 132007.50 443667.50 -9.40 132012.50 443667.50 -9.40 132012.50 443662.50 -9.40 132007.50 443662.50 -11.74 132007.50 443667.50 -11.74 132012.50 443667.50 -11.74 132012.50 443662.50 -11.74

CELLS 7 63
8 4 7 6 5 0 3 2 1
8 12 15 14 13 8 11 10 9
8 20 23 22 21 16 19 18 17
8 28 31 30 29 24 27 26 25
8 36 39 38 37 32 35 34 33
8 44 47 46 45 40 43 42 41
8 52 55 54 53 48 51 50 49

CELL_TYPES 7
12
12
12
12
12
12
12

CELL_DATA 7
SCALARS Property_0 float
LOOKUP_TABLE custom_table
6.00
7.00
4.00
6.00
3.00
6.00
5.00
