# vtk DataFile Version 1.0
B38F0074.vtk
ASCII

DATASET UNSTRUCTURED_GRID
POINTS 32 float
136210.50 442437.50 0.93 136210.50 442442.50 0.93 136215.50 442442.50 0.93 136215.50 442437.50 0.93 136210.50 442437.50 -1.27 136210.50 442442.50 -1.27 136215.50 442442.50 -1.27 136215.50 442437.50 -1.27
136210.50 442437.50 -1.27 136210.50 442442.50 -1.27 136215.50 442442.50 -1.27 136215.50 442437.50 -1.27 136210.50 442437.50 -3.52 136210.50 442442.50 -3.52 136215.50 442442.50 -3.52 136215.50 442437.50 -3.52
136210.50 442437.50 -3.52 136210.50 442442.50 -3.52 136215.50 442442.50 -3.52 136215.50 442437.50 -3.52 136210.50 442437.50 -4.17 136210.50 442442.50 -4.17 136215.50 442442.50 -4.17 136215.50 442437.50 -4.17
136210.50 442437.50 -4.17 136210.50 442442.50 -4.17 136215.50 442442.50 -4.17 136215.50 442437.50 -4.17 136210.50 442437.50 -5.19 136210.50 442442.50 -5.19 136215.50 442442.50 -5.19 136215.50 442437.50 -5.19

CELLS 4 36
8 4 7 6 5 0 3 2 1
8 12 15 14 13 8 11 10 9
8 20 23 22 21 16 19 18 17
8 28 31 30 29 24 27 26 25

CELL_TYPES 4
12
12
12
12

CELL_DATA 4
SCALARS Property_0 float
LOOKUP_TABLE custom_table
1.00
3.00
1.00
0.00
