# vtk DataFile Version 1.0
B38F1287.vtk
ASCII

DATASET UNSTRUCTURED_GRID
POINTS 32 float
136734.50 443953.50 2.00 136734.50 443958.50 2.00 136739.50 443958.50 2.00 136739.50 443953.50 2.00 136734.50 443953.50 1.50 136734.50 443958.50 1.50 136739.50 443958.50 1.50 136739.50 443953.50 1.50
136734.50 443953.50 1.50 136734.50 443958.50 1.50 136739.50 443958.50 1.50 136739.50 443953.50 1.50 136734.50 443953.50 0.90 136734.50 443958.50 0.90 136739.50 443958.50 0.90 136739.50 443953.50 0.90
136734.50 443953.50 0.90 136734.50 443958.50 0.90 136739.50 443958.50 0.90 136739.50 443953.50 0.90 136734.50 443953.50 -2.50 136734.50 443958.50 -2.50 136739.50 443958.50 -2.50 136739.50 443953.50 -2.50
136734.50 443953.50 -2.50 136734.50 443958.50 -2.50 136739.50 443958.50 -2.50 136739.50 443953.50 -2.50 136734.50 443953.50 -3.40 136734.50 443958.50 -3.40 136739.50 443958.50 -3.40 136739.50 443953.50 -3.40

CELLS 4 36
8 4 7 6 5 0 3 2 1
8 12 15 14 13 8 11 10 9
8 20 23 22 21 16 19 18 17
8 28 31 30 29 24 27 26 25

CELL_TYPES 4
12
12
12
12

CELL_DATA 4
SCALARS Property_0 float
LOOKUP_TABLE custom_table
1.00
6.00
5.00
1.00
