# vtk DataFile Version 1.0
B38F0291.vtk
ASCII

DATASET UNSTRUCTURED_GRID
POINTS 48 float
137657.50 444827.50 2.75 137657.50 444832.50 2.75 137662.50 444832.50 2.75 137662.50 444827.50 2.75 137657.50 444827.50 2.20 137657.50 444832.50 2.20 137662.50 444832.50 2.20 137662.50 444827.50 2.20
137657.50 444827.50 2.20 137657.50 444832.50 2.20 137662.50 444832.50 2.20 137662.50 444827.50 2.20 137657.50 444827.50 -2.45 137657.50 444832.50 -2.45 137662.50 444832.50 -2.45 137662.50 444827.50 -2.45
137657.50 444827.50 -2.45 137657.50 444832.50 -2.45 137662.50 444832.50 -2.45 137662.50 444827.50 -2.45 137657.50 444827.50 -3.00 137657.50 444832.50 -3.00 137662.50 444832.50 -3.00 137662.50 444827.50 -3.00
137657.50 444827.50 -3.00 137657.50 444832.50 -3.00 137662.50 444832.50 -3.00 137662.50 444827.50 -3.00 137657.50 444827.50 -6.00 137657.50 444832.50 -6.00 137662.50 444832.50 -6.00 137662.50 444827.50 -6.00
137657.50 444827.50 -6.00 137657.50 444832.50 -6.00 137662.50 444832.50 -6.00 137662.50 444827.50 -6.00 137657.50 444827.50 -7.85 137657.50 444832.50 -7.85 137662.50 444832.50 -7.85 137662.50 444827.50 -7.85
137657.50 444827.50 -7.85 137657.50 444832.50 -7.85 137662.50 444832.50 -7.85 137662.50 444827.50 -7.85 137657.50 444827.50 -9.97 137657.50 444832.50 -9.97 137662.50 444832.50 -9.97 137662.50 444827.50 -9.97

CELLS 6 54
8 4 7 6 5 0 3 2 1
8 12 15 14 13 8 11 10 9
8 20 23 22 21 16 19 18 17
8 28 31 30 29 24 27 26 25
8 36 39 38 37 32 35 34 33
8 44 47 46 45 40 43 42 41

CELL_TYPES 6
12
12
12
12
12
12

CELL_DATA 6
SCALARS Property_0 float
LOOKUP_TABLE custom_table
6.00
4.00
6.00
3.00
6.00
5.00
