# vtk DataFile Version 1.0
B38F1943.vtk
ASCII

DATASET UNSTRUCTURED_GRID
POINTS 40 float
137721.50 443878.50 1.50 137721.50 443883.50 1.50 137726.50 443883.50 1.50 137726.50 443878.50 1.50 137721.50 443878.50 0.31 137721.50 443883.50 0.31 137726.50 443883.50 0.31 137726.50 443878.50 0.31
137721.50 443878.50 0.31 137721.50 443883.50 0.31 137726.50 443883.50 0.31 137726.50 443878.50 0.31 137721.50 443878.50 -2.23 137721.50 443883.50 -2.23 137726.50 443883.50 -2.23 137726.50 443878.50 -2.23
137721.50 443878.50 -2.23 137721.50 443883.50 -2.23 137726.50 443883.50 -2.23 137726.50 443878.50 -2.23 137721.50 443878.50 -4.30 137721.50 443883.50 -4.30 137726.50 443883.50 -4.30 137726.50 443878.50 -4.30
137721.50 443878.50 -4.30 137721.50 443883.50 -4.30 137726.50 443883.50 -4.30 137726.50 443878.50 -4.30 137721.50 443878.50 -4.66 137721.50 443883.50 -4.66 137726.50 443883.50 -4.66 137726.50 443878.50 -4.66
137721.50 443878.50 -4.66 137721.50 443883.50 -4.66 137726.50 443883.50 -4.66 137726.50 443878.50 -4.66 137721.50 443878.50 -5.89 137721.50 443883.50 -5.89 137726.50 443883.50 -5.89 137726.50 443878.50 -5.89

CELLS 5 45
8 4 7 6 5 0 3 2 1
8 12 15 14 13 8 11 10 9
8 20 23 22 21 16 19 18 17
8 28 31 30 29 24 27 26 25
8 36 39 38 37 32 35 34 33

CELL_TYPES 5
12
12
12
12
12

CELL_DATA 5
SCALARS Property_0 float
LOOKUP_TABLE custom_table
6.00
1.00
3.00
1.00
0.00
