# vtk DataFile Version 1.0
B38F1279.vtk
ASCII

DATASET UNSTRUCTURED_GRID
POINTS 16 float
135726.50 443704.50 1.85 135726.50 443709.50 1.85 135731.50 443709.50 1.85 135731.50 443704.50 1.85 135726.50 443704.50 1.35 135726.50 443709.50 1.35 135731.50 443709.50 1.35 135731.50 443704.50 1.35
135726.50 443704.50 1.35 135726.50 443709.50 1.35 135731.50 443709.50 1.35 135731.50 443704.50 1.35 135726.50 443704.50 1.25 135726.50 443709.50 1.25 135731.50 443709.50 1.25 135731.50 443704.50 1.25

CELLS 2 18
8 4 7 6 5 0 3 2 1
8 12 15 14 13 8 11 10 9

CELL_TYPES 2
12
12

CELL_DATA 2
SCALARS Property_0 float
LOOKUP_TABLE custom_table
6.00
0.00
