# vtk DataFile Version 1.0
B38F1902.vtk
ASCII

DATASET UNSTRUCTURED_GRID
POINTS 24 float
137605.50 444053.50 7.50 137605.50 444058.50 7.50 137610.50 444058.50 7.50 137610.50 444053.50 7.50 137605.50 444053.50 6.42 137605.50 444058.50 6.42 137610.50 444058.50 6.42 137610.50 444053.50 6.42
137605.50 444053.50 6.42 137605.50 444058.50 6.42 137610.50 444058.50 6.42 137610.50 444053.50 6.42 137605.50 444053.50 0.87 137605.50 444058.50 0.87 137610.50 444058.50 0.87 137610.50 444053.50 0.87
137605.50 444053.50 0.87 137605.50 444058.50 0.87 137610.50 444058.50 0.87 137610.50 444053.50 0.87 137605.50 444053.50 -0.46 137605.50 444058.50 -0.46 137610.50 444058.50 -0.46 137610.50 444053.50 -0.46

CELLS 3 27
8 4 7 6 5 0 3 2 1
8 12 15 14 13 8 11 10 9
8 20 23 22 21 16 19 18 17

CELL_TYPES 3
12
12
12

CELL_DATA 3
SCALARS Property_0 float
LOOKUP_TABLE custom_table
0.00
1.00
0.00
