# vtk DataFile Version 1.0
B38F0275.vtk
ASCII

DATASET UNSTRUCTURED_GRID
POINTS 96 float
137687.50 444847.50 2.60 137687.50 444852.50 2.60 137692.50 444852.50 2.60 137692.50 444847.50 2.60 137687.50 444847.50 1.10 137687.50 444852.50 1.10 137692.50 444852.50 1.10 137692.50 444847.50 1.10
137687.50 444847.50 1.10 137687.50 444852.50 1.10 137692.50 444852.50 1.10 137692.50 444847.50 1.10 137687.50 444847.50 -0.40 137687.50 444852.50 -0.40 137692.50 444852.50 -0.40 137692.50 444847.50 -0.40
137687.50 444847.50 -0.40 137687.50 444852.50 -0.40 137692.50 444852.50 -0.40 137692.50 444847.50 -0.40 137687.50 444847.50 -2.40 137687.50 444852.50 -2.40 137692.50 444852.50 -2.40 137692.50 444847.50 -2.40
137687.50 444847.50 -2.40 137687.50 444852.50 -2.40 137692.50 444852.50 -2.40 137692.50 444847.50 -2.40 137687.50 444847.50 -3.70 137687.50 444852.50 -3.70 137692.50 444852.50 -3.70 137692.50 444847.50 -3.70
137687.50 444847.50 -3.70 137687.50 444852.50 -3.70 137692.50 444852.50 -3.70 137692.50 444847.50 -3.70 137687.50 444847.50 -4.80 137687.50 444852.50 -4.80 137692.50 444852.50 -4.80 137692.50 444847.50 -4.80
137687.50 444847.50 -4.80 137687.50 444852.50 -4.80 137692.50 444852.50 -4.80 137692.50 444847.50 -4.80 137687.50 444847.50 -5.40 137687.50 444852.50 -5.40 137692.50 444852.50 -5.40 137692.50 444847.50 -5.40
137687.50 444847.50 -5.40 137687.50 444852.50 -5.40 137692.50 444852.50 -5.40 137692.50 444847.50 -5.40 137687.50 444847.50 -7.00 137687.50 444852.50 -7.00 137692.50 444852.50 -7.00 137692.50 444847.50 -7.00
137687.50 444847.50 -7.00 137687.50 444852.50 -7.00 137692.50 444852.50 -7.00 137692.50 444847.50 -7.00 137687.50 444847.50 -8.90 137687.50 444852.50 -8.90 137692.50 444852.50 -8.90 137692.50 444847.50 -8.90
137687.50 444847.50 -8.90 137687.50 444852.50 -8.90 137692.50 444852.50 -8.90 137692.50 444847.50 -8.90 137687.50 444847.50 -15.90 137687.50 444852.50 -15.90 137692.50 444852.50 -15.90 137692.50 444847.50 -15.90
137687.50 444847.50 -15.90 137687.50 444852.50 -15.90 137692.50 444852.50 -15.90 137692.50 444847.50 -15.90 137687.50 444847.50 -19.00 137687.50 444852.50 -19.00 137692.50 444852.50 -19.00 137692.50 444847.50 -19.00
137687.50 444847.50 -19.00 137687.50 444852.50 -19.00 137692.50 444852.50 -19.00 137692.50 444847.50 -19.00 137687.50 444847.50 -20.40 137687.50 444852.50 -20.40 137692.50 444852.50 -20.40 137692.50 444847.50 -20.40
137687.50 444847.50 -20.40 137687.50 444852.50 -20.40 137692.50 444852.50 -20.40 137692.50 444847.50 -20.40 137687.50 444847.50 -25.00 137687.50 444852.50 -25.00 137692.50 444852.50 -25.00 137692.50 444847.50 -25.00

CELLS 12 108
8 4 7 6 5 0 3 2 1
8 12 15 14 13 8 11 10 9
8 20 23 22 21 16 19 18 17
8 28 31 30 29 24 27 26 25
8 36 39 38 37 32 35 34 33
8 44 47 46 45 40 43 42 41
8 52 55 54 53 48 51 50 49
8 60 63 62 61 56 59 58 57
8 68 71 70 69 64 67 66 65
8 76 79 78 77 72 75 74 73
8 84 87 86 85 80 83 82 81
8 92 95 94 93 88 91 90 89

CELL_TYPES 12
12
12
12
12
12
12
12
12
12
12
12
12

CELL_DATA 12
SCALARS Property_0 float
LOOKUP_TABLE custom_table
6.00
0.00
5.00
4.00
6.00
3.00
1.00
0.00
4.00
8.00
5.00
0.00
