# vtk DataFile Version 1.0
B38F0459.vtk
ASCII

DATASET UNSTRUCTURED_GRID
POINTS 104 float
136397.50 446147.50 4.00 136397.50 446152.50 4.00 136402.50 446152.50 4.00 136402.50 446147.50 4.00 136397.50 446147.50 1.70 136397.50 446152.50 1.70 136402.50 446152.50 1.70 136402.50 446147.50 1.70
136397.50 446147.50 1.70 136397.50 446152.50 1.70 136402.50 446152.50 1.70 136402.50 446147.50 1.70 136397.50 446147.50 -0.45 136397.50 446152.50 -0.45 136402.50 446152.50 -0.45 136402.50 446147.50 -0.45
136397.50 446147.50 -0.45 136397.50 446152.50 -0.45 136402.50 446152.50 -0.45 136402.50 446147.50 -0.45 136397.50 446147.50 -0.55 136397.50 446152.50 -0.55 136402.50 446152.50 -0.55 136402.50 446147.50 -0.55
136397.50 446147.50 -0.55 136397.50 446152.50 -0.55 136402.50 446152.50 -0.55 136402.50 446147.50 -0.55 136397.50 446147.50 -1.80 136397.50 446152.50 -1.80 136402.50 446152.50 -1.80 136402.50 446147.50 -1.80
136397.50 446147.50 -1.80 136397.50 446152.50 -1.80 136402.50 446152.50 -1.80 136402.50 446147.50 -1.80 136397.50 446147.50 -2.15 136397.50 446152.50 -2.15 136402.50 446152.50 -2.15 136402.50 446147.50 -2.15
136397.50 446147.50 -2.15 136397.50 446152.50 -2.15 136402.50 446152.50 -2.15 136402.50 446147.50 -2.15 136397.50 446147.50 -4.10 136397.50 446152.50 -4.10 136402.50 446152.50 -4.10 136402.50 446147.50 -4.10
136397.50 446147.50 -4.10 136397.50 446152.50 -4.10 136402.50 446152.50 -4.10 136402.50 446147.50 -4.10 136397.50 446147.50 -4.85 136397.50 446152.50 -4.85 136402.50 446152.50 -4.85 136402.50 446147.50 -4.85
136397.50 446147.50 -4.85 136397.50 446152.50 -4.85 136402.50 446152.50 -4.85 136402.50 446147.50 -4.85 136397.50 446147.50 -5.80 136397.50 446152.50 -5.80 136402.50 446152.50 -5.80 136402.50 446147.50 -5.80
136397.50 446147.50 -5.80 136397.50 446152.50 -5.80 136402.50 446152.50 -5.80 136402.50 446147.50 -5.80 136397.50 446147.50 -6.55 136397.50 446152.50 -6.55 136402.50 446152.50 -6.55 136402.50 446147.50 -6.55
136397.50 446147.50 -6.55 136397.50 446152.50 -6.55 136402.50 446152.50 -6.55 136402.50 446147.50 -6.55 136397.50 446147.50 -6.75 136397.50 446152.50 -6.75 136402.50 446152.50 -6.75 136402.50 446147.50 -6.75
136397.50 446147.50 -6.75 136397.50 446152.50 -6.75 136402.50 446152.50 -6.75 136402.50 446147.50 -6.75 136397.50 446147.50 -8.90 136397.50 446152.50 -8.90 136402.50 446152.50 -8.90 136402.50 446147.50 -8.90
136397.50 446147.50 -8.90 136397.50 446152.50 -8.90 136402.50 446152.50 -8.90 136402.50 446147.50 -8.90 136397.50 446147.50 -9.50 136397.50 446152.50 -9.50 136402.50 446152.50 -9.50 136402.50 446147.50 -9.50
136397.50 446147.50 -9.50 136397.50 446152.50 -9.50 136402.50 446152.50 -9.50 136402.50 446147.50 -9.50 136397.50 446147.50 -12.20 136397.50 446152.50 -12.20 136402.50 446152.50 -12.20 136402.50 446147.50 -12.20

CELLS 13 117
8 4 7 6 5 0 3 2 1
8 12 15 14 13 8 11 10 9
8 20 23 22 21 16 19 18 17
8 28 31 30 29 24 27 26 25
8 36 39 38 37 32 35 34 33
8 44 47 46 45 40 43 42 41
8 52 55 54 53 48 51 50 49
8 60 63 62 61 56 59 58 57
8 68 71 70 69 64 67 66 65
8 76 79 78 77 72 75 74 73
8 84 87 86 85 80 83 82 81
8 92 95 94 93 88 91 90 89
8 100 103 102 101 96 99 98 97

CELL_TYPES 13
12
12
12
12
12
12
12
12
12
12
12
12
12

CELL_DATA 13
SCALARS Property_0 float
LOOKUP_TABLE custom_table
1.00
4.00
3.00
1.00
6.00
1.00
3.00
1.00
3.00
1.00
7.00
4.00
0.00
