# vtk DataFile Version 1.0
B38F1386.vtk
ASCII

DATASET UNSTRUCTURED_GRID
POINTS 48 float
135947.50 445246.50 0.30 135947.50 445251.50 0.30 135952.50 445251.50 0.30 135952.50 445246.50 0.30 135947.50 445246.50 -1.00 135947.50 445251.50 -1.00 135952.50 445251.50 -1.00 135952.50 445246.50 -1.00
135947.50 445246.50 -1.00 135947.50 445251.50 -1.00 135952.50 445251.50 -1.00 135952.50 445246.50 -1.00 135947.50 445246.50 -1.80 135947.50 445251.50 -1.80 135952.50 445251.50 -1.80 135952.50 445246.50 -1.80
135947.50 445246.50 -1.80 135947.50 445251.50 -1.80 135952.50 445251.50 -1.80 135952.50 445246.50 -1.80 135947.50 445246.50 -2.30 135947.50 445251.50 -2.30 135952.50 445251.50 -2.30 135952.50 445246.50 -2.30
135947.50 445246.50 -2.30 135947.50 445251.50 -2.30 135952.50 445251.50 -2.30 135952.50 445246.50 -2.30 135947.50 445246.50 -4.50 135947.50 445251.50 -4.50 135952.50 445251.50 -4.50 135952.50 445246.50 -4.50
135947.50 445246.50 -4.50 135947.50 445251.50 -4.50 135952.50 445251.50 -4.50 135952.50 445246.50 -4.50 135947.50 445246.50 -4.60 135947.50 445251.50 -4.60 135952.50 445251.50 -4.60 135952.50 445246.50 -4.60
135947.50 445246.50 -4.60 135947.50 445251.50 -4.60 135952.50 445251.50 -4.60 135952.50 445246.50 -4.60 135947.50 445246.50 -5.58 135947.50 445251.50 -5.58 135952.50 445251.50 -5.58 135952.50 445246.50 -5.58

CELLS 6 54
8 4 7 6 5 0 3 2 1
8 12 15 14 13 8 11 10 9
8 20 23 22 21 16 19 18 17
8 28 31 30 29 24 27 26 25
8 36 39 38 37 32 35 34 33
8 44 47 46 45 40 43 42 41

CELL_TYPES 6
12
12
12
12
12
12

CELL_DATA 6
SCALARS Property_0 float
LOOKUP_TABLE custom_table
1.00
6.00
1.00
3.00
6.00
5.00
