# vtk DataFile Version 1.0
B38F0190.vtk
ASCII

DATASET UNSTRUCTURED_GRID
POINTS 80 float
131805.50 443806.50 4.20 131805.50 443811.50 4.20 131810.50 443811.50 4.20 131810.50 443806.50 4.20 131805.50 443806.50 2.60 131805.50 443811.50 2.60 131810.50 443811.50 2.60 131810.50 443806.50 2.60
131805.50 443806.50 2.60 131805.50 443811.50 2.60 131810.50 443811.50 2.60 131810.50 443806.50 2.60 131805.50 443806.50 2.30 131805.50 443811.50 2.30 131810.50 443811.50 2.30 131810.50 443806.50 2.30
131805.50 443806.50 2.30 131805.50 443811.50 2.30 131810.50 443811.50 2.30 131810.50 443806.50 2.30 131805.50 443806.50 1.50 131805.50 443811.50 1.50 131810.50 443811.50 1.50 131810.50 443806.50 1.50
131805.50 443806.50 1.50 131805.50 443811.50 1.50 131810.50 443811.50 1.50 131810.50 443806.50 1.50 131805.50 443806.50 -1.10 131805.50 443811.50 -1.10 131810.50 443811.50 -1.10 131810.50 443806.50 -1.10
131805.50 443806.50 -1.10 131805.50 443811.50 -1.10 131810.50 443811.50 -1.10 131810.50 443806.50 -1.10 131805.50 443806.50 -1.50 131805.50 443811.50 -1.50 131810.50 443811.50 -1.50 131810.50 443806.50 -1.50
131805.50 443806.50 -1.50 131805.50 443811.50 -1.50 131810.50 443811.50 -1.50 131810.50 443806.50 -1.50 131805.50 443806.50 -5.70 131805.50 443811.50 -5.70 131810.50 443811.50 -5.70 131810.50 443806.50 -5.70
131805.50 443806.50 -5.70 131805.50 443811.50 -5.70 131810.50 443811.50 -5.70 131810.50 443806.50 -5.70 131805.50 443806.50 -6.10 131805.50 443811.50 -6.10 131810.50 443811.50 -6.10 131810.50 443806.50 -6.10
131805.50 443806.50 -6.10 131805.50 443811.50 -6.10 131810.50 443811.50 -6.10 131810.50 443806.50 -6.10 131805.50 443806.50 -7.80 131805.50 443811.50 -7.80 131810.50 443811.50 -7.80 131810.50 443806.50 -7.80
131805.50 443806.50 -7.80 131805.50 443811.50 -7.80 131810.50 443811.50 -7.80 131810.50 443806.50 -7.80 131805.50 443806.50 -8.10 131805.50 443811.50 -8.10 131810.50 443811.50 -8.10 131810.50 443806.50 -8.10
131805.50 443806.50 -8.10 131805.50 443811.50 -8.10 131810.50 443811.50 -8.10 131810.50 443806.50 -8.10 131805.50 443806.50 -10.56 131805.50 443811.50 -10.56 131810.50 443811.50 -10.56 131810.50 443806.50 -10.56

CELLS 10 90
8 4 7 6 5 0 3 2 1
8 12 15 14 13 8 11 10 9
8 20 23 22 21 16 19 18 17
8 28 31 30 29 24 27 26 25
8 36 39 38 37 32 35 34 33
8 44 47 46 45 40 43 42 41
8 52 55 54 53 48 51 50 49
8 60 63 62 61 56 59 58 57
8 68 71 70 69 64 67 66 65
8 76 79 78 77 72 75 74 73

CELL_TYPES 10
12
12
12
12
12
12
12
12
12
12

CELL_DATA 10
SCALARS Property_0 float
LOOKUP_TABLE custom_table
6.00
6.00
1.00
4.00
1.00
4.00
1.00
1.00
6.00
4.00
