# vtk DataFile Version 1.0
B38F0346.vtk
ASCII

DATASET UNSTRUCTURED_GRID
POINTS 160 float
137141.50 446312.50 1.90 137141.50 446317.50 1.90 137146.50 446317.50 1.90 137146.50 446312.50 1.90 137141.50 446312.50 -0.10 137141.50 446317.50 -0.10 137146.50 446317.50 -0.10 137146.50 446312.50 -0.10
137141.50 446312.50 -0.10 137141.50 446317.50 -0.10 137146.50 446317.50 -0.10 137146.50 446312.50 -0.10 137141.50 446312.50 -1.90 137141.50 446317.50 -1.90 137146.50 446317.50 -1.90 137146.50 446312.50 -1.90
137141.50 446312.50 -1.90 137141.50 446317.50 -1.90 137146.50 446317.50 -1.90 137146.50 446312.50 -1.90 137141.50 446312.50 -6.30 137141.50 446317.50 -6.30 137146.50 446317.50 -6.30 137146.50 446312.50 -6.30
137141.50 446312.50 -6.30 137141.50 446317.50 -6.30 137146.50 446317.50 -6.30 137146.50 446312.50 -6.30 137141.50 446312.50 -6.90 137141.50 446317.50 -6.90 137146.50 446317.50 -6.90 137146.50 446312.50 -6.90
137141.50 446312.50 -6.90 137141.50 446317.50 -6.90 137146.50 446317.50 -6.90 137146.50 446312.50 -6.90 137141.50 446312.50 -7.60 137141.50 446317.50 -7.60 137146.50 446317.50 -7.60 137146.50 446312.50 -7.60
137141.50 446312.50 -7.60 137141.50 446317.50 -7.60 137146.50 446317.50 -7.60 137146.50 446312.50 -7.60 137141.50 446312.50 -7.90 137141.50 446317.50 -7.90 137146.50 446317.50 -7.90 137146.50 446312.50 -7.90
137141.50 446312.50 -7.90 137141.50 446317.50 -7.90 137146.50 446317.50 -7.90 137146.50 446312.50 -7.90 137141.50 446312.50 -10.80 137141.50 446317.50 -10.80 137146.50 446317.50 -10.80 137146.50 446312.50 -10.80
137141.50 446312.50 -10.80 137141.50 446317.50 -10.80 137146.50 446317.50 -10.80 137146.50 446312.50 -10.80 137141.50 446312.50 -12.10 137141.50 446317.50 -12.10 137146.50 446317.50 -12.10 137146.50 446312.50 -12.10
137141.50 446312.50 -12.10 137141.50 446317.50 -12.10 137146.50 446317.50 -12.10 137146.50 446312.50 -12.10 137141.50 446312.50 -14.50 137141.50 446317.50 -14.50 137146.50 446317.50 -14.50 137146.50 446312.50 -14.50
137141.50 446312.50 -14.50 137141.50 446317.50 -14.50 137146.50 446317.50 -14.50 137146.50 446312.50 -14.50 137141.50 446312.50 -16.40 137141.50 446317.50 -16.40 137146.50 446317.50 -16.40 137146.50 446312.50 -16.40
137141.50 446312.50 -16.40 137141.50 446317.50 -16.40 137146.50 446317.50 -16.40 137146.50 446312.50 -16.40 137141.50 446312.50 -18.30 137141.50 446317.50 -18.30 137146.50 446317.50 -18.30 137146.50 446312.50 -18.30
137141.50 446312.50 -18.30 137141.50 446317.50 -18.30 137146.50 446317.50 -18.30 137146.50 446312.50 -18.30 137141.50 446312.50 -21.40 137141.50 446317.50 -21.40 137146.50 446317.50 -21.40 137146.50 446312.50 -21.40
137141.50 446312.50 -21.40 137141.50 446317.50 -21.40 137146.50 446317.50 -21.40 137146.50 446312.50 -21.40 137141.50 446312.50 -22.10 137141.50 446317.50 -22.10 137146.50 446317.50 -22.10 137146.50 446312.50 -22.10
137141.50 446312.50 -22.10 137141.50 446317.50 -22.10 137146.50 446317.50 -22.10 137146.50 446312.50 -22.10 137141.50 446312.50 -26.20 137141.50 446317.50 -26.20 137146.50 446317.50 -26.20 137146.50 446312.50 -26.20
137141.50 446312.50 -26.20 137141.50 446317.50 -26.20 137146.50 446317.50 -26.20 137146.50 446312.50 -26.20 137141.50 446312.50 -27.10 137141.50 446317.50 -27.10 137146.50 446317.50 -27.10 137146.50 446312.50 -27.10
137141.50 446312.50 -27.10 137141.50 446317.50 -27.10 137146.50 446317.50 -27.10 137146.50 446312.50 -27.10 137141.50 446312.50 -31.10 137141.50 446317.50 -31.10 137146.50 446317.50 -31.10 137146.50 446312.50 -31.10
137141.50 446312.50 -31.10 137141.50 446317.50 -31.10 137146.50 446317.50 -31.10 137146.50 446312.50 -31.10 137141.50 446312.50 -34.90 137141.50 446317.50 -34.90 137146.50 446317.50 -34.90 137146.50 446312.50 -34.90
137141.50 446312.50 -34.90 137141.50 446317.50 -34.90 137146.50 446317.50 -34.90 137146.50 446312.50 -34.90 137141.50 446312.50 -35.40 137141.50 446317.50 -35.40 137146.50 446317.50 -35.40 137146.50 446312.50 -35.40
137141.50 446312.50 -35.40 137141.50 446317.50 -35.40 137146.50 446317.50 -35.40 137146.50 446312.50 -35.40 137141.50 446312.50 -38.10 137141.50 446317.50 -38.10 137146.50 446317.50 -38.10 137146.50 446312.50 -38.10
137141.50 446312.50 -38.10 137141.50 446317.50 -38.10 137146.50 446317.50 -38.10 137146.50 446312.50 -38.10 137141.50 446312.50 -46.10 137141.50 446317.50 -46.10 137146.50 446317.50 -46.10 137146.50 446312.50 -46.10

CELLS 20 180
8 4 7 6 5 0 3 2 1
8 12 15 14 13 8 11 10 9
8 20 23 22 21 16 19 18 17
8 28 31 30 29 24 27 26 25
8 36 39 38 37 32 35 34 33
8 44 47 46 45 40 43 42 41
8 52 55 54 53 48 51 50 49
8 60 63 62 61 56 59 58 57
8 68 71 70 69 64 67 66 65
8 76 79 78 77 72 75 74 73
8 84 87 86 85 80 83 82 81
8 92 95 94 93 88 91 90 89
8 100 103 102 101 96 99 98 97
8 108 111 110 109 104 107 106 105
8 116 119 118 117 112 115 114 113
8 124 127 126 125 120 123 122 121
8 132 135 134 133 128 131 130 129
8 140 143 142 141 136 139 138 137
8 148 151 150 149 144 147 146 145
8 156 159 158 157 152 155 154 153

CELL_TYPES 20
12
12
12
12
12
12
12
12
12
12
12
12
12
12
12
12
12
12
12
12

CELL_DATA 20
SCALARS Property_0 float
LOOKUP_TABLE custom_table
1.00
6.00
5.00
3.00
1.00
3.00
0.00
4.00
5.00
4.00
5.00
4.00
7.00
1.00
5.00
5.00
5.00
7.00
0.00
7.00
