# vtk DataFile Version 1.0
B38F0287.vtk
ASCII

DATASET UNSTRUCTURED_GRID
POINTS 56 float
137557.50 444767.50 2.12 137557.50 444772.50 2.12 137562.50 444772.50 2.12 137562.50 444767.50 2.12 137557.50 444767.50 0.67 137557.50 444772.50 0.67 137562.50 444772.50 0.67 137562.50 444767.50 0.67
137557.50 444767.50 0.67 137557.50 444772.50 0.67 137562.50 444772.50 0.67 137562.50 444767.50 0.67 137557.50 444767.50 -2.08 137557.50 444772.50 -2.08 137562.50 444772.50 -2.08 137562.50 444767.50 -2.08
137557.50 444767.50 -2.08 137557.50 444772.50 -2.08 137562.50 444772.50 -2.08 137562.50 444767.50 -2.08 137557.50 444767.50 -3.88 137557.50 444772.50 -3.88 137562.50 444772.50 -3.88 137562.50 444767.50 -3.88
137557.50 444767.50 -3.88 137557.50 444772.50 -3.88 137562.50 444772.50 -3.88 137562.50 444767.50 -3.88 137557.50 444767.50 -6.28 137557.50 444772.50 -6.28 137562.50 444772.50 -6.28 137562.50 444767.50 -6.28
137557.50 444767.50 -6.28 137557.50 444772.50 -6.28 137562.50 444772.50 -6.28 137562.50 444767.50 -6.28 137557.50 444767.50 -8.68 137557.50 444772.50 -8.68 137562.50 444772.50 -8.68 137562.50 444767.50 -8.68
137557.50 444767.50 -8.68 137557.50 444772.50 -8.68 137562.50 444772.50 -8.68 137562.50 444767.50 -8.68 137557.50 444767.50 -12.38 137557.50 444772.50 -12.38 137562.50 444772.50 -12.38 137562.50 444767.50 -12.38
137557.50 444767.50 -12.38 137557.50 444772.50 -12.38 137562.50 444772.50 -12.38 137562.50 444767.50 -12.38 137557.50 444767.50 -15.28 137557.50 444772.50 -15.28 137562.50 444772.50 -15.28 137562.50 444767.50 -15.28

CELLS 7 63
8 4 7 6 5 0 3 2 1
8 12 15 14 13 8 11 10 9
8 20 23 22 21 16 19 18 17
8 28 31 30 29 24 27 26 25
8 36 39 38 37 32 35 34 33
8 44 47 46 45 40 43 42 41
8 52 55 54 53 48 51 50 49

CELL_TYPES 7
12
12
12
12
12
12
12

CELL_DATA 7
SCALARS Property_0 float
LOOKUP_TABLE custom_table
4.00
5.00
6.00
3.00
1.00
5.00
4.00
