# vtk DataFile Version 1.0
B38F1388.vtk
ASCII

DATASET UNSTRUCTURED_GRID
POINTS 64 float
135564.50 445395.50 1.80 135564.50 445400.50 1.80 135569.50 445400.50 1.80 135569.50 445395.50 1.80 135564.50 445395.50 0.10 135564.50 445400.50 0.10 135569.50 445400.50 0.10 135569.50 445395.50 0.10
135564.50 445395.50 0.10 135564.50 445400.50 0.10 135569.50 445400.50 0.10 135569.50 445395.50 0.10 135564.50 445395.50 -0.90 135564.50 445400.50 -0.90 135569.50 445400.50 -0.90 135569.50 445395.50 -0.90
135564.50 445395.50 -0.90 135564.50 445400.50 -0.90 135569.50 445400.50 -0.90 135569.50 445395.50 -0.90 135564.50 445395.50 -1.10 135564.50 445400.50 -1.10 135569.50 445400.50 -1.10 135569.50 445395.50 -1.10
135564.50 445395.50 -1.10 135564.50 445400.50 -1.10 135569.50 445400.50 -1.10 135569.50 445395.50 -1.10 135564.50 445395.50 -1.30 135564.50 445400.50 -1.30 135569.50 445400.50 -1.30 135569.50 445395.50 -1.30
135564.50 445395.50 -1.30 135564.50 445400.50 -1.30 135569.50 445400.50 -1.30 135569.50 445395.50 -1.30 135564.50 445395.50 -5.30 135564.50 445400.50 -5.30 135569.50 445400.50 -5.30 135569.50 445395.50 -5.30
135564.50 445395.50 -5.30 135564.50 445400.50 -5.30 135569.50 445400.50 -5.30 135569.50 445395.50 -5.30 135564.50 445395.50 -6.10 135564.50 445400.50 -6.10 135569.50 445400.50 -6.10 135569.50 445395.50 -6.10
135564.50 445395.50 -6.10 135564.50 445400.50 -6.10 135569.50 445400.50 -6.10 135569.50 445395.50 -6.10 135564.50 445395.50 -6.90 135564.50 445400.50 -6.90 135569.50 445400.50 -6.90 135569.50 445395.50 -6.90
135564.50 445395.50 -6.90 135564.50 445400.50 -6.90 135569.50 445400.50 -6.90 135569.50 445395.50 -6.90 135564.50 445395.50 -8.64 135564.50 445400.50 -8.64 135569.50 445400.50 -8.64 135569.50 445395.50 -8.64

CELLS 8 72
8 4 7 6 5 0 3 2 1
8 12 15 14 13 8 11 10 9
8 20 23 22 21 16 19 18 17
8 28 31 30 29 24 27 26 25
8 36 39 38 37 32 35 34 33
8 44 47 46 45 40 43 42 41
8 52 55 54 53 48 51 50 49
8 60 63 62 61 56 59 58 57

CELL_TYPES 8
12
12
12
12
12
12
12
12

CELL_DATA 8
SCALARS Property_0 float
LOOKUP_TABLE custom_table
6.00
1.00
3.00
1.00
6.00
3.00
1.00
5.00
