# vtk DataFile Version 1.0
B38F0241.vtk
ASCII

DATASET UNSTRUCTURED_GRID
POINTS 64 float
132032.50 443367.50 2.20 132032.50 443372.50 2.20 132037.50 443372.50 2.20 132037.50 443367.50 2.20 132032.50 443367.50 1.80 132032.50 443372.50 1.80 132037.50 443372.50 1.80 132037.50 443367.50 1.80
132032.50 443367.50 1.80 132032.50 443372.50 1.80 132037.50 443372.50 1.80 132037.50 443367.50 1.80 132032.50 443367.50 -0.60 132032.50 443372.50 -0.60 132037.50 443372.50 -0.60 132037.50 443367.50 -0.60
132032.50 443367.50 -0.60 132032.50 443372.50 -0.60 132037.50 443372.50 -0.60 132037.50 443367.50 -0.60 132032.50 443367.50 -4.60 132032.50 443372.50 -4.60 132037.50 443372.50 -4.60 132037.50 443367.50 -4.60
132032.50 443367.50 -4.60 132032.50 443372.50 -4.60 132037.50 443372.50 -4.60 132037.50 443367.50 -4.60 132032.50 443367.50 -6.00 132032.50 443372.50 -6.00 132037.50 443372.50 -6.00 132037.50 443367.50 -6.00
132032.50 443367.50 -6.00 132032.50 443372.50 -6.00 132037.50 443372.50 -6.00 132037.50 443367.50 -6.00 132032.50 443367.50 -6.80 132032.50 443372.50 -6.80 132037.50 443372.50 -6.80 132037.50 443367.50 -6.80
132032.50 443367.50 -6.80 132032.50 443372.50 -6.80 132037.50 443372.50 -6.80 132037.50 443367.50 -6.80 132032.50 443367.50 -7.20 132032.50 443372.50 -7.20 132037.50 443372.50 -7.20 132037.50 443367.50 -7.20
132032.50 443367.50 -7.20 132032.50 443372.50 -7.20 132037.50 443372.50 -7.20 132037.50 443367.50 -7.20 132032.50 443367.50 -8.80 132032.50 443372.50 -8.80 132037.50 443372.50 -8.80 132037.50 443367.50 -8.80
132032.50 443367.50 -8.80 132032.50 443372.50 -8.80 132037.50 443372.50 -8.80 132037.50 443367.50 -8.80 132032.50 443367.50 -11.00 132032.50 443372.50 -11.00 132037.50 443372.50 -11.00 132037.50 443367.50 -11.00

CELLS 8 72
8 4 7 6 5 0 3 2 1
8 12 15 14 13 8 11 10 9
8 20 23 22 21 16 19 18 17
8 28 31 30 29 24 27 26 25
8 36 39 38 37 32 35 34 33
8 44 47 46 45 40 43 42 41
8 52 55 54 53 48 51 50 49
8 60 63 62 61 56 59 58 57

CELL_TYPES 8
12
12
12
12
12
12
12
12

CELL_DATA 8
SCALARS Property_0 float
LOOKUP_TABLE custom_table
1.00
7.00
0.00
7.00
1.00
6.00
5.00
0.00
