# vtk DataFile Version 1.0
B38F1171.vtk
ASCII

DATASET UNSTRUCTURED_GRID
POINTS 80 float
132694.50 441619.50 0.17 132694.50 441624.50 0.17 132699.50 441624.50 0.17 132699.50 441619.50 0.17 132694.50 441619.50 -0.53 132694.50 441624.50 -0.53 132699.50 441624.50 -0.53 132699.50 441619.50 -0.53
132694.50 441619.50 -0.53 132694.50 441624.50 -0.53 132699.50 441624.50 -0.53 132699.50 441619.50 -0.53 132694.50 441619.50 -1.73 132694.50 441624.50 -1.73 132699.50 441624.50 -1.73 132699.50 441619.50 -1.73
132694.50 441619.50 -1.73 132694.50 441624.50 -1.73 132699.50 441624.50 -1.73 132699.50 441619.50 -1.73 132694.50 441619.50 -2.33 132694.50 441624.50 -2.33 132699.50 441624.50 -2.33 132699.50 441619.50 -2.33
132694.50 441619.50 -2.33 132694.50 441624.50 -2.33 132699.50 441624.50 -2.33 132699.50 441619.50 -2.33 132694.50 441619.50 -2.53 132694.50 441624.50 -2.53 132699.50 441624.50 -2.53 132699.50 441619.50 -2.53
132694.50 441619.50 -2.53 132694.50 441624.50 -2.53 132699.50 441624.50 -2.53 132699.50 441619.50 -2.53 132694.50 441619.50 -2.93 132694.50 441624.50 -2.93 132699.50 441624.50 -2.93 132699.50 441619.50 -2.93
132694.50 441619.50 -2.93 132694.50 441624.50 -2.93 132699.50 441624.50 -2.93 132699.50 441619.50 -2.93 132694.50 441619.50 -4.53 132694.50 441624.50 -4.53 132699.50 441624.50 -4.53 132699.50 441619.50 -4.53
132694.50 441619.50 -4.53 132694.50 441624.50 -4.53 132699.50 441624.50 -4.53 132699.50 441619.50 -4.53 132694.50 441619.50 -4.73 132694.50 441624.50 -4.73 132699.50 441624.50 -4.73 132699.50 441619.50 -4.73
132694.50 441619.50 -4.73 132694.50 441624.50 -4.73 132699.50 441624.50 -4.73 132699.50 441619.50 -4.73 132694.50 441619.50 -4.93 132694.50 441624.50 -4.93 132699.50 441624.50 -4.93 132699.50 441619.50 -4.93
132694.50 441619.50 -4.93 132694.50 441624.50 -4.93 132699.50 441624.50 -4.93 132699.50 441619.50 -4.93 132694.50 441619.50 -6.73 132694.50 441624.50 -6.73 132699.50 441624.50 -6.73 132699.50 441619.50 -6.73
132694.50 441619.50 -6.73 132694.50 441624.50 -6.73 132699.50 441624.50 -6.73 132699.50 441619.50 -6.73 132694.50 441619.50 -8.11 132694.50 441624.50 -8.11 132699.50 441624.50 -8.11 132699.50 441619.50 -8.11

CELLS 10 90
8 4 7 6 5 0 3 2 1
8 12 15 14 13 8 11 10 9
8 20 23 22 21 16 19 18 17
8 28 31 30 29 24 27 26 25
8 36 39 38 37 32 35 34 33
8 44 47 46 45 40 43 42 41
8 52 55 54 53 48 51 50 49
8 60 63 62 61 56 59 58 57
8 68 71 70 69 64 67 66 65
8 76 79 78 77 72 75 74 73

CELL_TYPES 10
12
12
12
12
12
12
12
12
12
12

CELL_DATA 10
SCALARS Property_0 float
LOOKUP_TABLE custom_table
1.00
3.00
6.00
1.00
3.00
6.00
3.00
1.00
6.00
7.00
