# vtk DataFile Version 1.0
B38F0580.vtk
ASCII

DATASET UNSTRUCTURED_GRID
POINTS 448 float
136286.50 446186.50 2.50 136286.50 446191.50 2.50 136291.50 446191.50 2.50 136291.50 446186.50 2.50 136286.50 446186.50 1.50 136286.50 446191.50 1.50 136291.50 446191.50 1.50 136291.50 446186.50 1.50
136286.50 446186.50 1.50 136286.50 446191.50 1.50 136291.50 446191.50 1.50 136291.50 446186.50 1.50 136286.50 446186.50 -3.50 136286.50 446191.50 -3.50 136291.50 446191.50 -3.50 136291.50 446186.50 -3.50
136286.50 446186.50 -3.50 136286.50 446191.50 -3.50 136291.50 446191.50 -3.50 136291.50 446186.50 -3.50 136286.50 446186.50 -4.50 136286.50 446191.50 -4.50 136291.50 446191.50 -4.50 136291.50 446186.50 -4.50
136286.50 446186.50 -4.50 136286.50 446191.50 -4.50 136291.50 446191.50 -4.50 136291.50 446186.50 -4.50 136286.50 446186.50 -7.50 136286.50 446191.50 -7.50 136291.50 446191.50 -7.50 136291.50 446186.50 -7.50
136286.50 446186.50 -7.50 136286.50 446191.50 -7.50 136291.50 446191.50 -7.50 136291.50 446186.50 -7.50 136286.50 446186.50 -8.50 136286.50 446191.50 -8.50 136291.50 446191.50 -8.50 136291.50 446186.50 -8.50
136286.50 446186.50 -8.50 136286.50 446191.50 -8.50 136291.50 446191.50 -8.50 136291.50 446186.50 -8.50 136286.50 446186.50 -13.00 136286.50 446191.50 -13.00 136291.50 446191.50 -13.00 136291.50 446186.50 -13.00
136286.50 446186.50 -13.00 136286.50 446191.50 -13.00 136291.50 446191.50 -13.00 136291.50 446186.50 -13.00 136286.50 446186.50 -13.50 136286.50 446191.50 -13.50 136291.50 446191.50 -13.50 136291.50 446186.50 -13.50
136286.50 446186.50 -13.50 136286.50 446191.50 -13.50 136291.50 446191.50 -13.50 136291.50 446186.50 -13.50 136286.50 446186.50 -16.50 136286.50 446191.50 -16.50 136291.50 446191.50 -16.50 136291.50 446186.50 -16.50
136286.50 446186.50 -16.50 136286.50 446191.50 -16.50 136291.50 446191.50 -16.50 136291.50 446186.50 -16.50 136286.50 446186.50 -19.50 136286.50 446191.50 -19.50 136291.50 446191.50 -19.50 136291.50 446186.50 -19.50
136286.50 446186.50 -19.50 136286.50 446191.50 -19.50 136291.50 446191.50 -19.50 136291.50 446186.50 -19.50 136286.50 446186.50 -21.50 136286.50 446191.50 -21.50 136291.50 446191.50 -21.50 136291.50 446186.50 -21.50
136286.50 446186.50 -21.50 136286.50 446191.50 -21.50 136291.50 446191.50 -21.50 136291.50 446186.50 -21.50 136286.50 446186.50 -22.50 136286.50 446191.50 -22.50 136291.50 446191.50 -22.50 136291.50 446186.50 -22.50
136286.50 446186.50 -22.50 136286.50 446191.50 -22.50 136291.50 446191.50 -22.50 136291.50 446186.50 -22.50 136286.50 446186.50 -25.50 136286.50 446191.50 -25.50 136291.50 446191.50 -25.50 136291.50 446186.50 -25.50
136286.50 446186.50 -25.50 136286.50 446191.50 -25.50 136291.50 446191.50 -25.50 136291.50 446186.50 -25.50 136286.50 446186.50 -34.50 136286.50 446191.50 -34.50 136291.50 446191.50 -34.50 136291.50 446186.50 -34.50
136286.50 446186.50 -34.50 136286.50 446191.50 -34.50 136291.50 446191.50 -34.50 136291.50 446186.50 -34.50 136286.50 446186.50 -36.50 136286.50 446191.50 -36.50 136291.50 446191.50 -36.50 136291.50 446186.50 -36.50
136286.50 446186.50 -36.50 136286.50 446191.50 -36.50 136291.50 446191.50 -36.50 136291.50 446186.50 -36.50 136286.50 446186.50 -38.50 136286.50 446191.50 -38.50 136291.50 446191.50 -38.50 136291.50 446186.50 -38.50
136286.50 446186.50 -38.50 136286.50 446191.50 -38.50 136291.50 446191.50 -38.50 136291.50 446186.50 -38.50 136286.50 446186.50 -39.50 136286.50 446191.50 -39.50 136291.50 446191.50 -39.50 136291.50 446186.50 -39.50
136286.50 446186.50 -39.50 136286.50 446191.50 -39.50 136291.50 446191.50 -39.50 136291.50 446186.50 -39.50 136286.50 446186.50 -41.50 136286.50 446191.50 -41.50 136291.50 446191.50 -41.50 136291.50 446186.50 -41.50
136286.50 446186.50 -41.50 136286.50 446191.50 -41.50 136291.50 446191.50 -41.50 136291.50 446186.50 -41.50 136286.50 446186.50 -42.50 136286.50 446191.50 -42.50 136291.50 446191.50 -42.50 136291.50 446186.50 -42.50
136286.50 446186.50 -42.50 136286.50 446191.50 -42.50 136291.50 446191.50 -42.50 136291.50 446186.50 -42.50 136286.50 446186.50 -43.50 136286.50 446191.50 -43.50 136291.50 446191.50 -43.50 136291.50 446186.50 -43.50
136286.50 446186.50 -43.50 136286.50 446191.50 -43.50 136291.50 446191.50 -43.50 136291.50 446186.50 -43.50 136286.50 446186.50 -46.50 136286.50 446191.50 -46.50 136291.50 446191.50 -46.50 136291.50 446186.50 -46.50
136286.50 446186.50 -46.50 136286.50 446191.50 -46.50 136291.50 446191.50 -46.50 136291.50 446186.50 -46.50 136286.50 446186.50 -49.50 136286.50 446191.50 -49.50 136291.50 446191.50 -49.50 136291.50 446186.50 -49.50
136286.50 446186.50 -49.50 136286.50 446191.50 -49.50 136291.50 446191.50 -49.50 136291.50 446186.50 -49.50 136286.50 446186.50 -52.50 136286.50 446191.50 -52.50 136291.50 446191.50 -52.50 136291.50 446186.50 -52.50
136286.50 446186.50 -52.50 136286.50 446191.50 -52.50 136291.50 446191.50 -52.50 136291.50 446186.50 -52.50 136286.50 446186.50 -55.50 136286.50 446191.50 -55.50 136291.50 446191.50 -55.50 136291.50 446186.50 -55.50
136286.50 446186.50 -55.50 136286.50 446191.50 -55.50 136291.50 446191.50 -55.50 136291.50 446186.50 -55.50 136286.50 446186.50 -62.00 136286.50 446191.50 -62.00 136291.50 446191.50 -62.00 136291.50 446186.50 -62.00
136286.50 446186.50 -62.00 136286.50 446191.50 -62.00 136291.50 446191.50 -62.00 136291.50 446186.50 -62.00 136286.50 446186.50 -64.50 136286.50 446191.50 -64.50 136291.50 446191.50 -64.50 136291.50 446186.50 -64.50
136286.50 446186.50 -64.50 136286.50 446191.50 -64.50 136291.50 446191.50 -64.50 136291.50 446186.50 -64.50 136286.50 446186.50 -81.50 136286.50 446191.50 -81.50 136291.50 446191.50 -81.50 136291.50 446186.50 -81.50
136286.50 446186.50 -81.50 136286.50 446191.50 -81.50 136291.50 446191.50 -81.50 136291.50 446186.50 -81.50 136286.50 446186.50 -82.50 136286.50 446191.50 -82.50 136291.50 446191.50 -82.50 136291.50 446186.50 -82.50
136286.50 446186.50 -82.50 136286.50 446191.50 -82.50 136291.50 446191.50 -82.50 136291.50 446186.50 -82.50 136286.50 446186.50 -83.00 136286.50 446191.50 -83.00 136291.50 446191.50 -83.00 136291.50 446186.50 -83.00
136286.50 446186.50 -83.00 136286.50 446191.50 -83.00 136291.50 446191.50 -83.00 136291.50 446186.50 -83.00 136286.50 446186.50 -86.50 136286.50 446191.50 -86.50 136291.50 446191.50 -86.50 136291.50 446186.50 -86.50
136286.50 446186.50 -86.50 136286.50 446191.50 -86.50 136291.50 446191.50 -86.50 136291.50 446186.50 -86.50 136286.50 446186.50 -93.50 136286.50 446191.50 -93.50 136291.50 446191.50 -93.50 136291.50 446186.50 -93.50
136286.50 446186.50 -93.50 136286.50 446191.50 -93.50 136291.50 446191.50 -93.50 136291.50 446186.50 -93.50 136286.50 446186.50 -95.50 136286.50 446191.50 -95.50 136291.50 446191.50 -95.50 136291.50 446186.50 -95.50
136286.50 446186.50 -95.50 136286.50 446191.50 -95.50 136291.50 446191.50 -95.50 136291.50 446186.50 -95.50 136286.50 446186.50 -99.50 136286.50 446191.50 -99.50 136291.50 446191.50 -99.50 136291.50 446186.50 -99.50
136286.50 446186.50 -99.50 136286.50 446191.50 -99.50 136291.50 446191.50 -99.50 136291.50 446186.50 -99.50 136286.50 446186.50 -102.50 136286.50 446191.50 -102.50 136291.50 446191.50 -102.50 136291.50 446186.50 -102.50
136286.50 446186.50 -102.50 136286.50 446191.50 -102.50 136291.50 446191.50 -102.50 136291.50 446186.50 -102.50 136286.50 446186.50 -108.50 136286.50 446191.50 -108.50 136291.50 446191.50 -108.50 136291.50 446186.50 -108.50
136286.50 446186.50 -108.50 136286.50 446191.50 -108.50 136291.50 446191.50 -108.50 136291.50 446186.50 -108.50 136286.50 446186.50 -116.50 136286.50 446191.50 -116.50 136291.50 446191.50 -116.50 136291.50 446186.50 -116.50
136286.50 446186.50 -116.50 136286.50 446191.50 -116.50 136291.50 446191.50 -116.50 136291.50 446186.50 -116.50 136286.50 446186.50 -122.50 136286.50 446191.50 -122.50 136291.50 446191.50 -122.50 136291.50 446186.50 -122.50
136286.50 446186.50 -122.50 136286.50 446191.50 -122.50 136291.50 446191.50 -122.50 136291.50 446186.50 -122.50 136286.50 446186.50 -127.50 136286.50 446191.50 -127.50 136291.50 446191.50 -127.50 136291.50 446186.50 -127.50
136286.50 446186.50 -127.50 136286.50 446191.50 -127.50 136291.50 446191.50 -127.50 136291.50 446186.50 -127.50 136286.50 446186.50 -128.50 136286.50 446191.50 -128.50 136291.50 446191.50 -128.50 136291.50 446186.50 -128.50
136286.50 446186.50 -128.50 136286.50 446191.50 -128.50 136291.50 446191.50 -128.50 136291.50 446186.50 -128.50 136286.50 446186.50 -132.50 136286.50 446191.50 -132.50 136291.50 446191.50 -132.50 136291.50 446186.50 -132.50
136286.50 446186.50 -132.50 136286.50 446191.50 -132.50 136291.50 446191.50 -132.50 136291.50 446186.50 -132.50 136286.50 446186.50 -138.50 136286.50 446191.50 -138.50 136291.50 446191.50 -138.50 136291.50 446186.50 -138.50
136286.50 446186.50 -138.50 136286.50 446191.50 -138.50 136291.50 446191.50 -138.50 136291.50 446186.50 -138.50 136286.50 446186.50 -144.50 136286.50 446191.50 -144.50 136291.50 446191.50 -144.50 136291.50 446186.50 -144.50
136286.50 446186.50 -144.50 136286.50 446191.50 -144.50 136291.50 446191.50 -144.50 136291.50 446186.50 -144.50 136286.50 446186.50 -146.50 136286.50 446191.50 -146.50 136291.50 446191.50 -146.50 136291.50 446186.50 -146.50
136286.50 446186.50 -146.50 136286.50 446191.50 -146.50 136291.50 446191.50 -146.50 136291.50 446186.50 -146.50 136286.50 446186.50 -151.50 136286.50 446191.50 -151.50 136291.50 446191.50 -151.50 136291.50 446186.50 -151.50
136286.50 446186.50 -151.50 136286.50 446191.50 -151.50 136291.50 446191.50 -151.50 136291.50 446186.50 -151.50 136286.50 446186.50 -152.50 136286.50 446191.50 -152.50 136291.50 446191.50 -152.50 136291.50 446186.50 -152.50
136286.50 446186.50 -152.50 136286.50 446191.50 -152.50 136291.50 446191.50 -152.50 136291.50 446186.50 -152.50 136286.50 446186.50 -163.50 136286.50 446191.50 -163.50 136291.50 446191.50 -163.50 136291.50 446186.50 -163.50
136286.50 446186.50 -163.50 136286.50 446191.50 -163.50 136291.50 446191.50 -163.50 136291.50 446186.50 -163.50 136286.50 446186.50 -167.50 136286.50 446191.50 -167.50 136291.50 446191.50 -167.50 136291.50 446186.50 -167.50
136286.50 446186.50 -167.50 136286.50 446191.50 -167.50 136291.50 446191.50 -167.50 136291.50 446186.50 -167.50 136286.50 446186.50 -170.50 136286.50 446191.50 -170.50 136291.50 446191.50 -170.50 136291.50 446186.50 -170.50
136286.50 446186.50 -170.50 136286.50 446191.50 -170.50 136291.50 446191.50 -170.50 136291.50 446186.50 -170.50 136286.50 446186.50 -173.50 136286.50 446191.50 -173.50 136291.50 446191.50 -173.50 136291.50 446186.50 -173.50
136286.50 446186.50 -173.50 136286.50 446191.50 -173.50 136291.50 446191.50 -173.50 136291.50 446186.50 -173.50 136286.50 446186.50 -174.50 136286.50 446191.50 -174.50 136291.50 446191.50 -174.50 136291.50 446186.50 -174.50
136286.50 446186.50 -174.50 136286.50 446191.50 -174.50 136291.50 446191.50 -174.50 136291.50 446186.50 -174.50 136286.50 446186.50 -177.50 136286.50 446191.50 -177.50 136291.50 446191.50 -177.50 136291.50 446186.50 -177.50
136286.50 446186.50 -177.50 136286.50 446191.50 -177.50 136291.50 446191.50 -177.50 136291.50 446186.50 -177.50 136286.50 446186.50 -178.50 136286.50 446191.50 -178.50 136291.50 446191.50 -178.50 136291.50 446186.50 -178.50
136286.50 446186.50 -178.50 136286.50 446191.50 -178.50 136291.50 446191.50 -178.50 136291.50 446186.50 -178.50 136286.50 446186.50 -191.50 136286.50 446191.50 -191.50 136291.50 446191.50 -191.50 136291.50 446186.50 -191.50
136286.50 446186.50 -191.50 136286.50 446191.50 -191.50 136291.50 446191.50 -191.50 136291.50 446186.50 -191.50 136286.50 446186.50 -192.50 136286.50 446191.50 -192.50 136291.50 446191.50 -192.50 136291.50 446186.50 -192.50
136286.50 446186.50 -192.50 136286.50 446191.50 -192.50 136291.50 446191.50 -192.50 136291.50 446186.50 -192.50 136286.50 446186.50 -193.50 136286.50 446191.50 -193.50 136291.50 446191.50 -193.50 136291.50 446186.50 -193.50
136286.50 446186.50 -193.50 136286.50 446191.50 -193.50 136291.50 446191.50 -193.50 136291.50 446186.50 -193.50 136286.50 446186.50 -196.50 136286.50 446191.50 -196.50 136291.50 446191.50 -196.50 136291.50 446186.50 -196.50
136286.50 446186.50 -196.50 136286.50 446191.50 -196.50 136291.50 446191.50 -196.50 136291.50 446186.50 -196.50 136286.50 446186.50 -236.30 136286.50 446191.50 -236.30 136291.50 446191.50 -236.30 136291.50 446186.50 -236.30

CELLS 56 504
8 4 7 6 5 0 3 2 1
8 12 15 14 13 8 11 10 9
8 20 23 22 21 16 19 18 17
8 28 31 30 29 24 27 26 25
8 36 39 38 37 32 35 34 33
8 44 47 46 45 40 43 42 41
8 52 55 54 53 48 51 50 49
8 60 63 62 61 56 59 58 57
8 68 71 70 69 64 67 66 65
8 76 79 78 77 72 75 74 73
8 84 87 86 85 80 83 82 81
8 92 95 94 93 88 91 90 89
8 100 103 102 101 96 99 98 97
8 108 111 110 109 104 107 106 105
8 116 119 118 117 112 115 114 113
8 124 127 126 125 120 123 122 121
8 132 135 134 133 128 131 130 129
8 140 143 142 141 136 139 138 137
8 148 151 150 149 144 147 146 145
8 156 159 158 157 152 155 154 153
8 164 167 166 165 160 163 162 161
8 172 175 174 173 168 171 170 169
8 180 183 182 181 176 179 178 177
8 188 191 190 189 184 187 186 185
8 196 199 198 197 192 195 194 193
8 204 207 206 205 200 203 202 201
8 212 215 214 213 208 211 210 209
8 220 223 222 221 216 219 218 217
8 228 231 230 229 224 227 226 225
8 236 239 238 237 232 235 234 233
8 244 247 246 245 240 243 242 241
8 252 255 254 253 248 251 250 249
8 260 263 262 261 256 259 258 257
8 268 271 270 269 264 267 266 265
8 276 279 278 277 272 275 274 273
8 284 287 286 285 280 283 282 281
8 292 295 294 293 288 291 290 289
8 300 303 302 301 296 299 298 297
8 308 311 310 309 304 307 306 305
8 316 319 318 317 312 315 314 313
8 324 327 326 325 320 323 322 321
8 332 335 334 333 328 331 330 329
8 340 343 342 341 336 339 338 337
8 348 351 350 349 344 347 346 345
8 356 359 358 357 352 355 354 353
8 364 367 366 365 360 363 362 361
8 372 375 374 373 368 371 370 369
8 380 383 382 381 376 379 378 377
8 388 391 390 389 384 387 386 385
8 396 399 398 397 392 395 394 393
8 404 407 406 405 400 403 402 401
8 412 415 414 413 408 411 410 409
8 420 423 422 421 416 419 418 417
8 428 431 430 429 424 427 426 425
8 436 439 438 437 432 435 434 433
8 444 447 446 445 440 443 442 441

CELL_TYPES 56
12
12
12
12
12
12
12
12
12
12
12
12
12
12
12
12
12
12
12
12
12
12
12
12
12
12
12
12
12
12
12
12
12
12
12
12
12
12
12
12
12
12
12
12
12
12
12
12
12
12
12
12
12
12
12
12

CELL_DATA 56
SCALARS Property_0 float
LOOKUP_TABLE custom_table
6.00
5.00
6.00
1.00
6.00
1.00
8.00
5.00
8.00
5.00
8.00
5.00
5.00
4.00
6.00
4.00
6.00
1.00
4.00
5.00
4.00
5.00
4.00
5.00
1.00
6.00
3.00
6.00
5.00
4.00
5.00
4.00
5.00
4.00
5.00
4.00
5.00
4.00
6.00
4.00
5.00
8.00
4.00
6.00
4.00
5.00
4.00
6.00
5.00
6.00
4.00
6.00
5.00
4.00
5.00
1.00
