# vtk DataFile Version 1.0
B38F1786.vtk
ASCII

DATASET UNSTRUCTURED_GRID
POINTS 112 float
131333.50 442173.50 6.80 131333.50 442178.50 6.80 131338.50 442178.50 6.80 131338.50 442173.50 6.80 131333.50 442173.50 6.12 131333.50 442178.50 6.12 131338.50 442178.50 6.12 131338.50 442173.50 6.12
131333.50 442173.50 6.12 131333.50 442178.50 6.12 131338.50 442178.50 6.12 131338.50 442173.50 6.12 131333.50 442173.50 5.66 131333.50 442178.50 5.66 131338.50 442178.50 5.66 131338.50 442173.50 5.66
131333.50 442173.50 5.66 131333.50 442178.50 5.66 131338.50 442178.50 5.66 131338.50 442173.50 5.66 131333.50 442173.50 5.35 131333.50 442178.50 5.35 131338.50 442178.50 5.35 131338.50 442173.50 5.35
131333.50 442173.50 5.35 131333.50 442178.50 5.35 131338.50 442178.50 5.35 131338.50 442173.50 5.35 131333.50 442173.50 0.60 131333.50 442178.50 0.60 131338.50 442178.50 0.60 131338.50 442173.50 0.60
131333.50 442173.50 0.60 131333.50 442178.50 0.60 131338.50 442178.50 0.60 131338.50 442173.50 0.60 131333.50 442173.50 0.23 131333.50 442178.50 0.23 131338.50 442178.50 0.23 131338.50 442173.50 0.23
131333.50 442173.50 0.23 131333.50 442178.50 0.23 131338.50 442178.50 0.23 131338.50 442173.50 0.23 131333.50 442173.50 -0.12 131333.50 442178.50 -0.12 131338.50 442178.50 -0.12 131338.50 442173.50 -0.12
131333.50 442173.50 -0.12 131333.50 442178.50 -0.12 131338.50 442178.50 -0.12 131338.50 442173.50 -0.12 131333.50 442173.50 -1.70 131333.50 442178.50 -1.70 131338.50 442178.50 -1.70 131338.50 442173.50 -1.70
131333.50 442173.50 -1.70 131333.50 442178.50 -1.70 131338.50 442178.50 -1.70 131338.50 442173.50 -1.70 131333.50 442173.50 -1.97 131333.50 442178.50 -1.97 131338.50 442178.50 -1.97 131338.50 442173.50 -1.97
131333.50 442173.50 -1.97 131333.50 442178.50 -1.97 131338.50 442178.50 -1.97 131338.50 442173.50 -1.97 131333.50 442173.50 -6.10 131333.50 442178.50 -6.10 131338.50 442178.50 -6.10 131338.50 442173.50 -6.10
131333.50 442173.50 -6.10 131333.50 442178.50 -6.10 131338.50 442178.50 -6.10 131338.50 442173.50 -6.10 131333.50 442173.50 -8.82 131333.50 442178.50 -8.82 131338.50 442178.50 -8.82 131338.50 442173.50 -8.82
131333.50 442173.50 -8.82 131333.50 442178.50 -8.82 131338.50 442178.50 -8.82 131338.50 442173.50 -8.82 131333.50 442173.50 -9.66 131333.50 442178.50 -9.66 131338.50 442178.50 -9.66 131338.50 442173.50 -9.66
131333.50 442173.50 -9.66 131333.50 442178.50 -9.66 131338.50 442178.50 -9.66 131338.50 442173.50 -9.66 131333.50 442173.50 -9.86 131333.50 442178.50 -9.86 131338.50 442178.50 -9.86 131338.50 442173.50 -9.86
131333.50 442173.50 -9.86 131333.50 442178.50 -9.86 131338.50 442178.50 -9.86 131338.50 442173.50 -9.86 131333.50 442173.50 -10.12 131333.50 442178.50 -10.12 131338.50 442178.50 -10.12 131338.50 442173.50 -10.12
131333.50 442173.50 -10.12 131333.50 442178.50 -10.12 131338.50 442178.50 -10.12 131338.50 442173.50 -10.12 131333.50 442173.50 -13.50 131333.50 442178.50 -13.50 131338.50 442178.50 -13.50 131338.50 442173.50 -13.50

CELLS 14 126
8 4 7 6 5 0 3 2 1
8 12 15 14 13 8 11 10 9
8 20 23 22 21 16 19 18 17
8 28 31 30 29 24 27 26 25
8 36 39 38 37 32 35 34 33
8 44 47 46 45 40 43 42 41
8 52 55 54 53 48 51 50 49
8 60 63 62 61 56 59 58 57
8 68 71 70 69 64 67 66 65
8 76 79 78 77 72 75 74 73
8 84 87 86 85 80 83 82 81
8 92 95 94 93 88 91 90 89
8 100 103 102 101 96 99 98 97
8 108 111 110 109 104 107 106 105

CELL_TYPES 14
12
12
12
12
12
12
12
12
12
12
12
12
12
12

CELL_DATA 14
SCALARS Property_0 float
LOOKUP_TABLE custom_table
0.00
1.00
6.00
1.00
6.00
0.00
1.00
0.00
6.00
0.00
6.00
0.00
1.00
0.00
