# vtk DataFile Version 1.0
B38F1319.vtk
ASCII

DATASET UNSTRUCTURED_GRID
POINTS 80 float
130041.50 444148.50 0.65 130041.50 444153.50 0.65 130046.50 444153.50 0.65 130046.50 444148.50 0.65 130041.50 444148.50 -0.85 130041.50 444153.50 -0.85 130046.50 444153.50 -0.85 130046.50 444148.50 -0.85
130041.50 444148.50 -0.85 130041.50 444153.50 -0.85 130046.50 444153.50 -0.85 130046.50 444148.50 -0.85 130041.50 444148.50 -2.05 130041.50 444153.50 -2.05 130046.50 444153.50 -2.05 130046.50 444148.50 -2.05
130041.50 444148.50 -2.05 130041.50 444153.50 -2.05 130046.50 444153.50 -2.05 130046.50 444148.50 -2.05 130041.50 444148.50 -2.45 130041.50 444153.50 -2.45 130046.50 444153.50 -2.45 130046.50 444148.50 -2.45
130041.50 444148.50 -2.45 130041.50 444153.50 -2.45 130046.50 444153.50 -2.45 130046.50 444148.50 -2.45 130041.50 444148.50 -4.95 130041.50 444153.50 -4.95 130046.50 444153.50 -4.95 130046.50 444148.50 -4.95
130041.50 444148.50 -4.95 130041.50 444153.50 -4.95 130046.50 444153.50 -4.95 130046.50 444148.50 -4.95 130041.50 444148.50 -6.55 130041.50 444153.50 -6.55 130046.50 444153.50 -6.55 130046.50 444148.50 -6.55
130041.50 444148.50 -6.55 130041.50 444153.50 -6.55 130046.50 444153.50 -6.55 130046.50 444148.50 -6.55 130041.50 444148.50 -7.05 130041.50 444153.50 -7.05 130046.50 444153.50 -7.05 130046.50 444148.50 -7.05
130041.50 444148.50 -7.05 130041.50 444153.50 -7.05 130046.50 444153.50 -7.05 130046.50 444148.50 -7.05 130041.50 444148.50 -7.15 130041.50 444153.50 -7.15 130046.50 444153.50 -7.15 130046.50 444148.50 -7.15
130041.50 444148.50 -7.15 130041.50 444153.50 -7.15 130046.50 444153.50 -7.15 130046.50 444148.50 -7.15 130041.50 444148.50 -7.35 130041.50 444153.50 -7.35 130046.50 444153.50 -7.35 130046.50 444148.50 -7.35
130041.50 444148.50 -7.35 130041.50 444153.50 -7.35 130046.50 444153.50 -7.35 130046.50 444148.50 -7.35 130041.50 444148.50 -7.65 130041.50 444153.50 -7.65 130046.50 444153.50 -7.65 130046.50 444148.50 -7.65
130041.50 444148.50 -7.65 130041.50 444153.50 -7.65 130046.50 444153.50 -7.65 130046.50 444148.50 -7.65 130041.50 444148.50 -9.31 130041.50 444153.50 -9.31 130046.50 444153.50 -9.31 130046.50 444148.50 -9.31

CELLS 10 90
8 4 7 6 5 0 3 2 1
8 12 15 14 13 8 11 10 9
8 20 23 22 21 16 19 18 17
8 28 31 30 29 24 27 26 25
8 36 39 38 37 32 35 34 33
8 44 47 46 45 40 43 42 41
8 52 55 54 53 48 51 50 49
8 60 63 62 61 56 59 58 57
8 68 71 70 69 64 67 66 65
8 76 79 78 77 72 75 74 73

CELL_TYPES 10
12
12
12
12
12
12
12
12
12
12

CELL_DATA 10
SCALARS Property_0 float
LOOKUP_TABLE custom_table
1.00
6.00
1.00
6.00
3.00
6.00
1.00
1.00
6.00
5.00
