# vtk DataFile Version 1.0
B38F1813.vtk
ASCII

DATASET UNSTRUCTURED_GRID
POINTS 128 float
133695.50 444792.50 6.91 133695.50 444797.50 6.91 133700.50 444797.50 6.91 133700.50 444792.50 6.91 133695.50 444792.50 6.24 133695.50 444797.50 6.24 133700.50 444797.50 6.24 133700.50 444792.50 6.24
133695.50 444792.50 6.24 133695.50 444797.50 6.24 133700.50 444797.50 6.24 133700.50 444792.50 6.24 133695.50 444792.50 5.04 133695.50 444797.50 5.04 133700.50 444797.50 5.04 133700.50 444792.50 5.04
133695.50 444792.50 5.04 133695.50 444797.50 5.04 133700.50 444797.50 5.04 133700.50 444792.50 5.04 133695.50 444792.50 4.70 133695.50 444797.50 4.70 133700.50 444797.50 4.70 133700.50 444792.50 4.70
133695.50 444792.50 4.70 133695.50 444797.50 4.70 133700.50 444797.50 4.70 133700.50 444792.50 4.70 133695.50 444792.50 3.68 133695.50 444797.50 3.68 133700.50 444797.50 3.68 133700.50 444792.50 3.68
133695.50 444792.50 3.68 133695.50 444797.50 3.68 133700.50 444797.50 3.68 133700.50 444792.50 3.68 133695.50 444792.50 1.93 133695.50 444797.50 1.93 133700.50 444797.50 1.93 133700.50 444792.50 1.93
133695.50 444792.50 1.93 133695.50 444797.50 1.93 133700.50 444797.50 1.93 133700.50 444792.50 1.93 133695.50 444792.50 -1.30 133695.50 444797.50 -1.30 133700.50 444797.50 -1.30 133700.50 444792.50 -1.30
133695.50 444792.50 -1.30 133695.50 444797.50 -1.30 133700.50 444797.50 -1.30 133700.50 444792.50 -1.30 133695.50 444792.50 -1.68 133695.50 444797.50 -1.68 133700.50 444797.50 -1.68 133700.50 444792.50 -1.68
133695.50 444792.50 -1.68 133695.50 444797.50 -1.68 133700.50 444797.50 -1.68 133700.50 444792.50 -1.68 133695.50 444792.50 -2.53 133695.50 444797.50 -2.53 133700.50 444797.50 -2.53 133700.50 444792.50 -2.53
133695.50 444792.50 -2.53 133695.50 444797.50 -2.53 133700.50 444797.50 -2.53 133700.50 444792.50 -2.53 133695.50 444792.50 -2.92 133695.50 444797.50 -2.92 133700.50 444797.50 -2.92 133700.50 444792.50 -2.92
133695.50 444792.50 -2.92 133695.50 444797.50 -2.92 133700.50 444797.50 -2.92 133700.50 444792.50 -2.92 133695.50 444792.50 -4.46 133695.50 444797.50 -4.46 133700.50 444797.50 -4.46 133700.50 444792.50 -4.46
133695.50 444792.50 -4.46 133695.50 444797.50 -4.46 133700.50 444797.50 -4.46 133700.50 444792.50 -4.46 133695.50 444792.50 -4.91 133695.50 444797.50 -4.91 133700.50 444797.50 -4.91 133700.50 444792.50 -4.91
133695.50 444792.50 -4.91 133695.50 444797.50 -4.91 133700.50 444797.50 -4.91 133700.50 444792.50 -4.91 133695.50 444792.50 -5.36 133695.50 444797.50 -5.36 133700.50 444797.50 -5.36 133700.50 444792.50 -5.36
133695.50 444792.50 -5.36 133695.50 444797.50 -5.36 133700.50 444797.50 -5.36 133700.50 444792.50 -5.36 133695.50 444792.50 -5.78 133695.50 444797.50 -5.78 133700.50 444797.50 -5.78 133700.50 444792.50 -5.78
133695.50 444792.50 -5.78 133695.50 444797.50 -5.78 133700.50 444797.50 -5.78 133700.50 444792.50 -5.78 133695.50 444792.50 -7.35 133695.50 444797.50 -7.35 133700.50 444797.50 -7.35 133700.50 444792.50 -7.35
133695.50 444792.50 -7.35 133695.50 444797.50 -7.35 133700.50 444797.50 -7.35 133700.50 444792.50 -7.35 133695.50 444792.50 -7.57 133695.50 444797.50 -7.57 133700.50 444797.50 -7.57 133700.50 444792.50 -7.57
133695.50 444792.50 -7.57 133695.50 444797.50 -7.57 133700.50 444797.50 -7.57 133700.50 444792.50 -7.57 133695.50 444792.50 -10.47 133695.50 444797.50 -10.47 133700.50 444797.50 -10.47 133700.50 444792.50 -10.47

CELLS 16 144
8 4 7 6 5 0 3 2 1
8 12 15 14 13 8 11 10 9
8 20 23 22 21 16 19 18 17
8 28 31 30 29 24 27 26 25
8 36 39 38 37 32 35 34 33
8 44 47 46 45 40 43 42 41
8 52 55 54 53 48 51 50 49
8 60 63 62 61 56 59 58 57
8 68 71 70 69 64 67 66 65
8 76 79 78 77 72 75 74 73
8 84 87 86 85 80 83 82 81
8 92 95 94 93 88 91 90 89
8 100 103 102 101 96 99 98 97
8 108 111 110 109 104 107 106 105
8 116 119 118 117 112 115 114 113
8 124 127 126 125 120 123 122 121

CELL_TYPES 16
12
12
12
12
12
12
12
12
12
12
12
12
12
12
12
12

CELL_DATA 16
SCALARS Property_0 float
LOOKUP_TABLE custom_table
0.00
6.00
0.00
6.00
1.00
6.00
0.00
1.00
3.00
1.00
3.00
1.00
3.00
1.00
6.00
0.00
