# vtk DataFile Version 1.0
B38F0282.vtk
ASCII

DATASET UNSTRUCTURED_GRID
POINTS 56 float
137897.50 444737.50 6.10 137897.50 444742.50 6.10 137902.50 444742.50 6.10 137902.50 444737.50 6.10 137897.50 444737.50 5.70 137897.50 444742.50 5.70 137902.50 444742.50 5.70 137902.50 444737.50 5.70
137897.50 444737.50 5.70 137897.50 444742.50 5.70 137902.50 444742.50 5.70 137902.50 444737.50 5.70 137897.50 444737.50 2.10 137897.50 444742.50 2.10 137902.50 444742.50 2.10 137902.50 444737.50 2.10
137897.50 444737.50 2.10 137897.50 444742.50 2.10 137902.50 444742.50 2.10 137902.50 444737.50 2.10 137897.50 444737.50 1.65 137897.50 444742.50 1.65 137902.50 444742.50 1.65 137902.50 444737.50 1.65
137897.50 444737.50 1.65 137897.50 444742.50 1.65 137902.50 444742.50 1.65 137902.50 444737.50 1.65 137897.50 444737.50 -3.30 137897.50 444742.50 -3.30 137902.50 444742.50 -3.30 137902.50 444737.50 -3.30
137897.50 444737.50 -3.30 137897.50 444742.50 -3.30 137902.50 444742.50 -3.30 137902.50 444737.50 -3.30 137897.50 444737.50 -4.05 137897.50 444742.50 -4.05 137902.50 444742.50 -4.05 137902.50 444737.50 -4.05
137897.50 444737.50 -4.05 137897.50 444742.50 -4.05 137902.50 444742.50 -4.05 137902.50 444737.50 -4.05 137897.50 444737.50 -5.70 137897.50 444742.50 -5.70 137902.50 444742.50 -5.70 137902.50 444737.50 -5.70
137897.50 444737.50 -5.70 137897.50 444742.50 -5.70 137902.50 444742.50 -5.70 137902.50 444737.50 -5.70 137897.50 444737.50 -8.06 137897.50 444742.50 -8.06 137902.50 444742.50 -8.06 137902.50 444737.50 -8.06

CELLS 7 63
8 4 7 6 5 0 3 2 1
8 12 15 14 13 8 11 10 9
8 20 23 22 21 16 19 18 17
8 28 31 30 29 24 27 26 25
8 36 39 38 37 32 35 34 33
8 44 47 46 45 40 43 42 41
8 52 55 54 53 48 51 50 49

CELL_TYPES 7
12
12
12
12
12
12
12

CELL_DATA 7
SCALARS Property_0 float
LOOKUP_TABLE custom_table
6.00
4.00
6.00
5.00
3.00
6.00
4.00
