# vtk DataFile Version 1.0
B38F1819.vtk
ASCII

DATASET UNSTRUCTURED_GRID
POINTS 48 float
136366.50 445374.50 2.66 136366.50 445379.50 2.66 136371.50 445379.50 2.66 136371.50 445374.50 2.66 136366.50 445374.50 -4.16 136366.50 445379.50 -4.16 136371.50 445379.50 -4.16 136371.50 445374.50 -4.16
136366.50 445374.50 -4.16 136366.50 445379.50 -4.16 136371.50 445379.50 -4.16 136371.50 445374.50 -4.16 136366.50 445374.50 -4.49 136366.50 445379.50 -4.49 136371.50 445379.50 -4.49 136371.50 445374.50 -4.49
136366.50 445374.50 -4.49 136366.50 445379.50 -4.49 136371.50 445379.50 -4.49 136371.50 445374.50 -4.49 136366.50 445374.50 -5.09 136366.50 445379.50 -5.09 136371.50 445379.50 -5.09 136371.50 445374.50 -5.09
136366.50 445374.50 -5.09 136366.50 445379.50 -5.09 136371.50 445379.50 -5.09 136371.50 445374.50 -5.09 136366.50 445374.50 -5.53 136366.50 445379.50 -5.53 136371.50 445379.50 -5.53 136371.50 445374.50 -5.53
136366.50 445374.50 -5.53 136366.50 445379.50 -5.53 136371.50 445379.50 -5.53 136371.50 445374.50 -5.53 136366.50 445374.50 -7.28 136366.50 445379.50 -7.28 136371.50 445379.50 -7.28 136371.50 445374.50 -7.28
136366.50 445374.50 -7.28 136366.50 445379.50 -7.28 136371.50 445379.50 -7.28 136371.50 445374.50 -7.28 136366.50 445374.50 -9.27 136366.50 445379.50 -9.27 136371.50 445379.50 -9.27 136371.50 445374.50 -9.27

CELLS 6 54
8 4 7 6 5 0 3 2 1
8 12 15 14 13 8 11 10 9
8 20 23 22 21 16 19 18 17
8 28 31 30 29 24 27 26 25
8 36 39 38 37 32 35 34 33
8 44 47 46 45 40 43 42 41

CELL_TYPES 6
12
12
12
12
12
12

CELL_DATA 6
SCALARS Property_0 float
LOOKUP_TABLE custom_table
1.00
3.00
1.00
3.00
1.00
0.00
