# vtk DataFile Version 1.0
B38F2031.vtk
ASCII

DATASET UNSTRUCTURED_GRID
POINTS 32 float
137759.50 444085.50 3.66 137759.50 444090.50 3.66 137764.50 444090.50 3.66 137764.50 444085.50 3.66 137759.50 444085.50 2.96 137759.50 444090.50 2.96 137764.50 444090.50 2.96 137764.50 444085.50 2.96
137759.50 444085.50 2.96 137759.50 444090.50 2.96 137764.50 444090.50 2.96 137764.50 444085.50 2.96 137759.50 444085.50 2.56 137759.50 444090.50 2.56 137764.50 444090.50 2.56 137764.50 444085.50 2.56
137759.50 444085.50 2.56 137759.50 444090.50 2.56 137764.50 444090.50 2.56 137764.50 444085.50 2.56 137759.50 444085.50 1.86 137759.50 444090.50 1.86 137764.50 444090.50 1.86 137764.50 444085.50 1.86
137759.50 444085.50 1.86 137759.50 444090.50 1.86 137764.50 444090.50 1.86 137764.50 444085.50 1.86 137759.50 444085.50 1.50 137759.50 444090.50 1.50 137764.50 444090.50 1.50 137764.50 444085.50 1.50

CELLS 4 36
8 4 7 6 5 0 3 2 1
8 12 15 14 13 8 11 10 9
8 20 23 22 21 16 19 18 17
8 28 31 30 29 24 27 26 25

CELL_TYPES 4
12
12
12
12

CELL_DATA 4
SCALARS Property_0 float
LOOKUP_TABLE custom_table
6.00
4.00
6.00
4.00
