# vtk DataFile Version 1.0
B38F1356.vtk
ASCII

DATASET UNSTRUCTURED_GRID
POINTS 16 float
137090.50 444459.50 3.10 137090.50 444464.50 3.10 137095.50 444464.50 3.10 137095.50 444459.50 3.10 137090.50 444459.50 2.00 137090.50 444464.50 2.00 137095.50 444464.50 2.00 137095.50 444459.50 2.00
137090.50 444459.50 2.00 137090.50 444464.50 2.00 137095.50 444464.50 2.00 137095.50 444459.50 2.00 137090.50 444459.50 1.78 137090.50 444464.50 1.78 137095.50 444464.50 1.78 137095.50 444459.50 1.78

CELLS 2 18
8 4 7 6 5 0 3 2 1
8 12 15 14 13 8 11 10 9

CELL_TYPES 2
12
12

CELL_DATA 2
SCALARS Property_0 float
LOOKUP_TABLE custom_table
6.00
0.00
