# vtk DataFile Version 1.0
B38F1269.vtk
ASCII

DATASET UNSTRUCTURED_GRID
POINTS 32 float
133783.50 443533.50 2.08 133783.50 443538.50 2.08 133788.50 443538.50 2.08 133788.50 443533.50 2.08 133783.50 443533.50 0.18 133783.50 443538.50 0.18 133788.50 443538.50 0.18 133788.50 443533.50 0.18
133783.50 443533.50 0.18 133783.50 443538.50 0.18 133788.50 443538.50 0.18 133788.50 443533.50 0.18 133783.50 443533.50 -2.02 133783.50 443538.50 -2.02 133788.50 443538.50 -2.02 133788.50 443533.50 -2.02
133783.50 443533.50 -2.02 133783.50 443538.50 -2.02 133788.50 443538.50 -2.02 133788.50 443533.50 -2.02 133783.50 443533.50 -2.42 133783.50 443538.50 -2.42 133788.50 443538.50 -2.42 133788.50 443533.50 -2.42
133783.50 443533.50 -2.42 133783.50 443538.50 -2.42 133788.50 443538.50 -2.42 133788.50 443533.50 -2.42 133783.50 443533.50 -3.32 133783.50 443538.50 -3.32 133788.50 443538.50 -3.32 133788.50 443533.50 -3.32

CELLS 4 36
8 4 7 6 5 0 3 2 1
8 12 15 14 13 8 11 10 9
8 20 23 22 21 16 19 18 17
8 28 31 30 29 24 27 26 25

CELL_TYPES 4
12
12
12
12

CELL_DATA 4
SCALARS Property_0 float
LOOKUP_TABLE custom_table
6.00
7.00
0.00
7.00
