# vtk DataFile Version 1.0
B38F0406.vtk
ASCII

DATASET UNSTRUCTURED_GRID
POINTS 184 float
135307.50 444222.50 2.00 135307.50 444227.50 2.00 135312.50 444227.50 2.00 135312.50 444222.50 2.00 135307.50 444222.50 -4.60 135307.50 444227.50 -4.60 135312.50 444227.50 -4.60 135312.50 444222.50 -4.60
135307.50 444222.50 -4.60 135307.50 444227.50 -4.60 135312.50 444227.50 -4.60 135312.50 444222.50 -4.60 135307.50 444222.50 -7.40 135307.50 444227.50 -7.40 135312.50 444227.50 -7.40 135312.50 444222.50 -7.40
135307.50 444222.50 -7.40 135307.50 444227.50 -7.40 135312.50 444227.50 -7.40 135312.50 444222.50 -7.40 135307.50 444222.50 -14.20 135307.50 444227.50 -14.20 135312.50 444227.50 -14.20 135312.50 444222.50 -14.20
135307.50 444222.50 -14.20 135307.50 444227.50 -14.20 135312.50 444227.50 -14.20 135312.50 444222.50 -14.20 135307.50 444222.50 -17.80 135307.50 444227.50 -17.80 135312.50 444227.50 -17.80 135312.50 444222.50 -17.80
135307.50 444222.50 -17.80 135307.50 444227.50 -17.80 135312.50 444227.50 -17.80 135312.50 444222.50 -17.80 135307.50 444222.50 -21.70 135307.50 444227.50 -21.70 135312.50 444227.50 -21.70 135312.50 444222.50 -21.70
135307.50 444222.50 -21.70 135307.50 444227.50 -21.70 135312.50 444227.50 -21.70 135312.50 444222.50 -21.70 135307.50 444222.50 -27.70 135307.50 444227.50 -27.70 135312.50 444227.50 -27.70 135312.50 444222.50 -27.70
135307.50 444222.50 -27.70 135307.50 444227.50 -27.70 135312.50 444227.50 -27.70 135312.50 444222.50 -27.70 135307.50 444222.50 -30.20 135307.50 444227.50 -30.20 135312.50 444227.50 -30.20 135312.50 444222.50 -30.20
135307.50 444222.50 -30.20 135307.50 444227.50 -30.20 135312.50 444227.50 -30.20 135312.50 444222.50 -30.20 135307.50 444222.50 -33.40 135307.50 444227.50 -33.40 135312.50 444227.50 -33.40 135312.50 444222.50 -33.40
135307.50 444222.50 -33.40 135307.50 444227.50 -33.40 135312.50 444227.50 -33.40 135312.50 444222.50 -33.40 135307.50 444222.50 -36.60 135307.50 444227.50 -36.60 135312.50 444227.50 -36.60 135312.50 444222.50 -36.60
135307.50 444222.50 -36.60 135307.50 444227.50 -36.60 135312.50 444227.50 -36.60 135312.50 444222.50 -36.60 135307.50 444222.50 -41.90 135307.50 444227.50 -41.90 135312.50 444227.50 -41.90 135312.50 444222.50 -41.90
135307.50 444222.50 -41.90 135307.50 444227.50 -41.90 135312.50 444227.50 -41.90 135312.50 444222.50 -41.90 135307.50 444222.50 -51.80 135307.50 444227.50 -51.80 135312.50 444227.50 -51.80 135312.50 444222.50 -51.80
135307.50 444222.50 -51.80 135307.50 444227.50 -51.80 135312.50 444227.50 -51.80 135312.50 444222.50 -51.80 135307.50 444222.50 -53.40 135307.50 444227.50 -53.40 135312.50 444227.50 -53.40 135312.50 444222.50 -53.40
135307.50 444222.50 -53.40 135307.50 444227.50 -53.40 135312.50 444227.50 -53.40 135312.50 444222.50 -53.40 135307.50 444222.50 -56.60 135307.50 444227.50 -56.60 135312.50 444227.50 -56.60 135312.50 444222.50 -56.60
135307.50 444222.50 -56.60 135307.50 444227.50 -56.60 135312.50 444227.50 -56.60 135312.50 444222.50 -56.60 135307.50 444222.50 -70.30 135307.50 444227.50 -70.30 135312.50 444227.50 -70.30 135312.50 444222.50 -70.30
135307.50 444222.50 -70.30 135307.50 444227.50 -70.30 135312.50 444227.50 -70.30 135312.50 444222.50 -70.30 135307.50 444222.50 -81.50 135307.50 444227.50 -81.50 135312.50 444227.50 -81.50 135312.50 444222.50 -81.50
135307.50 444222.50 -81.50 135307.50 444227.50 -81.50 135312.50 444227.50 -81.50 135312.50 444222.50 -81.50 135307.50 444222.50 -86.20 135307.50 444227.50 -86.20 135312.50 444227.50 -86.20 135312.50 444222.50 -86.20
135307.50 444222.50 -86.20 135307.50 444227.50 -86.20 135312.50 444227.50 -86.20 135312.50 444222.50 -86.20 135307.50 444222.50 -92.30 135307.50 444227.50 -92.30 135312.50 444227.50 -92.30 135312.50 444222.50 -92.30
135307.50 444222.50 -92.30 135307.50 444227.50 -92.30 135312.50 444227.50 -92.30 135312.50 444222.50 -92.30 135307.50 444222.50 -102.20 135307.50 444227.50 -102.20 135312.50 444227.50 -102.20 135312.50 444222.50 -102.20
135307.50 444222.50 -102.20 135307.50 444227.50 -102.20 135312.50 444227.50 -102.20 135312.50 444222.50 -102.20 135307.50 444222.50 -104.70 135307.50 444227.50 -104.70 135312.50 444227.50 -104.70 135312.50 444222.50 -104.70
135307.50 444222.50 -104.70 135307.50 444227.50 -104.70 135312.50 444227.50 -104.70 135312.50 444222.50 -104.70 135307.50 444222.50 -107.40 135307.50 444227.50 -107.40 135312.50 444227.50 -107.40 135312.50 444222.50 -107.40
135307.50 444222.50 -107.40 135307.50 444227.50 -107.40 135312.50 444227.50 -107.40 135312.50 444222.50 -107.40 135307.50 444222.50 -108.60 135307.50 444227.50 -108.60 135312.50 444227.50 -108.60 135312.50 444222.50 -108.60
135307.50 444222.50 -108.60 135307.50 444227.50 -108.60 135312.50 444227.50 -108.60 135312.50 444222.50 -108.60 135307.50 444222.50 -111.50 135307.50 444227.50 -111.50 135312.50 444227.50 -111.50 135312.50 444222.50 -111.50
135307.50 444222.50 -111.50 135307.50 444227.50 -111.50 135312.50 444227.50 -111.50 135312.50 444222.50 -111.50 135307.50 444222.50 -134.20 135307.50 444227.50 -134.20 135312.50 444227.50 -134.20 135312.50 444222.50 -134.20

CELLS 23 207
8 4 7 6 5 0 3 2 1
8 12 15 14 13 8 11 10 9
8 20 23 22 21 16 19 18 17
8 28 31 30 29 24 27 26 25
8 36 39 38 37 32 35 34 33
8 44 47 46 45 40 43 42 41
8 52 55 54 53 48 51 50 49
8 60 63 62 61 56 59 58 57
8 68 71 70 69 64 67 66 65
8 76 79 78 77 72 75 74 73
8 84 87 86 85 80 83 82 81
8 92 95 94 93 88 91 90 89
8 100 103 102 101 96 99 98 97
8 108 111 110 109 104 107 106 105
8 116 119 118 117 112 115 114 113
8 124 127 126 125 120 123 122 121
8 132 135 134 133 128 131 130 129
8 140 143 142 141 136 139 138 137
8 148 151 150 149 144 147 146 145
8 156 159 158 157 152 155 154 153
8 164 167 166 165 160 163 162 161
8 172 175 174 173 168 171 170 169
8 180 183 182 181 176 179 178 177

CELL_TYPES 23
12
12
12
12
12
12
12
12
12
12
12
12
12
12
12
12
12
12
12
12
12
12
12

CELL_DATA 23
SCALARS Property_0 float
LOOKUP_TABLE custom_table
1.00
4.00
5.00
8.00
5.00
0.00
8.00
4.00
0.00
7.00
5.00
0.00
1.00
7.00
1.00
5.00
0.00
5.00
4.00
5.00
0.00
5.00
1.00
