# vtk DataFile Version 1.0
B38F1648.vtk
ASCII

DATASET UNSTRUCTURED_GRID
POINTS 112 float
135085.50 445242.50 5.45 135085.50 445247.50 5.45 135090.50 445247.50 5.45 135090.50 445242.50 5.45 135085.50 445242.50 5.25 135085.50 445247.50 5.25 135090.50 445247.50 5.25 135090.50 445242.50 5.25
135085.50 445242.50 5.25 135085.50 445247.50 5.25 135090.50 445247.50 5.25 135090.50 445242.50 5.25 135085.50 445242.50 4.05 135085.50 445247.50 4.05 135090.50 445247.50 4.05 135090.50 445242.50 4.05
135085.50 445242.50 4.05 135085.50 445247.50 4.05 135090.50 445247.50 4.05 135090.50 445242.50 4.05 135085.50 445242.50 1.85 135085.50 445247.50 1.85 135090.50 445247.50 1.85 135090.50 445242.50 1.85
135085.50 445242.50 1.85 135085.50 445247.50 1.85 135090.50 445247.50 1.85 135090.50 445242.50 1.85 135085.50 445242.50 1.55 135085.50 445247.50 1.55 135090.50 445247.50 1.55 135090.50 445242.50 1.55
135085.50 445242.50 1.55 135085.50 445247.50 1.55 135090.50 445247.50 1.55 135090.50 445242.50 1.55 135085.50 445242.50 -1.05 135085.50 445247.50 -1.05 135090.50 445247.50 -1.05 135090.50 445242.50 -1.05
135085.50 445242.50 -1.05 135085.50 445247.50 -1.05 135090.50 445247.50 -1.05 135090.50 445242.50 -1.05 135085.50 445242.50 -1.45 135085.50 445247.50 -1.45 135090.50 445247.50 -1.45 135090.50 445242.50 -1.45
135085.50 445242.50 -1.45 135085.50 445247.50 -1.45 135090.50 445247.50 -1.45 135090.50 445242.50 -1.45 135085.50 445242.50 -1.80 135085.50 445247.50 -1.80 135090.50 445247.50 -1.80 135090.50 445242.50 -1.80
135085.50 445242.50 -1.80 135085.50 445247.50 -1.80 135090.50 445247.50 -1.80 135090.50 445242.50 -1.80 135085.50 445242.50 -3.30 135085.50 445247.50 -3.30 135090.50 445247.50 -3.30 135090.50 445242.50 -3.30
135085.50 445242.50 -3.30 135085.50 445247.50 -3.30 135090.50 445247.50 -3.30 135090.50 445242.50 -3.30 135085.50 445242.50 -10.05 135085.50 445247.50 -10.05 135090.50 445247.50 -10.05 135090.50 445242.50 -10.05
135085.50 445242.50 -10.05 135085.50 445247.50 -10.05 135090.50 445247.50 -10.05 135090.50 445242.50 -10.05 135085.50 445242.50 -11.30 135085.50 445247.50 -11.30 135090.50 445247.50 -11.30 135090.50 445242.50 -11.30
135085.50 445242.50 -11.30 135085.50 445247.50 -11.30 135090.50 445247.50 -11.30 135090.50 445242.50 -11.30 135085.50 445242.50 -11.80 135085.50 445247.50 -11.80 135090.50 445247.50 -11.80 135090.50 445242.50 -11.80
135085.50 445242.50 -11.80 135085.50 445247.50 -11.80 135090.50 445247.50 -11.80 135090.50 445242.50 -11.80 135085.50 445242.50 -12.45 135085.50 445247.50 -12.45 135090.50 445247.50 -12.45 135090.50 445242.50 -12.45
135085.50 445242.50 -12.45 135085.50 445247.50 -12.45 135090.50 445247.50 -12.45 135090.50 445242.50 -12.45 135085.50 445242.50 -16.05 135085.50 445247.50 -16.05 135090.50 445247.50 -16.05 135090.50 445242.50 -16.05
135085.50 445242.50 -16.05 135085.50 445247.50 -16.05 135090.50 445247.50 -16.05 135090.50 445242.50 -16.05 135085.50 445242.50 -20.35 135085.50 445247.50 -20.35 135090.50 445247.50 -20.35 135090.50 445242.50 -20.35

CELLS 14 126
8 4 7 6 5 0 3 2 1
8 12 15 14 13 8 11 10 9
8 20 23 22 21 16 19 18 17
8 28 31 30 29 24 27 26 25
8 36 39 38 37 32 35 34 33
8 44 47 46 45 40 43 42 41
8 52 55 54 53 48 51 50 49
8 60 63 62 61 56 59 58 57
8 68 71 70 69 64 67 66 65
8 76 79 78 77 72 75 74 73
8 84 87 86 85 80 83 82 81
8 92 95 94 93 88 91 90 89
8 100 103 102 101 96 99 98 97
8 108 111 110 109 104 107 106 105

CELL_TYPES 14
12
12
12
12
12
12
12
12
12
12
12
12
12
12

CELL_DATA 14
SCALARS Property_0 float
LOOKUP_TABLE custom_table
7.00
4.00
6.00
4.00
6.00
1.00
2.00
1.00
5.00
5.00
1.00
6.00
5.00
4.00
