# vtk DataFile Version 1.0
B38F1847.vtk
ASCII

DATASET UNSTRUCTURED_GRID
POINTS 48 float
137555.50 444541.50 2.38 137555.50 444546.50 2.38 137560.50 444546.50 2.38 137560.50 444541.50 2.38 137555.50 444541.50 1.91 137555.50 444546.50 1.91 137560.50 444546.50 1.91 137560.50 444541.50 1.91
137555.50 444541.50 1.91 137555.50 444546.50 1.91 137560.50 444546.50 1.91 137560.50 444541.50 1.91 137555.50 444541.50 -5.35 137555.50 444546.50 -5.35 137560.50 444546.50 -5.35 137560.50 444541.50 -5.35
137555.50 444541.50 -5.35 137555.50 444546.50 -5.35 137560.50 444546.50 -5.35 137560.50 444541.50 -5.35 137555.50 444541.50 -5.55 137555.50 444546.50 -5.55 137560.50 444546.50 -5.55 137560.50 444541.50 -5.55
137555.50 444541.50 -5.55 137555.50 444546.50 -5.55 137560.50 444546.50 -5.55 137560.50 444541.50 -5.55 137555.50 444541.50 -6.77 137555.50 444546.50 -6.77 137560.50 444546.50 -6.77 137560.50 444541.50 -6.77
137555.50 444541.50 -6.77 137555.50 444546.50 -6.77 137560.50 444546.50 -6.77 137560.50 444541.50 -6.77 137555.50 444541.50 -7.02 137555.50 444546.50 -7.02 137560.50 444546.50 -7.02 137560.50 444541.50 -7.02
137555.50 444541.50 -7.02 137555.50 444546.50 -7.02 137560.50 444546.50 -7.02 137560.50 444541.50 -7.02 137555.50 444541.50 -8.90 137555.50 444546.50 -8.90 137560.50 444546.50 -8.90 137560.50 444541.50 -8.90

CELLS 6 54
8 4 7 6 5 0 3 2 1
8 12 15 14 13 8 11 10 9
8 20 23 22 21 16 19 18 17
8 28 31 30 29 24 27 26 25
8 36 39 38 37 32 35 34 33
8 44 47 46 45 40 43 42 41

CELL_TYPES 6
12
12
12
12
12
12

CELL_DATA 6
SCALARS Property_0 float
LOOKUP_TABLE custom_table
6.00
0.00
3.00
1.00
6.00
0.00
