# vtk DataFile Version 1.0
B38F1878.vtk
ASCII

DATASET UNSTRUCTURED_GRID
POINTS 48 float
132544.50 443307.50 0.72 132544.50 443312.50 0.72 132549.50 443312.50 0.72 132549.50 443307.50 0.72 132544.50 443307.50 0.50 132544.50 443312.50 0.50 132549.50 443312.50 0.50 132549.50 443307.50 0.50
132544.50 443307.50 0.50 132544.50 443312.50 0.50 132549.50 443312.50 0.50 132549.50 443307.50 0.50 132544.50 443307.50 -2.89 132544.50 443312.50 -2.89 132549.50 443312.50 -2.89 132549.50 443307.50 -2.89
132544.50 443307.50 -2.89 132544.50 443312.50 -2.89 132549.50 443312.50 -2.89 132549.50 443307.50 -2.89 132544.50 443307.50 -3.26 132544.50 443312.50 -3.26 132549.50 443312.50 -3.26 132549.50 443307.50 -3.26
132544.50 443307.50 -3.26 132544.50 443312.50 -3.26 132549.50 443312.50 -3.26 132549.50 443307.50 -3.26 132544.50 443307.50 -3.48 132544.50 443312.50 -3.48 132549.50 443312.50 -3.48 132549.50 443307.50 -3.48
132544.50 443307.50 -3.48 132544.50 443312.50 -3.48 132549.50 443312.50 -3.48 132549.50 443307.50 -3.48 132544.50 443307.50 -4.63 132544.50 443312.50 -4.63 132549.50 443312.50 -4.63 132549.50 443307.50 -4.63
132544.50 443307.50 -4.63 132544.50 443312.50 -4.63 132549.50 443312.50 -4.63 132549.50 443307.50 -4.63 132544.50 443307.50 -5.70 132544.50 443312.50 -5.70 132549.50 443312.50 -5.70 132549.50 443307.50 -5.70

CELLS 6 54
8 4 7 6 5 0 3 2 1
8 12 15 14 13 8 11 10 9
8 20 23 22 21 16 19 18 17
8 28 31 30 29 24 27 26 25
8 36 39 38 37 32 35 34 33
8 44 47 46 45 40 43 42 41

CELL_TYPES 6
12
12
12
12
12
12

CELL_DATA 6
SCALARS Property_0 float
LOOKUP_TABLE custom_table
6.00
1.00
3.00
1.00
6.00
0.00
