# vtk DataFile Version 1.0
B38F1948.vtk
ASCII

DATASET UNSTRUCTURED_GRID
POINTS 48 float
137624.50 443881.50 1.49 137624.50 443886.50 1.49 137629.50 443886.50 1.49 137629.50 443881.50 1.49 137624.50 443881.50 0.85 137624.50 443886.50 0.85 137629.50 443886.50 0.85 137629.50 443881.50 0.85
137624.50 443881.50 0.85 137624.50 443886.50 0.85 137629.50 443886.50 0.85 137629.50 443881.50 0.85 137624.50 443881.50 -2.29 137624.50 443886.50 -2.29 137629.50 443886.50 -2.29 137629.50 443881.50 -2.29
137624.50 443881.50 -2.29 137624.50 443886.50 -2.29 137629.50 443886.50 -2.29 137629.50 443881.50 -2.29 137624.50 443881.50 -2.60 137624.50 443886.50 -2.60 137629.50 443886.50 -2.60 137629.50 443881.50 -2.60
137624.50 443881.50 -2.60 137624.50 443886.50 -2.60 137629.50 443886.50 -2.60 137629.50 443881.50 -2.60 137624.50 443881.50 -4.63 137624.50 443886.50 -4.63 137629.50 443886.50 -4.63 137629.50 443881.50 -4.63
137624.50 443881.50 -4.63 137624.50 443886.50 -4.63 137629.50 443886.50 -4.63 137629.50 443881.50 -4.63 137624.50 443881.50 -5.01 137624.50 443886.50 -5.01 137629.50 443886.50 -5.01 137629.50 443881.50 -5.01
137624.50 443881.50 -5.01 137624.50 443886.50 -5.01 137629.50 443886.50 -5.01 137629.50 443881.50 -5.01 137624.50 443881.50 -6.31 137624.50 443886.50 -6.31 137629.50 443886.50 -6.31 137629.50 443881.50 -6.31

CELLS 6 54
8 4 7 6 5 0 3 2 1
8 12 15 14 13 8 11 10 9
8 20 23 22 21 16 19 18 17
8 28 31 30 29 24 27 26 25
8 36 39 38 37 32 35 34 33
8 44 47 46 45 40 43 42 41

CELL_TYPES 6
12
12
12
12
12
12

CELL_DATA 6
SCALARS Property_0 float
LOOKUP_TABLE custom_table
1.00
0.00
1.00
3.00
1.00
0.00
