# vtk DataFile Version 1.0
B38F0278.vtk
ASCII

DATASET UNSTRUCTURED_GRID
POINTS 56 float
137547.50 444757.50 2.45 137547.50 444762.50 2.45 137552.50 444762.50 2.45 137552.50 444757.50 2.45 137547.50 444757.50 1.30 137547.50 444762.50 1.30 137552.50 444762.50 1.30 137552.50 444757.50 1.30
137547.50 444757.50 1.30 137547.50 444762.50 1.30 137552.50 444762.50 1.30 137552.50 444757.50 1.30 137547.50 444757.50 -2.05 137547.50 444762.50 -2.05 137552.50 444762.50 -2.05 137552.50 444757.50 -2.05
137547.50 444757.50 -2.05 137547.50 444762.50 -2.05 137552.50 444762.50 -2.05 137552.50 444757.50 -2.05 137547.50 444757.50 -2.55 137547.50 444762.50 -2.55 137552.50 444762.50 -2.55 137552.50 444757.50 -2.55
137547.50 444757.50 -2.55 137547.50 444762.50 -2.55 137552.50 444762.50 -2.55 137552.50 444757.50 -2.55 137547.50 444757.50 -6.05 137547.50 444762.50 -6.05 137552.50 444762.50 -6.05 137552.50 444757.50 -6.05
137547.50 444757.50 -6.05 137547.50 444762.50 -6.05 137552.50 444762.50 -6.05 137552.50 444757.50 -6.05 137547.50 444757.50 -7.60 137547.50 444762.50 -7.60 137552.50 444762.50 -7.60 137552.50 444757.50 -7.60
137547.50 444757.50 -7.60 137547.50 444762.50 -7.60 137552.50 444762.50 -7.60 137552.50 444757.50 -7.60 137547.50 444757.50 -8.65 137547.50 444762.50 -8.65 137552.50 444762.50 -8.65 137552.50 444757.50 -8.65
137547.50 444757.50 -8.65 137547.50 444762.50 -8.65 137552.50 444762.50 -8.65 137552.50 444757.50 -8.65 137547.50 444757.50 -10.87 137547.50 444762.50 -10.87 137552.50 444762.50 -10.87 137552.50 444757.50 -10.87

CELLS 7 63
8 4 7 6 5 0 3 2 1
8 12 15 14 13 8 11 10 9
8 20 23 22 21 16 19 18 17
8 28 31 30 29 24 27 26 25
8 36 39 38 37 32 35 34 33
8 44 47 46 45 40 43 42 41
8 52 55 54 53 48 51 50 49

CELL_TYPES 7
12
12
12
12
12
12
12

CELL_DATA 7
SCALARS Property_0 float
LOOKUP_TABLE custom_table
6.00
5.00
4.00
6.00
1.00
4.00
5.00
