# vtk DataFile Version 1.0
B38F0138.vtk
ASCII

DATASET UNSTRUCTURED_GRID
POINTS 48 float
133612.50 446225.50 0.99 133612.50 446230.50 0.99 133617.50 446230.50 0.99 133617.50 446225.50 0.99 133612.50 446225.50 -0.66 133612.50 446230.50 -0.66 133617.50 446230.50 -0.66 133617.50 446225.50 -0.66
133612.50 446225.50 -0.66 133612.50 446230.50 -0.66 133617.50 446230.50 -0.66 133617.50 446225.50 -0.66 133612.50 446225.50 -1.41 133612.50 446230.50 -1.41 133617.50 446230.50 -1.41 133617.50 446225.50 -1.41
133612.50 446225.50 -1.41 133612.50 446230.50 -1.41 133617.50 446230.50 -1.41 133617.50 446225.50 -1.41 133612.50 446225.50 -3.01 133612.50 446230.50 -3.01 133617.50 446230.50 -3.01 133617.50 446225.50 -3.01
133612.50 446225.50 -3.01 133612.50 446230.50 -3.01 133617.50 446230.50 -3.01 133617.50 446225.50 -3.01 133612.50 446225.50 -3.41 133612.50 446230.50 -3.41 133617.50 446230.50 -3.41 133617.50 446225.50 -3.41
133612.50 446225.50 -3.41 133612.50 446230.50 -3.41 133617.50 446230.50 -3.41 133617.50 446225.50 -3.41 133612.50 446225.50 -4.71 133612.50 446230.50 -4.71 133617.50 446230.50 -4.71 133617.50 446225.50 -4.71
133612.50 446225.50 -4.71 133612.50 446230.50 -4.71 133617.50 446230.50 -4.71 133617.50 446225.50 -4.71 133612.50 446225.50 -5.85 133612.50 446230.50 -5.85 133617.50 446230.50 -5.85 133617.50 446225.50 -5.85

CELLS 6 54
8 4 7 6 5 0 3 2 1
8 12 15 14 13 8 11 10 9
8 20 23 22 21 16 19 18 17
8 28 31 30 29 24 27 26 25
8 36 39 38 37 32 35 34 33
8 44 47 46 45 40 43 42 41

CELL_TYPES 6
12
12
12
12
12
12

CELL_DATA 6
SCALARS Property_0 float
LOOKUP_TABLE custom_table
1.00
3.00
1.00
6.00
7.00
5.00
