# vtk DataFile Version 1.0
B38F0303.vtk
ASCII

DATASET UNSTRUCTURED_GRID
POINTS 56 float
135791.50 443220.50 2.92 135791.50 443225.50 2.92 135796.50 443225.50 2.92 135796.50 443220.50 2.92 135791.50 443220.50 1.72 135791.50 443225.50 1.72 135796.50 443225.50 1.72 135796.50 443220.50 1.72
135791.50 443220.50 1.72 135791.50 443225.50 1.72 135796.50 443225.50 1.72 135796.50 443220.50 1.72 135791.50 443220.50 -0.98 135791.50 443225.50 -0.98 135796.50 443225.50 -0.98 135796.50 443220.50 -0.98
135791.50 443220.50 -0.98 135791.50 443225.50 -0.98 135796.50 443225.50 -0.98 135796.50 443220.50 -0.98 135791.50 443220.50 -3.08 135791.50 443225.50 -3.08 135796.50 443225.50 -3.08 135796.50 443220.50 -3.08
135791.50 443220.50 -3.08 135791.50 443225.50 -3.08 135796.50 443225.50 -3.08 135796.50 443220.50 -3.08 135791.50 443220.50 -3.48 135791.50 443225.50 -3.48 135796.50 443225.50 -3.48 135796.50 443220.50 -3.48
135791.50 443220.50 -3.48 135791.50 443225.50 -3.48 135796.50 443225.50 -3.48 135796.50 443220.50 -3.48 135791.50 443220.50 -4.28 135791.50 443225.50 -4.28 135796.50 443225.50 -4.28 135796.50 443220.50 -4.28
135791.50 443220.50 -4.28 135791.50 443225.50 -4.28 135796.50 443225.50 -4.28 135796.50 443220.50 -4.28 135791.50 443220.50 -5.88 135791.50 443225.50 -5.88 135796.50 443225.50 -5.88 135796.50 443220.50 -5.88
135791.50 443220.50 -5.88 135791.50 443225.50 -5.88 135796.50 443225.50 -5.88 135796.50 443220.50 -5.88 135791.50 443220.50 -7.64 135791.50 443225.50 -7.64 135796.50 443225.50 -7.64 135796.50 443220.50 -7.64

CELLS 7 63
8 4 7 6 5 0 3 2 1
8 12 15 14 13 8 11 10 9
8 20 23 22 21 16 19 18 17
8 28 31 30 29 24 27 26 25
8 36 39 38 37 32 35 34 33
8 44 47 46 45 40 43 42 41
8 52 55 54 53 48 51 50 49

CELL_TYPES 7
12
12
12
12
12
12
12

CELL_DATA 7
SCALARS Property_0 float
LOOKUP_TABLE custom_table
0.00
5.00
4.00
3.00
1.00
4.00
5.00
