# vtk DataFile Version 1.0
B38F0009.vtk
ASCII

DATASET UNSTRUCTURED_GRID
POINTS 88 float
134820.50 446375.50 1.00 134820.50 446380.50 1.00 134825.50 446380.50 1.00 134825.50 446375.50 1.00 134820.50 446375.50 -0.75 134820.50 446380.50 -0.75 134825.50 446380.50 -0.75 134825.50 446375.50 -0.75
134820.50 446375.50 -0.75 134820.50 446380.50 -0.75 134825.50 446380.50 -0.75 134825.50 446375.50 -0.75 134820.50 446375.50 -2.25 134820.50 446380.50 -2.25 134825.50 446380.50 -2.25 134825.50 446375.50 -2.25
134820.50 446375.50 -2.25 134820.50 446380.50 -2.25 134825.50 446380.50 -2.25 134825.50 446375.50 -2.25 134820.50 446375.50 -2.50 134820.50 446380.50 -2.50 134825.50 446380.50 -2.50 134825.50 446375.50 -2.50
134820.50 446375.50 -2.50 134820.50 446380.50 -2.50 134825.50 446380.50 -2.50 134825.50 446375.50 -2.50 134820.50 446375.50 -4.60 134820.50 446380.50 -4.60 134825.50 446380.50 -4.60 134825.50 446375.50 -4.60
134820.50 446375.50 -4.60 134820.50 446380.50 -4.60 134825.50 446380.50 -4.60 134825.50 446375.50 -4.60 134820.50 446375.50 -10.30 134820.50 446380.50 -10.30 134825.50 446380.50 -10.30 134825.50 446375.50 -10.30
134820.50 446375.50 -10.30 134820.50 446380.50 -10.30 134825.50 446380.50 -10.30 134825.50 446375.50 -10.30 134820.50 446375.50 -11.00 134820.50 446380.50 -11.00 134825.50 446380.50 -11.00 134825.50 446375.50 -11.00
134820.50 446375.50 -11.00 134820.50 446380.50 -11.00 134825.50 446380.50 -11.00 134825.50 446375.50 -11.00 134820.50 446375.50 -12.60 134820.50 446380.50 -12.60 134825.50 446380.50 -12.60 134825.50 446375.50 -12.60
134820.50 446375.50 -12.60 134820.50 446380.50 -12.60 134825.50 446380.50 -12.60 134825.50 446375.50 -12.60 134820.50 446375.50 -13.80 134820.50 446380.50 -13.80 134825.50 446380.50 -13.80 134825.50 446375.50 -13.80
134820.50 446375.50 -13.80 134820.50 446380.50 -13.80 134825.50 446380.50 -13.80 134825.50 446375.50 -13.80 134820.50 446375.50 -19.60 134820.50 446380.50 -19.60 134825.50 446380.50 -19.60 134825.50 446375.50 -19.60
134820.50 446375.50 -19.60 134820.50 446380.50 -19.60 134825.50 446380.50 -19.60 134825.50 446375.50 -19.60 134820.50 446375.50 -20.00 134820.50 446380.50 -20.00 134825.50 446380.50 -20.00 134825.50 446375.50 -20.00
134820.50 446375.50 -20.00 134820.50 446380.50 -20.00 134825.50 446380.50 -20.00 134825.50 446375.50 -20.00 134820.50 446375.50 -24.20 134820.50 446380.50 -24.20 134825.50 446380.50 -24.20 134825.50 446375.50 -24.20

CELLS 11 99
8 4 7 6 5 0 3 2 1
8 12 15 14 13 8 11 10 9
8 20 23 22 21 16 19 18 17
8 28 31 30 29 24 27 26 25
8 36 39 38 37 32 35 34 33
8 44 47 46 45 40 43 42 41
8 52 55 54 53 48 51 50 49
8 60 63 62 61 56 59 58 57
8 68 71 70 69 64 67 66 65
8 76 79 78 77 72 75 74 73
8 84 87 86 85 80 83 82 81

CELL_TYPES 11
12
12
12
12
12
12
12
12
12
12
12

CELL_DATA 11
SCALARS Property_0 float
LOOKUP_TABLE custom_table
1.00
3.00
1.00
0.00
4.00
0.00
4.00
0.00
5.00
0.00
5.00
