# vtk DataFile Version 1.0
B38F2043.vtk
ASCII

DATASET UNSTRUCTURED_GRID
POINTS 32 float
137976.50 443891.50 3.66 137976.50 443896.50 3.66 137981.50 443896.50 3.66 137981.50 443891.50 3.66 137976.50 443891.50 3.26 137976.50 443896.50 3.26 137981.50 443896.50 3.26 137981.50 443891.50 3.26
137976.50 443891.50 3.26 137976.50 443896.50 3.26 137981.50 443896.50 3.26 137981.50 443891.50 3.26 137976.50 443891.50 2.96 137976.50 443896.50 2.96 137981.50 443896.50 2.96 137981.50 443891.50 2.96
137976.50 443891.50 2.96 137976.50 443896.50 2.96 137981.50 443896.50 2.96 137981.50 443891.50 2.96 137976.50 443891.50 2.46 137976.50 443896.50 2.46 137981.50 443896.50 2.46 137981.50 443891.50 2.46
137976.50 443891.50 2.46 137976.50 443896.50 2.46 137981.50 443896.50 2.46 137981.50 443891.50 2.46 137976.50 443891.50 2.22 137976.50 443896.50 2.22 137981.50 443896.50 2.22 137981.50 443891.50 2.22

CELLS 4 36
8 4 7 6 5 0 3 2 1
8 12 15 14 13 8 11 10 9
8 20 23 22 21 16 19 18 17
8 28 31 30 29 24 27 26 25

CELL_TYPES 4
12
12
12
12

CELL_DATA 4
SCALARS Property_0 float
LOOKUP_TABLE custom_table
6.00
4.00
6.00
7.00
