# vtk DataFile Version 1.0
B38F1395.vtk
ASCII

DATASET UNSTRUCTURED_GRID
POINTS 24 float
136388.50 445155.50 1.90 136388.50 445160.50 1.90 136393.50 445160.50 1.90 136393.50 445155.50 1.90 136388.50 445155.50 -0.20 136388.50 445160.50 -0.20 136393.50 445160.50 -0.20 136393.50 445155.50 -0.20
136388.50 445155.50 -0.20 136388.50 445160.50 -0.20 136393.50 445160.50 -0.20 136393.50 445155.50 -0.20 136388.50 445155.50 -1.50 136388.50 445160.50 -1.50 136393.50 445160.50 -1.50 136393.50 445155.50 -1.50
136388.50 445155.50 -1.50 136388.50 445160.50 -1.50 136393.50 445160.50 -1.50 136393.50 445155.50 -1.50 136388.50 445155.50 -2.18 136388.50 445160.50 -2.18 136393.50 445160.50 -2.18 136393.50 445155.50 -2.18

CELLS 3 27
8 4 7 6 5 0 3 2 1
8 12 15 14 13 8 11 10 9
8 20 23 22 21 16 19 18 17

CELL_TYPES 3
12
12
12

CELL_DATA 3
SCALARS Property_0 float
LOOKUP_TABLE custom_table
1.00
6.00
0.00
