# vtk DataFile Version 1.0
B38F0188.vtk
ASCII

DATASET UNSTRUCTURED_GRID
POINTS 72 float
131832.50 443471.50 2.50 131832.50 443476.50 2.50 131837.50 443476.50 2.50 131837.50 443471.50 2.50 131832.50 443471.50 1.40 131832.50 443476.50 1.40 131837.50 443476.50 1.40 131837.50 443471.50 1.40
131832.50 443471.50 1.40 131832.50 443476.50 1.40 131837.50 443476.50 1.40 131837.50 443471.50 1.40 131832.50 443471.50 -0.80 131832.50 443476.50 -0.80 131837.50 443476.50 -0.80 131837.50 443471.50 -0.80
131832.50 443471.50 -0.80 131832.50 443476.50 -0.80 131837.50 443476.50 -0.80 131837.50 443471.50 -0.80 131832.50 443471.50 -2.00 131832.50 443476.50 -2.00 131837.50 443476.50 -2.00 131837.50 443471.50 -2.00
131832.50 443471.50 -2.00 131832.50 443476.50 -2.00 131837.50 443476.50 -2.00 131837.50 443471.50 -2.00 131832.50 443471.50 -2.50 131832.50 443476.50 -2.50 131837.50 443476.50 -2.50 131837.50 443471.50 -2.50
131832.50 443471.50 -2.50 131832.50 443476.50 -2.50 131837.50 443476.50 -2.50 131837.50 443471.50 -2.50 131832.50 443471.50 -5.50 131832.50 443476.50 -5.50 131837.50 443476.50 -5.50 131837.50 443471.50 -5.50
131832.50 443471.50 -5.50 131832.50 443476.50 -5.50 131837.50 443476.50 -5.50 131837.50 443471.50 -5.50 131832.50 443471.50 -6.10 131832.50 443476.50 -6.10 131837.50 443476.50 -6.10 131837.50 443471.50 -6.10
131832.50 443471.50 -6.10 131832.50 443476.50 -6.10 131837.50 443476.50 -6.10 131837.50 443471.50 -6.10 131832.50 443471.50 -6.30 131832.50 443476.50 -6.30 131837.50 443476.50 -6.30 131837.50 443471.50 -6.30
131832.50 443471.50 -6.30 131832.50 443476.50 -6.30 131837.50 443476.50 -6.30 131837.50 443471.50 -6.30 131832.50 443471.50 -8.05 131832.50 443476.50 -8.05 131837.50 443476.50 -8.05 131837.50 443471.50 -8.05
131832.50 443471.50 -8.05 131832.50 443476.50 -8.05 131837.50 443476.50 -8.05 131837.50 443471.50 -8.05 131832.50 443471.50 -10.16 131832.50 443476.50 -10.16 131837.50 443476.50 -10.16 131837.50 443471.50 -10.16

CELLS 9 81
8 4 7 6 5 0 3 2 1
8 12 15 14 13 8 11 10 9
8 20 23 22 21 16 19 18 17
8 28 31 30 29 24 27 26 25
8 36 39 38 37 32 35 34 33
8 44 47 46 45 40 43 42 41
8 52 55 54 53 48 51 50 49
8 60 63 62 61 56 59 58 57
8 68 71 70 69 64 67 66 65

CELL_TYPES 9
12
12
12
12
12
12
12
12
12

CELL_DATA 9
SCALARS Property_0 float
LOOKUP_TABLE custom_table
6.00
7.00
4.00
5.00
4.00
1.00
3.00
1.00
5.00
