# vtk DataFile Version 1.0
B38F0021.vtk
ASCII

DATASET UNSTRUCTURED_GRID
POINTS 56 float
133367.50 442300.50 0.50 133367.50 442305.50 0.50 133372.50 442305.50 0.50 133372.50 442300.50 0.50 133367.50 442300.50 -1.50 133367.50 442305.50 -1.50 133372.50 442305.50 -1.50 133372.50 442300.50 -1.50
133367.50 442300.50 -1.50 133367.50 442305.50 -1.50 133372.50 442305.50 -1.50 133372.50 442300.50 -1.50 133367.50 442300.50 -4.10 133367.50 442305.50 -4.10 133372.50 442305.50 -4.10 133372.50 442300.50 -4.10
133367.50 442300.50 -4.10 133367.50 442305.50 -4.10 133372.50 442305.50 -4.10 133372.50 442300.50 -4.10 133367.50 442300.50 -6.10 133367.50 442305.50 -6.10 133372.50 442305.50 -6.10 133372.50 442300.50 -6.10
133367.50 442300.50 -6.10 133367.50 442305.50 -6.10 133372.50 442305.50 -6.10 133372.50 442300.50 -6.10 133367.50 442300.50 -6.50 133367.50 442305.50 -6.50 133372.50 442305.50 -6.50 133372.50 442300.50 -6.50
133367.50 442300.50 -6.50 133367.50 442305.50 -6.50 133372.50 442305.50 -6.50 133372.50 442300.50 -6.50 133367.50 442300.50 -10.15 133367.50 442305.50 -10.15 133372.50 442305.50 -10.15 133372.50 442300.50 -10.15
133367.50 442300.50 -10.15 133367.50 442305.50 -10.15 133372.50 442305.50 -10.15 133372.50 442300.50 -10.15 133367.50 442300.50 -11.50 133367.50 442305.50 -11.50 133372.50 442305.50 -11.50 133372.50 442300.50 -11.50
133367.50 442300.50 -11.50 133367.50 442305.50 -11.50 133372.50 442305.50 -11.50 133372.50 442300.50 -11.50 133367.50 442300.50 -13.90 133367.50 442305.50 -13.90 133372.50 442305.50 -13.90 133372.50 442300.50 -13.90

CELLS 7 63
8 4 7 6 5 0 3 2 1
8 12 15 14 13 8 11 10 9
8 20 23 22 21 16 19 18 17
8 28 31 30 29 24 27 26 25
8 36 39 38 37 32 35 34 33
8 44 47 46 45 40 43 42 41
8 52 55 54 53 48 51 50 49

CELL_TYPES 7
12
12
12
12
12
12
12

CELL_DATA 7
SCALARS Property_0 float
LOOKUP_TABLE custom_table
1.00
3.00
1.00
6.00
0.00
4.00
5.00
