# vtk DataFile Version 1.0
B38F1240.vtk
ASCII

DATASET UNSTRUCTURED_GRID
POINTS 48 float
136147.50 442139.50 0.60 136147.50 442144.50 0.60 136152.50 442144.50 0.60 136152.50 442139.50 0.60 136147.50 442139.50 -0.60 136147.50 442144.50 -0.60 136152.50 442144.50 -0.60 136152.50 442139.50 -0.60
136147.50 442139.50 -0.60 136147.50 442144.50 -0.60 136152.50 442144.50 -0.60 136152.50 442139.50 -0.60 136147.50 442139.50 -2.90 136147.50 442144.50 -2.90 136152.50 442144.50 -2.90 136152.50 442139.50 -2.90
136147.50 442139.50 -2.90 136147.50 442144.50 -2.90 136152.50 442144.50 -2.90 136152.50 442139.50 -2.90 136147.50 442139.50 -3.10 136147.50 442144.50 -3.10 136152.50 442144.50 -3.10 136152.50 442139.50 -3.10
136147.50 442139.50 -3.10 136147.50 442144.50 -3.10 136152.50 442144.50 -3.10 136152.50 442139.50 -3.10 136147.50 442139.50 -4.30 136147.50 442144.50 -4.30 136152.50 442144.50 -4.30 136152.50 442139.50 -4.30
136147.50 442139.50 -4.30 136147.50 442144.50 -4.30 136152.50 442144.50 -4.30 136152.50 442139.50 -4.30 136147.50 442139.50 -5.50 136147.50 442144.50 -5.50 136152.50 442144.50 -5.50 136152.50 442139.50 -5.50
136147.50 442139.50 -5.50 136147.50 442144.50 -5.50 136152.50 442144.50 -5.50 136152.50 442139.50 -5.50 136147.50 442139.50 -6.72 136147.50 442144.50 -6.72 136152.50 442144.50 -6.72 136152.50 442139.50 -6.72

CELLS 6 54
8 4 7 6 5 0 3 2 1
8 12 15 14 13 8 11 10 9
8 20 23 22 21 16 19 18 17
8 28 31 30 29 24 27 26 25
8 36 39 38 37 32 35 34 33
8 44 47 46 45 40 43 42 41

CELL_TYPES 6
12
12
12
12
12
12

CELL_DATA 6
SCALARS Property_0 float
LOOKUP_TABLE custom_table
1.00
3.00
1.00
6.00
7.00
0.00
