# vtk DataFile Version 1.0
B38F0305.vtk
ASCII

DATASET UNSTRUCTURED_GRID
POINTS 40 float
137277.50 442737.50 0.95 137277.50 442742.50 0.95 137282.50 442742.50 0.95 137282.50 442737.50 0.95 137277.50 442737.50 -0.35 137277.50 442742.50 -0.35 137282.50 442742.50 -0.35 137282.50 442737.50 -0.35
137277.50 442737.50 -0.35 137277.50 442742.50 -0.35 137282.50 442742.50 -0.35 137282.50 442737.50 -0.35 137277.50 442737.50 -0.75 137277.50 442742.50 -0.75 137282.50 442742.50 -0.75 137282.50 442737.50 -0.75
137277.50 442737.50 -0.75 137277.50 442742.50 -0.75 137282.50 442742.50 -0.75 137282.50 442737.50 -0.75 137277.50 442737.50 -1.35 137277.50 442742.50 -1.35 137282.50 442742.50 -1.35 137282.50 442737.50 -1.35
137277.50 442737.50 -1.35 137277.50 442742.50 -1.35 137282.50 442742.50 -1.35 137282.50 442737.50 -1.35 137277.50 442737.50 -2.85 137277.50 442742.50 -2.85 137282.50 442742.50 -2.85 137282.50 442737.50 -2.85
137277.50 442737.50 -2.85 137277.50 442742.50 -2.85 137282.50 442742.50 -2.85 137282.50 442737.50 -2.85 137277.50 442737.50 -3.61 137277.50 442742.50 -3.61 137282.50 442742.50 -3.61 137282.50 442737.50 -3.61

CELLS 5 45
8 4 7 6 5 0 3 2 1
8 12 15 14 13 8 11 10 9
8 20 23 22 21 16 19 18 17
8 28 31 30 29 24 27 26 25
8 36 39 38 37 32 35 34 33

CELL_TYPES 5
12
12
12
12
12

CELL_DATA 5
SCALARS Property_0 float
LOOKUP_TABLE custom_table
6.00
1.00
3.00
6.00
5.00
