<?xml version="1.0" encoding="UTF-8"?>
<kml xmlns="http://www.opengis.net/kml/2.2" xmlns:gx="http://www.google.com/kml/ext/2.2">
    <Document id="1">
        <Placemark id="3">
            <name>Line 1</name>
            <description>Area</description>
            <LineString id="2">
                <coordinates>5.023465856441283,51.961366858815836,0.0 5.139860421848861,51.9616691013034,0.0</coordinates>
            </LineString>
        </Placemark>
        <Placemark id="5">
            <name>Line 2</name>
            <description>Area</description>
            <LineString id="4">
                <coordinates>5.139860421848861,51.9616691013034,0.0 5.139612627992198,52.006609608242826,0.0</coordinates>
            </LineString>
        </Placemark>
        <Placemark id="7">
            <name>Line 3</name>
            <description>Area</description>
            <LineString id="6">
                <coordinates>5.139612627992198,52.006609608242826,0.0 5.023101382690895,52.00630697235334,0.0</coordinates>
            </LineString>
        </Placemark>
        <Placemark id="9">
            <name>Line 4</name>
            <description>Area</description>
            <LineString id="8">
                <coordinates>5.023101382690895,52.00630697235334,0.0 5.023465856441283,51.961366858815836,0.0</coordinates>
            </LineString>
        </Placemark>
    </Document>
</kml>
