# vtk DataFile Version 1.0
B38F1823.vtk
ASCII

DATASET UNSTRUCTURED_GRID
POINTS 80 float
133525.50 444696.50 6.97 133525.50 444701.50 6.97 133530.50 444701.50 6.97 133530.50 444696.50 6.97 133525.50 444696.50 6.17 133525.50 444701.50 6.17 133530.50 444701.50 6.17 133530.50 444696.50 6.17
133525.50 444696.50 6.17 133525.50 444701.50 6.17 133530.50 444701.50 6.17 133530.50 444696.50 6.17 133525.50 444696.50 5.47 133525.50 444701.50 5.47 133530.50 444701.50 5.47 133530.50 444696.50 5.47
133525.50 444696.50 5.47 133525.50 444701.50 5.47 133530.50 444701.50 5.47 133530.50 444696.50 5.47 133525.50 444696.50 4.68 133525.50 444701.50 4.68 133530.50 444701.50 4.68 133530.50 444696.50 4.68
133525.50 444696.50 4.68 133525.50 444701.50 4.68 133530.50 444701.50 4.68 133530.50 444696.50 4.68 133525.50 444696.50 1.25 133525.50 444701.50 1.25 133530.50 444701.50 1.25 133530.50 444696.50 1.25
133525.50 444696.50 1.25 133525.50 444701.50 1.25 133530.50 444701.50 1.25 133530.50 444696.50 1.25 133525.50 444696.50 0.82 133525.50 444701.50 0.82 133530.50 444701.50 0.82 133530.50 444696.50 0.82
133525.50 444696.50 0.82 133525.50 444701.50 0.82 133530.50 444701.50 0.82 133530.50 444696.50 0.82 133525.50 444696.50 -0.07 133525.50 444701.50 -0.07 133530.50 444701.50 -0.07 133530.50 444696.50 -0.07
133525.50 444696.50 -0.07 133525.50 444701.50 -0.07 133530.50 444701.50 -0.07 133530.50 444696.50 -0.07 133525.50 444696.50 -0.77 133525.50 444701.50 -0.77 133530.50 444701.50 -0.77 133530.50 444696.50 -0.77
133525.50 444696.50 -0.77 133525.50 444701.50 -0.77 133530.50 444701.50 -0.77 133530.50 444696.50 -0.77 133525.50 444696.50 -5.75 133525.50 444701.50 -5.75 133530.50 444701.50 -5.75 133530.50 444696.50 -5.75
133525.50 444696.50 -5.75 133525.50 444701.50 -5.75 133530.50 444701.50 -5.75 133530.50 444696.50 -5.75 133525.50 444696.50 -6.00 133525.50 444701.50 -6.00 133530.50 444701.50 -6.00 133530.50 444696.50 -6.00
133525.50 444696.50 -6.00 133525.50 444701.50 -6.00 133530.50 444701.50 -6.00 133530.50 444696.50 -6.00 133525.50 444696.50 -8.59 133525.50 444701.50 -8.59 133530.50 444701.50 -8.59 133530.50 444696.50 -8.59

CELLS 10 90
8 4 7 6 5 0 3 2 1
8 12 15 14 13 8 11 10 9
8 20 23 22 21 16 19 18 17
8 28 31 30 29 24 27 26 25
8 36 39 38 37 32 35 34 33
8 44 47 46 45 40 43 42 41
8 52 55 54 53 48 51 50 49
8 60 63 62 61 56 59 58 57
8 68 71 70 69 64 67 66 65
8 76 79 78 77 72 75 74 73

CELL_TYPES 10
12
12
12
12
12
12
12
12
12
12

CELL_DATA 10
SCALARS Property_0 float
LOOKUP_TABLE custom_table
0.00
1.00
6.00
1.00
6.00
1.00
6.00
0.00
6.00
0.00
