# vtk DataFile Version 1.0
B38F1743.vtk
ASCII

DATASET UNSTRUCTURED_GRID
POINTS 56 float
131584.50 442589.50 1.62 131584.50 442594.50 1.62 131589.50 442594.50 1.62 131589.50 442589.50 1.62 131584.50 442589.50 1.32 131584.50 442594.50 1.32 131589.50 442594.50 1.32 131589.50 442589.50 1.32
131584.50 442589.50 1.32 131584.50 442594.50 1.32 131589.50 442594.50 1.32 131589.50 442589.50 1.32 131584.50 442589.50 0.84 131584.50 442594.50 0.84 131589.50 442594.50 0.84 131589.50 442589.50 0.84
131584.50 442589.50 0.84 131584.50 442594.50 0.84 131589.50 442594.50 0.84 131589.50 442589.50 0.84 131584.50 442589.50 -2.71 131584.50 442594.50 -2.71 131589.50 442594.50 -2.71 131589.50 442589.50 -2.71
131584.50 442589.50 -2.71 131584.50 442594.50 -2.71 131589.50 442594.50 -2.71 131589.50 442589.50 -2.71 131584.50 442589.50 -4.28 131584.50 442594.50 -4.28 131589.50 442594.50 -4.28 131589.50 442589.50 -4.28
131584.50 442589.50 -4.28 131584.50 442594.50 -4.28 131589.50 442594.50 -4.28 131589.50 442589.50 -4.28 131584.50 442589.50 -4.68 131584.50 442594.50 -4.68 131589.50 442594.50 -4.68 131589.50 442589.50 -4.68
131584.50 442589.50 -4.68 131584.50 442594.50 -4.68 131589.50 442594.50 -4.68 131589.50 442589.50 -4.68 131584.50 442589.50 -6.69 131584.50 442594.50 -6.69 131589.50 442594.50 -6.69 131589.50 442589.50 -6.69
131584.50 442589.50 -6.69 131584.50 442594.50 -6.69 131589.50 442594.50 -6.69 131589.50 442589.50 -6.69 131584.50 442589.50 -8.35 131584.50 442594.50 -8.35 131589.50 442594.50 -8.35 131589.50 442589.50 -8.35

CELLS 7 63
8 4 7 6 5 0 3 2 1
8 12 15 14 13 8 11 10 9
8 20 23 22 21 16 19 18 17
8 28 31 30 29 24 27 26 25
8 36 39 38 37 32 35 34 33
8 44 47 46 45 40 43 42 41
8 52 55 54 53 48 51 50 49

CELL_TYPES 7
12
12
12
12
12
12
12

CELL_DATA 7
SCALARS Property_0 float
LOOKUP_TABLE custom_table
1.00
6.00
1.00
3.00
1.00
6.00
0.00
