# vtk DataFile Version 1.0
B38F1977.vtk
ASCII

DATASET UNSTRUCTURED_GRID
POINTS 24 float
130036.50 445548.50 -0.28 130036.50 445553.50 -0.28 130041.50 445553.50 -0.28 130041.50 445548.50 -0.28 130036.50 445548.50 -1.58 130036.50 445553.50 -1.58 130041.50 445553.50 -1.58 130041.50 445548.50 -1.58
130036.50 445548.50 -1.58 130036.50 445553.50 -1.58 130041.50 445553.50 -1.58 130041.50 445548.50 -1.58 130036.50 445548.50 -1.98 130036.50 445553.50 -1.98 130041.50 445553.50 -1.98 130041.50 445548.50 -1.98
130036.50 445548.50 -1.98 130036.50 445553.50 -1.98 130041.50 445553.50 -1.98 130041.50 445548.50 -1.98 130036.50 445548.50 -2.32 130036.50 445553.50 -2.32 130041.50 445553.50 -2.32 130041.50 445548.50 -2.32

CELLS 3 27
8 4 7 6 5 0 3 2 1
8 12 15 14 13 8 11 10 9
8 20 23 22 21 16 19 18 17

CELL_TYPES 3
12
12
12

CELL_DATA 3
SCALARS Property_0 float
LOOKUP_TABLE custom_table
1.00
3.00
5.00
