# vtk DataFile Version 1.0
B38F0391.vtk
ASCII

DATASET UNSTRUCTURED_GRID
POINTS 176 float
134638.50 445246.50 2.00 134638.50 445251.50 2.00 134643.50 445251.50 2.00 134643.50 445246.50 2.00 134638.50 445246.50 1.50 134638.50 445251.50 1.50 134643.50 445251.50 1.50 134643.50 445246.50 1.50
134638.50 445246.50 1.50 134638.50 445251.50 1.50 134643.50 445251.50 1.50 134643.50 445246.50 1.50 134638.50 445246.50 0.50 134638.50 445251.50 0.50 134643.50 445251.50 0.50 134643.50 445246.50 0.50
134638.50 445246.50 0.50 134638.50 445251.50 0.50 134643.50 445251.50 0.50 134643.50 445246.50 0.50 134638.50 445246.50 -0.40 134638.50 445251.50 -0.40 134643.50 445251.50 -0.40 134643.50 445246.50 -0.40
134638.50 445246.50 -0.40 134638.50 445251.50 -0.40 134643.50 445251.50 -0.40 134643.50 445246.50 -0.40 134638.50 445246.50 -2.50 134638.50 445251.50 -2.50 134643.50 445251.50 -2.50 134643.50 445246.50 -2.50
134638.50 445246.50 -2.50 134638.50 445251.50 -2.50 134643.50 445251.50 -2.50 134643.50 445246.50 -2.50 134638.50 445246.50 -5.25 134638.50 445251.50 -5.25 134643.50 445251.50 -5.25 134643.50 445246.50 -5.25
134638.50 445246.50 -5.25 134638.50 445251.50 -5.25 134643.50 445251.50 -5.25 134643.50 445246.50 -5.25 134638.50 445246.50 -7.10 134638.50 445251.50 -7.10 134643.50 445251.50 -7.10 134643.50 445246.50 -7.10
134638.50 445246.50 -7.10 134638.50 445251.50 -7.10 134643.50 445251.50 -7.10 134643.50 445246.50 -7.10 134638.50 445246.50 -14.50 134638.50 445251.50 -14.50 134643.50 445251.50 -14.50 134643.50 445246.50 -14.50
134638.50 445246.50 -14.50 134638.50 445251.50 -14.50 134643.50 445251.50 -14.50 134643.50 445246.50 -14.50 134638.50 445246.50 -15.20 134638.50 445251.50 -15.20 134643.50 445251.50 -15.20 134643.50 445246.50 -15.20
134638.50 445246.50 -15.20 134638.50 445251.50 -15.20 134643.50 445251.50 -15.20 134643.50 445246.50 -15.20 134638.50 445246.50 -21.50 134638.50 445251.50 -21.50 134643.50 445251.50 -21.50 134643.50 445246.50 -21.50
134638.50 445246.50 -21.50 134638.50 445251.50 -21.50 134643.50 445251.50 -21.50 134643.50 445246.50 -21.50 134638.50 445246.50 -33.25 134638.50 445251.50 -33.25 134643.50 445251.50 -33.25 134643.50 445246.50 -33.25
134638.50 445246.50 -33.25 134638.50 445251.50 -33.25 134643.50 445251.50 -33.25 134643.50 445246.50 -33.25 134638.50 445246.50 -49.00 134638.50 445251.50 -49.00 134643.50 445251.50 -49.00 134643.50 445246.50 -49.00
134638.50 445246.50 -49.00 134638.50 445251.50 -49.00 134643.50 445251.50 -49.00 134643.50 445246.50 -49.00 134638.50 445246.50 -50.25 134638.50 445251.50 -50.25 134643.50 445251.50 -50.25 134643.50 445246.50 -50.25
134638.50 445246.50 -50.25 134638.50 445251.50 -50.25 134643.50 445251.50 -50.25 134643.50 445246.50 -50.25 134638.50 445246.50 -51.00 134638.50 445251.50 -51.00 134643.50 445251.50 -51.00 134643.50 445246.50 -51.00
134638.50 445246.50 -51.00 134638.50 445251.50 -51.00 134643.50 445251.50 -51.00 134643.50 445246.50 -51.00 134638.50 445246.50 -52.35 134638.50 445251.50 -52.35 134643.50 445251.50 -52.35 134643.50 445246.50 -52.35
134638.50 445246.50 -52.35 134638.50 445251.50 -52.35 134643.50 445251.50 -52.35 134643.50 445246.50 -52.35 134638.50 445246.50 -57.00 134638.50 445251.50 -57.00 134643.50 445251.50 -57.00 134643.50 445246.50 -57.00
134638.50 445246.50 -57.00 134638.50 445251.50 -57.00 134643.50 445251.50 -57.00 134643.50 445246.50 -57.00 134638.50 445246.50 -61.00 134638.50 445251.50 -61.00 134643.50 445251.50 -61.00 134643.50 445246.50 -61.00
134638.50 445246.50 -61.00 134638.50 445251.50 -61.00 134643.50 445251.50 -61.00 134643.50 445246.50 -61.00 134638.50 445246.50 -62.00 134638.50 445251.50 -62.00 134643.50 445251.50 -62.00 134643.50 445246.50 -62.00
134638.50 445246.50 -62.00 134638.50 445251.50 -62.00 134643.50 445251.50 -62.00 134643.50 445246.50 -62.00 134638.50 445246.50 -66.25 134638.50 445251.50 -66.25 134643.50 445251.50 -66.25 134643.50 445246.50 -66.25
134638.50 445246.50 -66.25 134638.50 445251.50 -66.25 134643.50 445251.50 -66.25 134643.50 445246.50 -66.25 134638.50 445246.50 -68.20 134638.50 445251.50 -68.20 134643.50 445251.50 -68.20 134643.50 445246.50 -68.20
134638.50 445246.50 -68.20 134638.50 445251.50 -68.20 134643.50 445251.50 -68.20 134643.50 445246.50 -68.20 134638.50 445246.50 -77.50 134638.50 445251.50 -77.50 134643.50 445251.50 -77.50 134643.50 445246.50 -77.50
134638.50 445246.50 -77.50 134638.50 445251.50 -77.50 134643.50 445251.50 -77.50 134643.50 445246.50 -77.50 134638.50 445246.50 -80.00 134638.50 445251.50 -80.00 134643.50 445251.50 -80.00 134643.50 445246.50 -80.00
134638.50 445246.50 -80.00 134638.50 445251.50 -80.00 134643.50 445251.50 -80.00 134643.50 445246.50 -80.00 134638.50 445246.50 -96.40 134638.50 445251.50 -96.40 134643.50 445251.50 -96.40 134643.50 445246.50 -96.40

CELLS 22 198
8 4 7 6 5 0 3 2 1
8 12 15 14 13 8 11 10 9
8 20 23 22 21 16 19 18 17
8 28 31 30 29 24 27 26 25
8 36 39 38 37 32 35 34 33
8 44 47 46 45 40 43 42 41
8 52 55 54 53 48 51 50 49
8 60 63 62 61 56 59 58 57
8 68 71 70 69 64 67 66 65
8 76 79 78 77 72 75 74 73
8 84 87 86 85 80 83 82 81
8 92 95 94 93 88 91 90 89
8 100 103 102 101 96 99 98 97
8 108 111 110 109 104 107 106 105
8 116 119 118 117 112 115 114 113
8 124 127 126 125 120 123 122 121
8 132 135 134 133 128 131 130 129
8 140 143 142 141 136 139 138 137
8 148 151 150 149 144 147 146 145
8 156 159 158 157 152 155 154 153
8 164 167 166 165 160 163 162 161
8 172 175 174 173 168 171 170 169

CELL_TYPES 22
12
12
12
12
12
12
12
12
12
12
12
12
12
12
12
12
12
12
12
12
12
12

CELL_DATA 22
SCALARS Property_0 float
LOOKUP_TABLE custom_table
6.00
4.00
6.00
4.00
6.00
3.00
6.00
4.00
5.00
5.00
4.00
5.00
0.00
6.00
4.00
6.00
0.00
6.00
4.00
6.00
4.00
5.00
