# vtk DataFile Version 1.0
B38F0355.vtk
ASCII

DATASET UNSTRUCTURED_GRID
POINTS 112 float
137209.50 446384.50 1.72 137209.50 446389.50 1.72 137214.50 446389.50 1.72 137214.50 446384.50 1.72 137209.50 446384.50 0.02 137209.50 446389.50 0.02 137214.50 446389.50 0.02 137214.50 446384.50 0.02
137209.50 446384.50 0.02 137209.50 446389.50 0.02 137214.50 446389.50 0.02 137214.50 446384.50 0.02 137209.50 446384.50 -1.28 137209.50 446389.50 -1.28 137214.50 446389.50 -1.28 137214.50 446384.50 -1.28
137209.50 446384.50 -1.28 137209.50 446389.50 -1.28 137214.50 446389.50 -1.28 137214.50 446384.50 -1.28 137209.50 446384.50 -4.18 137209.50 446389.50 -4.18 137214.50 446389.50 -4.18 137214.50 446384.50 -4.18
137209.50 446384.50 -4.18 137209.50 446389.50 -4.18 137214.50 446389.50 -4.18 137214.50 446384.50 -4.18 137209.50 446384.50 -6.28 137209.50 446389.50 -6.28 137214.50 446389.50 -6.28 137214.50 446384.50 -6.28
137209.50 446384.50 -6.28 137209.50 446389.50 -6.28 137214.50 446389.50 -6.28 137214.50 446384.50 -6.28 137209.50 446384.50 -10.58 137209.50 446389.50 -10.58 137214.50 446389.50 -10.58 137214.50 446384.50 -10.58
137209.50 446384.50 -10.58 137209.50 446389.50 -10.58 137214.50 446389.50 -10.58 137214.50 446384.50 -10.58 137209.50 446384.50 -12.48 137209.50 446389.50 -12.48 137214.50 446389.50 -12.48 137214.50 446384.50 -12.48
137209.50 446384.50 -12.48 137209.50 446389.50 -12.48 137214.50 446389.50 -12.48 137214.50 446384.50 -12.48 137209.50 446384.50 -13.28 137209.50 446389.50 -13.28 137214.50 446389.50 -13.28 137214.50 446384.50 -13.28
137209.50 446384.50 -13.28 137209.50 446389.50 -13.28 137214.50 446389.50 -13.28 137214.50 446384.50 -13.28 137209.50 446384.50 -21.08 137209.50 446389.50 -21.08 137214.50 446389.50 -21.08 137214.50 446384.50 -21.08
137209.50 446384.50 -21.08 137209.50 446389.50 -21.08 137214.50 446389.50 -21.08 137214.50 446384.50 -21.08 137209.50 446384.50 -22.88 137209.50 446389.50 -22.88 137214.50 446389.50 -22.88 137214.50 446384.50 -22.88
137209.50 446384.50 -22.88 137209.50 446389.50 -22.88 137214.50 446389.50 -22.88 137214.50 446384.50 -22.88 137209.50 446384.50 -25.38 137209.50 446389.50 -25.38 137214.50 446389.50 -25.38 137214.50 446384.50 -25.38
137209.50 446384.50 -25.38 137209.50 446389.50 -25.38 137214.50 446389.50 -25.38 137214.50 446384.50 -25.38 137209.50 446384.50 -31.48 137209.50 446389.50 -31.48 137214.50 446389.50 -31.48 137214.50 446384.50 -31.48
137209.50 446384.50 -31.48 137209.50 446389.50 -31.48 137214.50 446389.50 -31.48 137214.50 446384.50 -31.48 137209.50 446384.50 -33.08 137209.50 446389.50 -33.08 137214.50 446389.50 -33.08 137214.50 446384.50 -33.08
137209.50 446384.50 -33.08 137209.50 446389.50 -33.08 137214.50 446389.50 -33.08 137214.50 446384.50 -33.08 137209.50 446384.50 -34.68 137209.50 446389.50 -34.68 137214.50 446389.50 -34.68 137214.50 446384.50 -34.68
137209.50 446384.50 -34.68 137209.50 446389.50 -34.68 137214.50 446389.50 -34.68 137214.50 446384.50 -34.68 137209.50 446384.50 -41.96 137209.50 446389.50 -41.96 137214.50 446389.50 -41.96 137214.50 446384.50 -41.96

CELLS 14 126
8 4 7 6 5 0 3 2 1
8 12 15 14 13 8 11 10 9
8 20 23 22 21 16 19 18 17
8 28 31 30 29 24 27 26 25
8 36 39 38 37 32 35 34 33
8 44 47 46 45 40 43 42 41
8 52 55 54 53 48 51 50 49
8 60 63 62 61 56 59 58 57
8 68 71 70 69 64 67 66 65
8 76 79 78 77 72 75 74 73
8 84 87 86 85 80 83 82 81
8 92 95 94 93 88 91 90 89
8 100 103 102 101 96 99 98 97
8 108 111 110 109 104 107 106 105

CELL_TYPES 14
12
12
12
12
12
12
12
12
12
12
12
12
12
12

CELL_DATA 14
SCALARS Property_0 float
LOOKUP_TABLE custom_table
1.00
6.00
5.00
4.00
5.00
5.00
4.00
5.00
4.00
1.00
5.00
4.00
0.00
4.00
