# vtk DataFile Version 1.0
B38F1705.vtk
ASCII

DATASET UNSTRUCTURED_GRID
POINTS 24 float
133151.50 444337.50 1.08 133151.50 444342.50 1.08 133156.50 444342.50 1.08 133156.50 444337.50 1.08 133151.50 444337.50 -1.22 133151.50 444342.50 -1.22 133156.50 444342.50 -1.22 133156.50 444337.50 -1.22
133151.50 444337.50 -1.22 133151.50 444342.50 -1.22 133156.50 444342.50 -1.22 133156.50 444337.50 -1.22 133151.50 444337.50 -1.72 133151.50 444342.50 -1.72 133156.50 444342.50 -1.72 133156.50 444337.50 -1.72
133151.50 444337.50 -1.72 133151.50 444342.50 -1.72 133156.50 444342.50 -1.72 133156.50 444337.50 -1.72 133151.50 444337.50 -2.28 133151.50 444342.50 -2.28 133156.50 444342.50 -2.28 133156.50 444337.50 -2.28

CELLS 3 27
8 4 7 6 5 0 3 2 1
8 12 15 14 13 8 11 10 9
8 20 23 22 21 16 19 18 17

CELL_TYPES 3
12
12
12

CELL_DATA 3
SCALARS Property_0 float
LOOKUP_TABLE custom_table
1.00
3.00
0.00
