# vtk DataFile Version 1.0
B38F0112.vtk
ASCII

DATASET UNSTRUCTURED_GRID
POINTS 64 float
135428.50 443113.50 1.15 135428.50 443118.50 1.15 135433.50 443118.50 1.15 135433.50 443113.50 1.15 135428.50 443113.50 -0.35 135428.50 443118.50 -0.35 135433.50 443118.50 -0.35 135433.50 443113.50 -0.35
135428.50 443113.50 -0.35 135428.50 443118.50 -0.35 135433.50 443118.50 -0.35 135433.50 443113.50 -0.35 135428.50 443113.50 -1.70 135428.50 443118.50 -1.70 135433.50 443118.50 -1.70 135433.50 443113.50 -1.70
135428.50 443113.50 -1.70 135428.50 443118.50 -1.70 135433.50 443118.50 -1.70 135433.50 443113.50 -1.70 135428.50 443113.50 -1.75 135428.50 443118.50 -1.75 135433.50 443118.50 -1.75 135433.50 443113.50 -1.75
135428.50 443113.50 -1.75 135428.50 443118.50 -1.75 135433.50 443118.50 -1.75 135433.50 443113.50 -1.75 135428.50 443113.50 -3.95 135428.50 443118.50 -3.95 135433.50 443118.50 -3.95 135433.50 443113.50 -3.95
135428.50 443113.50 -3.95 135428.50 443118.50 -3.95 135433.50 443118.50 -3.95 135433.50 443113.50 -3.95 135428.50 443113.50 -4.25 135428.50 443118.50 -4.25 135433.50 443118.50 -4.25 135433.50 443113.50 -4.25
135428.50 443113.50 -4.25 135428.50 443118.50 -4.25 135433.50 443118.50 -4.25 135433.50 443113.50 -4.25 135428.50 443113.50 -10.35 135428.50 443118.50 -10.35 135433.50 443118.50 -10.35 135433.50 443113.50 -10.35
135428.50 443113.50 -10.35 135428.50 443118.50 -10.35 135433.50 443118.50 -10.35 135433.50 443113.50 -10.35 135428.50 443113.50 -12.10 135428.50 443118.50 -12.10 135433.50 443118.50 -12.10 135433.50 443113.50 -12.10
135428.50 443113.50 -12.10 135428.50 443118.50 -12.10 135433.50 443118.50 -12.10 135433.50 443113.50 -12.10 135428.50 443113.50 -14.75 135428.50 443118.50 -14.75 135433.50 443118.50 -14.75 135433.50 443113.50 -14.75

CELLS 8 72
8 4 7 6 5 0 3 2 1
8 12 15 14 13 8 11 10 9
8 20 23 22 21 16 19 18 17
8 28 31 30 29 24 27 26 25
8 36 39 38 37 32 35 34 33
8 44 47 46 45 40 43 42 41
8 52 55 54 53 48 51 50 49
8 60 63 62 61 56 59 58 57

CELL_TYPES 8
12
12
12
12
12
12
12
12

CELL_DATA 8
SCALARS Property_0 float
LOOKUP_TABLE custom_table
1.00
4.00
3.00
1.00
6.00
7.00
4.00
5.00
