# vtk DataFile Version 1.0
B38F1443.vtk
ASCII

DATASET UNSTRUCTURED_GRID
POINTS 32 float
137426.50 446298.50 1.15 137426.50 446303.50 1.15 137431.50 446303.50 1.15 137431.50 446298.50 1.15 137426.50 446298.50 0.85 137426.50 446303.50 0.85 137431.50 446303.50 0.85 137431.50 446298.50 0.85
137426.50 446298.50 0.85 137426.50 446303.50 0.85 137431.50 446303.50 0.85 137431.50 446298.50 0.85 137426.50 446298.50 0.35 137426.50 446303.50 0.35 137431.50 446303.50 0.35 137431.50 446298.50 0.35
137426.50 446298.50 0.35 137426.50 446303.50 0.35 137431.50 446303.50 0.35 137431.50 446298.50 0.35 137426.50 446298.50 -0.65 137426.50 446303.50 -0.65 137431.50 446303.50 -0.65 137431.50 446298.50 -0.65
137426.50 446298.50 -0.65 137426.50 446303.50 -0.65 137431.50 446303.50 -0.65 137431.50 446298.50 -0.65 137426.50 446298.50 -1.01 137426.50 446303.50 -1.01 137431.50 446303.50 -1.01 137431.50 446298.50 -1.01

CELLS 4 36
8 4 7 6 5 0 3 2 1
8 12 15 14 13 8 11 10 9
8 20 23 22 21 16 19 18 17
8 28 31 30 29 24 27 26 25

CELL_TYPES 4
12
12
12
12

CELL_DATA 4
SCALARS Property_0 float
LOOKUP_TABLE custom_table
1.00
6.00
1.00
0.00
