# vtk DataFile Version 1.0
B38F0072.vtk
ASCII

DATASET UNSTRUCTURED_GRID
POINTS 32 float
133605.50 445226.50 2.20 133605.50 445231.50 2.20 133610.50 445231.50 2.20 133610.50 445226.50 2.20 133605.50 445226.50 1.30 133605.50 445231.50 1.30 133610.50 445231.50 1.30 133610.50 445226.50 1.30
133605.50 445226.50 1.30 133605.50 445231.50 1.30 133610.50 445231.50 1.30 133610.50 445226.50 1.30 133605.50 445226.50 -3.90 133605.50 445231.50 -3.90 133610.50 445231.50 -3.90 133610.50 445226.50 -3.90
133605.50 445226.50 -3.90 133605.50 445231.50 -3.90 133610.50 445231.50 -3.90 133610.50 445226.50 -3.90 133605.50 445226.50 -7.60 133605.50 445231.50 -7.60 133610.50 445231.50 -7.60 133610.50 445226.50 -7.60
133605.50 445226.50 -7.60 133605.50 445231.50 -7.60 133610.50 445231.50 -7.60 133610.50 445226.50 -7.60 133605.50 445226.50 -9.56 133605.50 445231.50 -9.56 133610.50 445231.50 -9.56 133610.50 445226.50 -9.56

CELLS 4 36
8 4 7 6 5 0 3 2 1
8 12 15 14 13 8 11 10 9
8 20 23 22 21 16 19 18 17
8 28 31 30 29 24 27 26 25

CELL_TYPES 4
12
12
12
12

CELL_DATA 4
SCALARS Property_0 float
LOOKUP_TABLE custom_table
6.00
0.00
1.00
0.00
