# vtk DataFile Version 1.0
B38F1169.vtk
ASCII

DATASET UNSTRUCTURED_GRID
POINTS 88 float
131717.50 441847.50 0.90 131717.50 441852.50 0.90 131722.50 441852.50 0.90 131722.50 441847.50 0.90 131717.50 441847.50 0.30 131717.50 441852.50 0.30 131722.50 441852.50 0.30 131722.50 441847.50 0.30
131717.50 441847.50 0.30 131717.50 441852.50 0.30 131722.50 441852.50 0.30 131722.50 441847.50 0.30 131717.50 441847.50 -0.70 131717.50 441852.50 -0.70 131722.50 441852.50 -0.70 131722.50 441847.50 -0.70
131717.50 441847.50 -0.70 131717.50 441852.50 -0.70 131722.50 441852.50 -0.70 131722.50 441847.50 -0.70 131717.50 441847.50 -1.70 131717.50 441852.50 -1.70 131722.50 441852.50 -1.70 131722.50 441847.50 -1.70
131717.50 441847.50 -1.70 131717.50 441852.50 -1.70 131722.50 441852.50 -1.70 131722.50 441847.50 -1.70 131717.50 441847.50 -1.75 131717.50 441852.50 -1.75 131722.50 441852.50 -1.75 131722.50 441847.50 -1.75
131717.50 441847.50 -1.75 131717.50 441852.50 -1.75 131722.50 441852.50 -1.75 131722.50 441847.50 -1.75 131717.50 441847.50 -1.95 131717.50 441852.50 -1.95 131722.50 441852.50 -1.95 131722.50 441847.50 -1.95
131717.50 441847.50 -1.95 131717.50 441852.50 -1.95 131722.50 441852.50 -1.95 131722.50 441847.50 -1.95 131717.50 441847.50 -2.15 131717.50 441852.50 -2.15 131722.50 441852.50 -2.15 131722.50 441847.50 -2.15
131717.50 441847.50 -2.15 131717.50 441852.50 -2.15 131722.50 441852.50 -2.15 131722.50 441847.50 -2.15 131717.50 441847.50 -2.30 131717.50 441852.50 -2.30 131722.50 441852.50 -2.30 131722.50 441847.50 -2.30
131717.50 441847.50 -2.30 131717.50 441852.50 -2.30 131722.50 441852.50 -2.30 131722.50 441847.50 -2.30 131717.50 441847.50 -3.40 131717.50 441852.50 -3.40 131722.50 441852.50 -3.40 131722.50 441847.50 -3.40
131717.50 441847.50 -3.40 131717.50 441852.50 -3.40 131722.50 441852.50 -3.40 131722.50 441847.50 -3.40 131717.50 441847.50 -3.60 131717.50 441852.50 -3.60 131722.50 441852.50 -3.60 131722.50 441847.50 -3.60
131717.50 441847.50 -3.60 131717.50 441852.50 -3.60 131722.50 441852.50 -3.60 131722.50 441847.50 -3.60 131717.50 441847.50 -4.10 131717.50 441852.50 -4.10 131722.50 441852.50 -4.10 131722.50 441847.50 -4.10
131717.50 441847.50 -4.10 131717.50 441852.50 -4.10 131722.50 441852.50 -4.10 131722.50 441847.50 -4.10 131717.50 441847.50 -5.10 131717.50 441852.50 -5.10 131722.50 441852.50 -5.10 131722.50 441847.50 -5.10

CELLS 11 99
8 4 7 6 5 0 3 2 1
8 12 15 14 13 8 11 10 9
8 20 23 22 21 16 19 18 17
8 28 31 30 29 24 27 26 25
8 36 39 38 37 32 35 34 33
8 44 47 46 45 40 43 42 41
8 52 55 54 53 48 51 50 49
8 60 63 62 61 56 59 58 57
8 68 71 70 69 64 67 66 65
8 76 79 78 77 72 75 74 73
8 84 87 86 85 80 83 82 81

CELL_TYPES 11
12
12
12
12
12
12
12
12
12
12
12

CELL_DATA 11
SCALARS Property_0 float
LOOKUP_TABLE custom_table
6.00
1.00
6.00
3.00
1.00
3.00
1.00
3.00
3.00
1.00
6.00
