# vtk DataFile Version 1.0
B38F1842.vtk
ASCII

DATASET UNSTRUCTURED_GRID
POINTS 16 float
136692.50 445218.50 2.82 136692.50 445223.50 2.82 136697.50 445223.50 2.82 136697.50 445218.50 2.82 136692.50 445218.50 1.39 136692.50 445223.50 1.39 136697.50 445223.50 1.39 136697.50 445218.50 1.39
136692.50 445218.50 1.39 136692.50 445223.50 1.39 136697.50 445223.50 1.39 136697.50 445218.50 1.39 136692.50 445218.50 1.10 136692.50 445223.50 1.10 136697.50 445223.50 1.10 136697.50 445218.50 1.10

CELLS 2 18
8 4 7 6 5 0 3 2 1
8 12 15 14 13 8 11 10 9

CELL_TYPES 2
12
12

CELL_DATA 2
SCALARS Property_0 float
LOOKUP_TABLE custom_table
1.00
0.00
