# vtk DataFile Version 1.0
B38F1808.vtk
ASCII

DATASET UNSTRUCTURED_GRID
POINTS 56 float
133005.50 443808.50 2.72 133005.50 443813.50 2.72 133010.50 443813.50 2.72 133010.50 443808.50 2.72 133005.50 443808.50 1.71 133005.50 443813.50 1.71 133010.50 443813.50 1.71 133010.50 443808.50 1.71
133005.50 443808.50 1.71 133005.50 443813.50 1.71 133010.50 443813.50 1.71 133010.50 443808.50 1.71 133005.50 443808.50 -4.76 133005.50 443813.50 -4.76 133010.50 443813.50 -4.76 133010.50 443808.50 -4.76
133005.50 443808.50 -4.76 133005.50 443813.50 -4.76 133010.50 443813.50 -4.76 133010.50 443808.50 -4.76 133005.50 443808.50 -5.43 133005.50 443813.50 -5.43 133010.50 443813.50 -5.43 133010.50 443808.50 -5.43
133005.50 443808.50 -5.43 133005.50 443813.50 -5.43 133010.50 443813.50 -5.43 133010.50 443808.50 -5.43 133005.50 443808.50 -5.89 133005.50 443813.50 -5.89 133010.50 443813.50 -5.89 133010.50 443808.50 -5.89
133005.50 443808.50 -5.89 133005.50 443813.50 -5.89 133010.50 443813.50 -5.89 133010.50 443808.50 -5.89 133005.50 443808.50 -6.80 133005.50 443813.50 -6.80 133010.50 443813.50 -6.80 133010.50 443808.50 -6.80
133005.50 443808.50 -6.80 133005.50 443813.50 -6.80 133010.50 443813.50 -6.80 133010.50 443808.50 -6.80 133005.50 443808.50 -7.47 133005.50 443813.50 -7.47 133010.50 443813.50 -7.47 133010.50 443808.50 -7.47
133005.50 443808.50 -7.47 133005.50 443813.50 -7.47 133010.50 443813.50 -7.47 133010.50 443808.50 -7.47 133005.50 443808.50 -9.51 133005.50 443813.50 -9.51 133010.50 443813.50 -9.51 133010.50 443808.50 -9.51

CELLS 7 63
8 4 7 6 5 0 3 2 1
8 12 15 14 13 8 11 10 9
8 20 23 22 21 16 19 18 17
8 28 31 30 29 24 27 26 25
8 36 39 38 37 32 35 34 33
8 44 47 46 45 40 43 42 41
8 52 55 54 53 48 51 50 49

CELL_TYPES 7
12
12
12
12
12
12
12

CELL_DATA 7
SCALARS Property_0 float
LOOKUP_TABLE custom_table
6.00
0.00
6.00
1.00
3.00
1.00
0.00
