# vtk DataFile Version 1.0
B38F0397.vtk
ASCII

DATASET UNSTRUCTURED_GRID
POINTS 64 float
132418.50 444762.50 1.00 132418.50 444767.50 1.00 132423.50 444767.50 1.00 132423.50 444762.50 1.00 132418.50 444762.50 -2.30 132418.50 444767.50 -2.30 132423.50 444767.50 -2.30 132423.50 444762.50 -2.30
132418.50 444762.50 -2.30 132418.50 444767.50 -2.30 132423.50 444767.50 -2.30 132423.50 444762.50 -2.30 132418.50 444762.50 -3.80 132418.50 444767.50 -3.80 132423.50 444767.50 -3.80 132423.50 444762.50 -3.80
132418.50 444762.50 -3.80 132418.50 444767.50 -3.80 132423.50 444767.50 -3.80 132423.50 444762.50 -3.80 132418.50 444762.50 -5.10 132418.50 444767.50 -5.10 132423.50 444767.50 -5.10 132423.50 444762.50 -5.10
132418.50 444762.50 -5.10 132418.50 444767.50 -5.10 132423.50 444767.50 -5.10 132423.50 444762.50 -5.10 132418.50 444762.50 -10.60 132418.50 444767.50 -10.60 132423.50 444767.50 -10.60 132423.50 444762.50 -10.60
132418.50 444762.50 -10.60 132418.50 444767.50 -10.60 132423.50 444767.50 -10.60 132423.50 444762.50 -10.60 132418.50 444762.50 -13.20 132418.50 444767.50 -13.20 132423.50 444767.50 -13.20 132423.50 444762.50 -13.20
132418.50 444762.50 -13.20 132418.50 444767.50 -13.20 132423.50 444767.50 -13.20 132423.50 444762.50 -13.20 132418.50 444762.50 -23.60 132418.50 444767.50 -23.60 132423.50 444767.50 -23.60 132423.50 444762.50 -23.60
132418.50 444762.50 -23.60 132418.50 444767.50 -23.60 132423.50 444767.50 -23.60 132423.50 444762.50 -23.60 132418.50 444762.50 -26.80 132418.50 444767.50 -26.80 132423.50 444767.50 -26.80 132423.50 444762.50 -26.80
132418.50 444762.50 -26.80 132418.50 444767.50 -26.80 132423.50 444767.50 -26.80 132423.50 444762.50 -26.80 132418.50 444762.50 -32.36 132418.50 444767.50 -32.36 132423.50 444767.50 -32.36 132423.50 444762.50 -32.36

CELLS 8 72
8 4 7 6 5 0 3 2 1
8 12 15 14 13 8 11 10 9
8 20 23 22 21 16 19 18 17
8 28 31 30 29 24 27 26 25
8 36 39 38 37 32 35 34 33
8 44 47 46 45 40 43 42 41
8 52 55 54 53 48 51 50 49
8 60 63 62 61 56 59 58 57

CELL_TYPES 8
12
12
12
12
12
12
12
12

CELL_DATA 8
SCALARS Property_0 float
LOOKUP_TABLE custom_table
1.00
3.00
1.00
4.00
5.00
5.00
5.00
4.00
