# vtk DataFile Version 1.0
B38F1931.vtk
ASCII

DATASET UNSTRUCTURED_GRID
POINTS 80 float
137601.50 444012.50 4.06 137601.50 444017.50 4.06 137606.50 444017.50 4.06 137606.50 444012.50 4.06 137601.50 444012.50 3.51 137601.50 444017.50 3.51 137606.50 444017.50 3.51 137606.50 444012.50 3.51
137601.50 444012.50 3.51 137601.50 444017.50 3.51 137606.50 444017.50 3.51 137606.50 444012.50 3.51 137601.50 444012.50 3.21 137601.50 444017.50 3.21 137606.50 444017.50 3.21 137606.50 444012.50 3.21
137601.50 444012.50 3.21 137601.50 444017.50 3.21 137606.50 444017.50 3.21 137606.50 444012.50 3.21 137601.50 444012.50 2.52 137601.50 444017.50 2.52 137606.50 444017.50 2.52 137606.50 444012.50 2.52
137601.50 444012.50 2.52 137601.50 444017.50 2.52 137606.50 444017.50 2.52 137606.50 444012.50 2.52 137601.50 444012.50 1.61 137601.50 444017.50 1.61 137606.50 444017.50 1.61 137606.50 444012.50 1.61
137601.50 444012.50 1.61 137601.50 444017.50 1.61 137606.50 444017.50 1.61 137606.50 444012.50 1.61 137601.50 444012.50 -0.03 137601.50 444017.50 -0.03 137606.50 444017.50 -0.03 137606.50 444012.50 -0.03
137601.50 444012.50 -0.03 137601.50 444017.50 -0.03 137606.50 444017.50 -0.03 137606.50 444012.50 -0.03 137601.50 444012.50 -3.86 137601.50 444017.50 -3.86 137606.50 444017.50 -3.86 137606.50 444012.50 -3.86
137601.50 444012.50 -3.86 137601.50 444017.50 -3.86 137606.50 444017.50 -3.86 137606.50 444012.50 -3.86 137601.50 444012.50 -5.75 137601.50 444017.50 -5.75 137606.50 444017.50 -5.75 137606.50 444012.50 -5.75
137601.50 444012.50 -5.75 137601.50 444017.50 -5.75 137606.50 444017.50 -5.75 137606.50 444012.50 -5.75 137601.50 444012.50 -6.64 137601.50 444017.50 -6.64 137606.50 444017.50 -6.64 137606.50 444012.50 -6.64
137601.50 444012.50 -6.64 137601.50 444017.50 -6.64 137606.50 444017.50 -6.64 137606.50 444012.50 -6.64 137601.50 444012.50 -6.94 137601.50 444017.50 -6.94 137606.50 444017.50 -6.94 137606.50 444012.50 -6.94
137601.50 444012.50 -6.94 137601.50 444017.50 -6.94 137606.50 444017.50 -6.94 137606.50 444012.50 -6.94 137601.50 444012.50 -9.14 137601.50 444017.50 -9.14 137606.50 444017.50 -9.14 137606.50 444012.50 -9.14

CELLS 10 90
8 4 7 6 5 0 3 2 1
8 12 15 14 13 8 11 10 9
8 20 23 22 21 16 19 18 17
8 28 31 30 29 24 27 26 25
8 36 39 38 37 32 35 34 33
8 44 47 46 45 40 43 42 41
8 52 55 54 53 48 51 50 49
8 60 63 62 61 56 59 58 57
8 68 71 70 69 64 67 66 65
8 76 79 78 77 72 75 74 73

CELL_TYPES 10
12
12
12
12
12
12
12
12
12
12

CELL_DATA 10
SCALARS Property_0 float
LOOKUP_TABLE custom_table
1.00
6.00
0.00
3.00
1.00
0.00
3.00
0.00
1.00
0.00
