name,values,area,width,max_width,drive_frac,layer,layer_height,driveway_offset,sidewalk_offset,embank_height,manning
motorway,"motorway,motorway_link,motorway_junction,trunk,trunk_link",,10,100,1,0,5,0.4,0,1,0.013
primary,"primary,primary_link",,8,80,1,0,5,0.2,0.4,1,0.013
secondary,"secondary,secondary_link,tertiary,tertiary_link",,5,40,1,0,4,0.2,0.4,0.5,0.013
residential,"residential,living_street",,4,20,1,0,4,0,0,0.5,0.013
other,,,2,20,1,0,4,0,0,0.2,0.013
