<svg width="29" height="40" viewBox="0 0 29 40" fill="none" xmlns="http://www.w3.org/2000/svg">
<g opacity="0.3" filter="url(#filter0_f)">
<path d="M22.5354 15.5621C21.3325 14.3522 19.6991 13.6745 17.9943 13.6781C16.2896 13.6817 14.6533 14.3664 13.4454 15.5814C12.8287 16.2225 12.3359 16.9732 11.9923 17.795C10.551 21.4337 11.0317 23.2046 8.75194 27.7913C8.27856 28.7437 9.43085 29.9028 10.3777 29.4266C14.9375 27.1335 16.6981 27.6169 20.3155 26.1672C21.1325 25.8216 21.8788 25.3259 22.5161 24.7056C23.1168 24.1054 23.594 23.3921 23.9202 22.6068C24.2465 21.8215 24.4154 20.9797 24.4172 20.1298C24.419 19.28 24.2536 18.4389 23.9307 17.655C23.6077 16.871 23.1335 16.1598 22.5354 15.5621Z" fill="black" fill-opacity="0.71"/>
</g>
<path d="M9.32072 4.02358C7.11393 4.02358 4.99752 4.92731 3.43708 6.53598C1.87665 8.14464 1 10.3265 1 12.6014C1.01898 13.7823 1.25155 14.9491 1.68577 16.042C3.80368 21.0961 5.98887 22.1446 8.21249 29.6904C8.51434 30.7147 10.1271 30.7147 10.4289 29.6904C12.6526 22.1446 14.8378 21.0961 16.9557 16.042C17.3899 14.9491 17.6225 13.7823 17.6414 12.6014C17.6451 11.4739 17.4323 10.3568 17.0154 9.31442C16.5986 8.27202 15.9858 7.32492 15.2124 6.52765C14.4391 5.73037 13.5204 5.09867 12.5092 4.66892C11.4981 4.23916 10.4144 4.01984 9.32072 4.02358Z" fill="#775F00" stroke="#FFCC00"/>
<path d="M9.04212 7.26005C9.14541 7.05091 9.31504 7.05091 9.41833 7.26005L10.7231 9.80118C10.7869 9.90989 10.8743 10.0041 10.9794 10.0774C11.0845 10.1506 11.2047 10.2012 11.332 10.2257L14.2471 10.6346C14.4787 10.667 14.5309 10.8218 14.3634 10.9787L12.253 12.952C12.1654 13.0438 12.0993 13.1527 12.0592 13.2712C12.019 13.3897 12.0058 13.5151 12.0203 13.639L12.5183 16.4321C12.5574 16.6538 12.4204 16.7459 12.2138 16.6413L9.60426 15.3226C9.48611 15.271 9.35784 15.2442 9.22805 15.2442C9.09827 15.2442 8.96999 15.271 8.85184 15.3226L6.24228 16.6403C6.03461 16.7448 5.89869 16.6497 5.93783 16.4311L6.44017 13.639C6.45469 13.5151 6.44143 13.3897 6.40129 13.2712C6.36115 13.1527 6.29507 13.0438 6.20749 12.952L4.0981 10.9724C3.93065 10.8155 3.98284 10.6587 4.21444 10.6284L7.12953 10.2195C7.2568 10.195 7.37708 10.1444 7.48216 10.0711C7.58724 9.99783 7.67465 9.90362 7.73843 9.7949L9.04212 7.26005Z" fill="#FFCC00"/>
<defs>
<filter id="filter0_f" x="4.64209" y="9.67807" width="23.7751" height="23.8591" filterUnits="userSpaceOnUse" color-interpolation-filters="sRGB">
<feFlood flood-opacity="0" result="BackgroundImageFix"/>
<feBlend mode="normal" in="SourceGraphic" in2="BackgroundImageFix" result="shape"/>
<feGaussianBlur stdDeviation="2" result="effect1_foregroundBlur"/>
</filter>
</defs>
</svg>
