<svg width="35" height="41" viewBox="0 0 35 41" fill="none" xmlns="http://www.w3.org/2000/svg">
<g opacity="0.3" filter="url(#filter0_f_306_1027)">
<path d="M28.4914 17.607C27.0365 16.1714 25.0608 15.3673 22.999 15.3716C20.9371 15.3759 18.958 16.1883 17.497 17.63C16.7511 18.3906 16.1551 19.2813 15.7395 20.2564C13.9172 24.7696 14.6352 26.8611 11.4236 32.8793C10.9256 33.8124 12.0684 34.9401 13.0141 34.4487C19.113 31.2796 21.2326 31.9881 25.8064 30.1899C26.7946 29.7798 27.6972 29.1917 28.4681 28.4557C29.1946 27.7436 29.7718 26.8973 30.1664 25.9655C30.561 25.0337 30.7652 24.0349 30.7674 23.0266C30.7696 22.0183 30.5696 21.0203 30.179 20.0902C29.7883 19.1601 29.2148 18.3161 28.4914 17.607Z" fill="black" fill-opacity="0.71"/>
</g>
<path d="M0.500866 12.3112C0.544126 16.2592 2.43784 19.0633 4.65332 21.9657C4.89379 22.2807 5.13826 22.5972 5.38514 22.9167C7.42344 25.5553 9.62651 28.4071 11.1074 32.4314C11.3265 33.0268 11.9083 33.2707 12.3965 33.2704C12.8846 33.2701 13.4661 33.0255 13.6845 32.43C15.1694 28.3815 17.3975 25.4909 19.451 22.8267C19.6925 22.5134 19.9316 22.2032 20.1668 21.8947C22.3893 18.9787 24.2865 16.1776 24.2865 12.3056C24.2865 6.41019 19.6726 0.5 12.3976 0.5C8.49024 0.5 5.48721 1.96808 3.47356 4.19788C1.46719 6.41962 0.466313 9.37118 0.500866 12.3112Z" fill="white" stroke="#2A5587"/>
<path d="M17.6561 7.21553L12.7516 9.82503C13.6832 9.93596 14.5635 10.3118 15.288 10.9079L18.5945 8.84073C18.8189 8.71153 19.232 9.01073 19.64 8.77783L18.2341 6.34003C17.8295 6.57633 17.8805 7.08633 17.6561 7.21553Z" fill="#2A5587"/>
<path d="M5.1526 18.0258C5.09064 18.0251 5.02916 18.0368 4.97174 18.0601C4.91432 18.0834 4.8621 18.1179 4.81812 18.1615C4.77415 18.2052 4.73929 18.2572 4.71558 18.3144C4.69187 18.3717 4.67977 18.4331 4.68 18.495V18.9642C4.68022 19.0259 4.69265 19.0869 4.71656 19.1438C4.74047 19.2006 4.7754 19.2522 4.81933 19.2955C4.86326 19.3388 4.91533 19.373 4.97253 19.3961C5.02972 19.4192 5.09093 19.4307 5.1526 19.43H7.0226L8.0086 17.458C7.6898 16.975 7.45954 16.4391 7.3286 15.8753C7.284 15.674 7.25108 15.4702 7.23 15.265C7.21298 15.0956 7.20447 14.9253 7.2045 14.755C7.20347 13.9686 7.39058 13.1934 7.7502 12.494L5.6643 13.6058C5.4484 13.735 5.36 14.0155 5.3447 14.3317L5.0863 14.4813C4.9793 14.5438 4.90137 14.6461 4.86952 14.7659C4.83767 14.8856 4.85449 15.0131 4.9163 15.1205C4.81432 15.1854 4.74128 15.287 4.71241 15.4044C4.68354 15.5217 4.70106 15.6457 4.76133 15.7505C4.82159 15.8552 4.91995 15.9327 5.03591 15.9667C5.15187 16.0007 5.27649 15.9887 5.3838 15.9331C5.44631 16.0406 5.54892 16.1188 5.66908 16.1507C5.78925 16.1826 5.91715 16.1655 6.0247 16.1031L6.2831 15.9552C6.44478 16.0485 6.62696 16.1004 6.8135 16.1065L5.853 18.0258H5.1526Z" fill="#2A5587"/>
<path d="M15.0296 11.0677C14.24 10.45 13.2711 10.1057 12.2688 10.0868C12.2348 10.0868 12.1974 10.0868 12.1617 10.0868C11.3767 10.086 10.6043 10.2835 9.916 10.661C9.22772 11.0384 8.6459 11.5835 8.2245 12.2458C7.74298 12.9939 7.48794 13.8653 7.4901 14.755C7.4903 15.6011 7.72003 16.4313 8.1548 17.1571C8.50761 17.7457 8.98577 18.2494 9.55528 18.6323C10.1248 19.0152 10.7717 19.2679 11.4499 19.3725C12.1282 19.4771 12.8211 19.4309 13.4795 19.2373C14.1379 19.0438 14.7456 18.7075 15.2593 18.2525C15.773 17.7974 16.1802 17.2348 16.4518 16.6046C16.7235 15.9744 16.8529 15.2921 16.831 14.6062C16.8091 13.9203 16.6363 13.2476 16.3249 12.636C16.0136 12.0244 15.5713 11.489 15.0296 11.0677ZM15.1112 12.4685C15.5237 12.9957 15.7851 13.625 15.8677 14.2892H13.2905L15.1112 12.4685ZM12.6309 12.5671V11.0473C13.1763 11.1182 13.699 11.3098 14.1609 11.6083C14.2591 11.6688 14.3539 11.7346 14.4448 11.8055L12.6309 13.6262V12.5671ZM11.6942 11.0473V13.6279L11.4018 13.3355L9.8718 11.8055C10.3999 11.3933 11.0296 11.1314 11.6942 11.0473ZM8.5458 13.82C8.67322 13.3261 8.89997 12.8633 9.2122 12.46L10.5722 13.82L10.5926 13.8438L11.0397 14.2892H8.4574C8.47621 14.131 8.50575 13.9742 8.5458 13.82ZM8.6801 16.1048C8.56858 15.8208 8.49374 15.5237 8.4574 15.2208H11.0346L9.2122 17.0449C8.99089 16.7585 8.81171 16.4419 8.6801 16.1048ZM11.6942 18.4627C11.0306 18.3788 10.402 18.1168 9.8752 17.7045L11.6942 15.8838V18.4627ZM11.2267 14.755C11.2267 14.57 11.2816 14.3892 11.3844 14.2354C11.4872 14.0816 11.6333 13.9617 11.8043 13.891C11.9752 13.8203 12.1633 13.8019 12.3447 13.8381C12.5262 13.8743 12.6928 13.9635 12.8234 14.0945C12.9541 14.2254 13.0431 14.3921 13.0789 14.5736C13.1148 14.7551 13.0961 14.9432 13.025 15.114C12.954 15.2848 12.8339 15.4307 12.6799 15.5332C12.5259 15.6358 12.345 15.6903 12.16 15.69C11.9125 15.6891 11.6753 15.5902 11.5005 15.415C11.3256 15.2398 11.2271 15.0025 11.2267 14.755ZM12.6309 18.461V15.8838L14.4499 17.7045C13.9223 18.1153 13.2941 18.3771 12.6309 18.4627V18.461ZM15.1112 17.0432L13.2905 15.2208H15.8677C15.7846 15.8859 15.5232 16.5162 15.1112 17.0449V17.0432Z" fill="#2A5587"/>
<defs>
<filter id="filter0_f_306_1027" x="7.30282" y="11.3716" width="27.4646" height="27.1962" filterUnits="userSpaceOnUse" color-interpolation-filters="sRGB">
<feFlood flood-opacity="0" result="BackgroundImageFix"/>
<feBlend mode="normal" in="SourceGraphic" in2="BackgroundImageFix" result="shape"/>
<feGaussianBlur stdDeviation="2" result="effect1_foregroundBlur_306_1027"/>
</filter>
</defs>
</svg>
