<svg width="27" height="27" viewBox="0 0 27 27" fill="none" xmlns="http://www.w3.org/2000/svg">
<circle cx="13.5" cy="13.2485" r="12" fill="#E3D3F6" stroke="#371461" stroke-width="2"/>
<g clip-path="url(#clip0_1352_2004)">
<path fill-rule="evenodd" clip-rule="evenodd" d="M14.4001 6.00335C14.6833 6.09711 14.875 6.36584 14.875 6.66904V10.869H18.3125C18.5711 10.869 18.8078 11.0167 18.9251 11.2514C19.0425 11.486 19.0206 11.7678 18.8685 11.9807L13.3685 19.6807C13.1934 19.9259 12.8831 20.0284 12.5999 19.9346C12.3167 19.8409 12.125 19.5721 12.125 19.269V15.069H8.6875C8.42892 15.069 8.1922 14.9212 8.07486 14.6866C7.95752 14.452 7.9794 14.1702 8.1315 13.9573L13.6315 6.25732C13.8066 6.01212 14.1169 5.90959 14.4001 6.00335ZM10.0376 13.669H12.8125C13.1922 13.669 13.5 13.9824 13.5 14.369V17.1163L16.9624 12.269H14.1875C13.8078 12.269 13.5 11.9556 13.5 11.569V8.82165L10.0376 13.669Z" fill="#371461"/>
</g>
<defs>
<clipPath id="clip0_1352_2004">
<rect width="18" height="20" fill="white" transform="translate(7 5.96899)"/>
</clipPath>
</defs>
</svg>
