<svg width="34" height="39" viewBox="0 0 34 39" fill="none" xmlns="http://www.w3.org/2000/svg">
<g opacity="0.3" filter="url(#filter0_f_201:3110)">
<path d="M27.4914 16.607C26.0365 15.1714 24.0608 14.3673 21.999 14.3716C19.9371 14.3759 17.958 15.1883 16.497 16.63C15.7511 17.3906 15.1551 18.2813 14.7395 19.2564C12.9172 23.7696 13.6352 25.8611 10.4236 31.8793C9.92563 32.8124 11.0684 33.9401 12.0141 33.4487C18.1131 30.2796 20.2326 30.9881 24.8064 29.1899C25.7946 28.7798 26.6972 28.1917 27.4681 27.4557C28.1946 26.7436 28.7718 25.8973 29.1664 24.9655C29.561 24.0337 29.7653 23.0349 29.7674 22.0266C29.7696 21.0183 29.5696 20.0203 29.179 19.0902C28.7883 18.1601 28.2148 17.3161 27.4914 16.607Z" fill="black" fill-opacity="0.71"/>
</g>
<path d="M0.500866 12.3112C0.544126 16.2592 2.43784 19.0633 4.65332 21.9657C4.89379 22.2807 5.13826 22.5972 5.38514 22.9167C7.42344 25.5553 9.62651 28.4071 11.1074 32.4314C11.3265 33.0268 11.9083 33.2707 12.3965 33.2704C12.8846 33.2701 13.4661 33.0255 13.6845 32.43C15.1694 28.3815 17.3975 25.4909 19.451 22.8267C19.6925 22.5134 19.9316 22.2032 20.1668 21.8947C22.3893 18.9787 24.2865 16.1776 24.2865 12.3056C24.2865 6.41019 19.6726 0.5 12.3976 0.5C8.49024 0.5 5.48721 1.96808 3.47356 4.19788C1.46719 6.41962 0.466313 9.37118 0.500866 12.3112Z" fill="white" stroke="#2A5587"/>
<path d="M19.7759 7.29544C19.7759 7.29544 20.8858 8.14273 21.2076 8.60195C21.4638 8.96415 21.5885 9.41043 21.5229 9.86965C21.3849 10.8269 20.4786 11.519 19.4409 11.519C19.349 11.519 19.2636 11.5125 19.1716 11.506C18.9812 11.4866 18.7973 11.4413 18.62 11.3702C18.6134 10.9757 18.4886 10.5811 18.239 10.2448L16.6365 8.02631C16.3213 7.58649 15.7893 7.33425 15.2245 7.33425C15.1062 7.33425 14.988 7.34718 14.8698 7.36659C14.4429 7.45067 13.9963 7.37952 13.6285 7.17255L13.4249 7.05613C12.9652 6.80388 12.4004 6.75861 11.9078 6.93971L7.87524 8.42085C6.42378 8.95121 5.53058 10.2383 5.57655 11.603C5.49774 12.0234 5.26787 12.7931 4.552 13.1618C4.43378 13.22 4.3878 13.3623 4.45348 13.4722C4.49945 13.5434 4.58483 13.5887 4.67021 13.5887C4.70962 13.5887 4.75559 13.5822 4.795 13.5563C5.26787 13.317 5.56999 12.9548 5.76045 12.5862L6.01659 13.4722C6.22019 14.1772 6.32527 14.9016 6.32527 15.6325C6.32527 15.93 6.30556 16.2276 6.27273 16.5251C6.26616 16.5574 6.299 16.5898 6.3384 16.5898H7.69791C7.73075 16.5898 7.76359 16.5639 7.76359 16.5315L7.72418 15.6713C7.72418 15.6519 7.72418 15.626 7.72418 15.6066C7.72418 15.2509 7.86867 14.9016 8.13795 14.6365C8.19049 14.5847 8.23646 14.533 8.27587 14.4812C8.28243 14.4683 8.29557 14.4618 8.30214 14.4489C8.31527 14.436 8.32184 14.423 8.33498 14.4101C8.36781 14.3648 8.39408 14.326 8.42036 14.2807C8.42692 14.2678 8.43349 14.2613 8.44006 14.2484C8.45319 14.229 8.46633 14.2096 8.4729 14.1902C8.47946 14.1772 8.4926 14.1578 8.49917 14.1384C8.50574 14.132 8.50574 14.1255 8.5123 14.119C8.52544 14.0932 8.53857 14.0608 8.55171 14.035L8.55828 14.0285C8.56484 14.0091 8.59111 13.9961 8.61082 13.9897L9.22818 13.9638L11.6188 13.8538L12.2099 13.828C12.2099 13.828 12.2099 13.828 12.2165 13.828C12.2493 13.8215 12.2821 13.8474 12.2887 13.8797C12.2887 13.8862 12.2887 13.8927 12.2953 13.8991C12.3019 13.9315 12.3084 13.9638 12.315 13.9961C12.315 14.0026 12.3216 14.0091 12.3216 14.022C12.3216 14.035 12.3281 14.0479 12.3281 14.0608C12.3347 14.0802 12.3347 14.0932 12.3413 14.1126C12.3478 14.132 12.3544 14.1449 12.3544 14.1643C12.361 14.1837 12.3675 14.1966 12.3741 14.216C12.3807 14.2355 12.3872 14.2484 12.3938 14.2678C12.4069 14.3001 12.4201 14.3389 12.4398 14.3713C12.4463 14.3842 12.4529 14.4036 12.4595 14.4166L13.4906 16.5509C13.5037 16.5704 13.5234 16.5833 13.5497 16.5833H15.0274C15.0668 16.5833 15.0997 16.5509 15.0865 16.5186L14.6005 14.1255C14.5217 13.7245 14.548 13.317 14.6859 12.9289L15.2704 11.299C15.2836 11.2667 15.323 11.2473 15.3558 11.2667C15.5857 11.3573 15.8484 11.409 16.1111 11.4025L17.1357 11.3831C17.1685 11.3831 17.1948 11.4025 17.2013 11.4349L17.2473 11.9523C17.3655 13.1683 17.9106 14.3195 18.8104 15.238L18.9089 15.335C18.968 15.3932 19.0731 15.3932 19.1322 15.335L19.4803 14.9793C19.5 14.9599 19.5 14.9275 19.4803 14.9081L19.1979 14.5847C18.7053 14.0285 18.4492 13.3429 18.4492 12.6444C18.4492 12.3921 18.482 12.1399 18.5477 11.8941C18.5543 11.8747 18.5608 11.8488 18.5608 11.8294C18.7316 11.8876 18.9155 11.9264 19.0994 11.9458C19.211 11.9588 19.3227 11.9652 19.4343 11.9652C20.7216 11.9652 21.8447 11.0985 22.0089 9.92139C22.2059 8.64075 21.1945 7.4636 19.7759 7.29544Z" fill="#2A5587"/>
<defs>
<filter id="filter0_f_201:3110" x="6.30283" y="10.3716" width="27.4646" height="27.1962" filterUnits="userSpaceOnUse" color-interpolation-filters="sRGB">
<feFlood flood-opacity="0" result="BackgroundImageFix"/>
<feBlend mode="normal" in="SourceGraphic" in2="BackgroundImageFix" result="shape"/>
<feGaussianBlur stdDeviation="2" result="effect1_foregroundBlur_201:3110"/>
</filter>
</defs>
</svg>
