<svg width="27" height="27" viewBox="0 0 27 27" fill="none" xmlns="http://www.w3.org/2000/svg">
<circle cx="13.5" cy="13.1243" r="12" fill="#FF9999" stroke="#440000" stroke-width="2"/>
<path d="M7 18.969H20M11.3875 10.3023H15.6125M10.0875 14.6357H16.9125M8.625 18.969L12.6875 5.96899H14.3125L18.375 18.969" stroke="#440000" stroke-width="1.6" stroke-linecap="round" stroke-linejoin="round"/>
</svg>
