<svg width="36" height="44" viewBox="0 0 36 44" fill="none" xmlns="http://www.w3.org/2000/svg">
    <g opacity="0.3" filter="url(#filter0_f_1230_1698)">
        <path
            d="M29.4914 18.607C28.0365 17.1714 26.0608 16.3673 23.999 16.3716C21.9371 16.3759 19.958 17.1883 18.497 18.63C17.7511 19.3906 17.1551 20.2813 16.7395 21.2564C14.9172 25.7696 15.6352 27.8611 12.4236 33.8793C11.9256 34.8124 13.0684 35.9401 14.0141 35.4487C20.113 32.2796 22.2326 32.9881 26.8064 31.1899C27.7946 30.7798 28.6972 30.1917 29.4681 29.4557C30.1946 28.7436 30.7718 27.8973 31.1664 26.9655C31.561 26.0337 31.7652 25.0349 31.7674 24.0266C31.7696 23.0183 31.5696 22.0203 31.179 21.0902C30.7883 20.1601 30.2148 19.3161 29.4914 18.607Z"
            fill="black" fill-opacity="0.71" />
    </g>
    <path
        d="M1.0009 13.3169C1.04615 17.4416 3.03558 20.3604 5.25588 23.269C5.49773 23.5859 5.74275 23.9032 5.98948 24.2227C8.02894 26.8636 10.1853 29.6558 11.6382 33.6041C11.9508 34.4534 12.7673 34.7707 13.3968 34.7704C14.0262 34.77 14.8423 34.4517 15.1539 33.6021C16.6109 29.6298 18.7925 26.7986 20.8474 24.1317C21.0886 23.8186 21.3281 23.5079 21.5644 23.1978C23.7893 20.2786 25.7865 17.3593 25.7865 13.3056C25.7865 7.1676 20.9811 1 13.3976 1C9.35571 1 6.21547 2.52297 4.10248 4.86277C2.00404 7.18647 0.965058 10.2632 1.0009 13.3169Z"
        fill="white" stroke="#354800" stroke-width="2" />
    <path fill-rule="evenodd" clip-rule="evenodd"
        d="M6 7.77778C6 7.34822 6.3134 7 6.7 7H8.8C10.0996 7 11.3459 7.57361 12.2648 8.59464C13.043 9.45933 13.5325 10.5849 13.6641 11.7864C13.6875 11.7593 13.7112 11.7324 13.7352 11.7058C14.6541 10.6847 15.9004 10.1111 17.2 10.1111H19.3C19.6866 10.1111 20 10.4593 20 10.8889V11.6667C20 13.1106 19.4838 14.4954 18.5648 15.5165C17.6459 16.5375 16.3996 17.1111 15.1 17.1111H13.7V20.2222C13.7 20.6518 13.3866 21 13 21C12.6134 21 12.3 20.6518 12.3 20.2222V14.7778H10.9C9.60044 14.7778 8.3541 14.2042 7.43518 13.1831C6.51625 12.1621 6 10.7773 6 9.33333V7.77778ZM12.3 13.2222H10.9C9.97174 13.2222 9.0815 12.8125 8.42513 12.0832C7.76875 11.3539 7.4 10.3647 7.4 9.33333V8.55556H8.8C9.72826 8.55556 10.6185 8.96528 11.2749 9.69459C11.9313 10.4239 12.3 11.413 12.3 12.4444V13.2222ZM13.7 15.5556H15.1C16.0283 15.5556 16.9185 15.1458 17.5749 14.4165C18.2313 13.6872 18.6 12.6981 18.6 11.6667H17.2C16.2717 11.6667 15.3815 12.0764 14.7251 12.8057C14.0687 13.535 13.7 14.5242 13.7 15.5556Z"
        fill="#354800" />
    <defs>
        <filter id="filter0_f_1230_1698" x="8.30282" y="12.3716" width="27.4646" height="27.1963"
            filterUnits="userSpaceOnUse" color-interpolation-filters="sRGB">
            <feFlood flood-opacity="0" result="BackgroundImageFix" />
            <feBlend mode="normal" in="SourceGraphic" in2="BackgroundImageFix" result="shape" />
            <feGaussianBlur stdDeviation="2" result="effect1_foregroundBlur_1230_1698" />
        </filter>
    </defs>
</svg>