<svg width="35" height="41" viewBox="0 0 35 41" fill="none" xmlns="http://www.w3.org/2000/svg">
<g opacity="0.3" filter="url(#filter0_f_306_1292)">
<path d="M28.4914 17.607C27.0365 16.1714 25.0608 15.3673 22.999 15.3716C20.9371 15.3759 18.958 16.1883 17.497 17.63C16.7511 18.3906 16.1551 19.2813 15.7395 20.2564C13.9172 24.7696 14.6352 26.8611 11.4236 32.8793C10.9256 33.8124 12.0684 34.9401 13.0141 34.4487C19.1131 31.2796 21.2326 31.9881 25.8064 30.1899C26.7946 29.7798 27.6972 29.1917 28.4681 28.4557C29.1946 27.7436 29.7718 26.8973 30.1664 25.9655C30.561 25.0337 30.7653 24.0349 30.7674 23.0266C30.7696 22.0183 30.5696 21.0203 30.179 20.0902C29.7883 19.1601 29.2148 18.3161 28.4914 17.607Z" fill="black" fill-opacity="0.71"/>
</g>
<path d="M0.500866 12.3112C0.544126 16.2592 2.43784 19.0633 4.65332 21.9657C4.89379 22.2807 5.13826 22.5972 5.38514 22.9167C7.42344 25.5553 9.62651 28.4071 11.1074 32.4314C11.3265 33.0268 11.9083 33.2707 12.3965 33.2704C12.8846 33.2701 13.4661 33.0255 13.6845 32.43C15.1694 28.3815 17.3975 25.4909 19.451 22.8267C19.6925 22.5134 19.9316 22.2032 20.1668 21.8947C22.3893 18.9787 24.2865 16.1776 24.2865 12.3056C24.2865 6.41019 19.6726 0.5 12.3976 0.5C8.49024 0.5 5.48721 1.96808 3.47356 4.19788C1.46719 6.41962 0.466313 9.37118 0.500866 12.3112Z" fill="#2A5587" stroke="white"/>
<path d="M19.9944 13.3822L20 11.6236L18.7288 11.6196C18.6629 11.1419 18.5438 10.6815 18.3773 10.2444L19.5014 9.61557L18.646 8.08017L17.5288 8.70484C17.2444 8.32645 16.918 7.98169 16.5573 7.67639L17.2271 6.59959L15.7378 5.66946L15.0719 6.73979C14.5334 6.49772 13.9551 6.32955 13.3492 6.24788V5H11.594V6.25548C11.0352 6.33634 10.5005 6.49109 9.99946 6.70907L9.34045 5.6313L7.84392 6.54995L8.50277 7.62756C8.12719 7.93803 7.78921 8.29185 7.49416 8.68059L6.39129 8.06416L5.53618 9.59989L6.63776 10.2158C6.47119 10.6469 6.34981 11.1005 6.28122 11.5716L5.01356 11.5617L5 13.3199L6.27137 13.33C6.33819 13.8311 6.46344 14.3131 6.64066 14.7698L5.51875 15.3852L6.36144 16.9276L7.499 16.3039C7.79825 16.6972 8.14187 17.0544 8.52375 17.3671L7.83779 18.4735L9.32835 19.4014L10.024 18.2799C10.5263 18.496 11.0623 18.6473 11.6219 18.7261L11.6193 19.9966L13.3744 20L13.3771 18.7266C13.9291 18.6494 14.4584 18.502 14.9549 18.2911L15.6092 19.3881L17.1157 18.4861L16.4585 17.3841C16.8459 17.0694 17.195 16.7094 17.4981 16.3123L18.611 16.9421L19.4743 15.4111L18.3592 14.78C18.5328 14.335 18.6578 13.8658 18.7264 13.3781L19.9944 13.3822ZM17.0161 11.6966L14.8235 11.7019C14.73 11.4225 14.589 11.1654 14.4087 10.9404L15.6155 9.09633C16.3389 9.77129 16.8444 10.6768 17.0161 11.6966ZM11.4729 12.4891C11.4729 11.9309 11.9245 11.4784 12.4817 11.4784C13.0388 11.4784 13.4905 11.9309 13.4905 12.4891C13.4905 13.0473 13.0388 13.4997 12.4817 13.4997C11.9247 13.4997 11.4729 13.0473 11.4729 12.4891ZM12.4817 7.86025C13.1605 7.86025 13.8044 8.0087 14.3846 8.27325L13.1796 10.1148C12.9583 10.0494 12.7243 10.0129 12.4817 10.0129C12.2764 10.0129 12.0782 10.0407 11.8874 10.0879L10.7062 8.21633C11.2526 7.98719 11.8524 7.86025 12.4817 7.86025ZM9.45198 9.00271L10.6239 10.8596C10.3975 11.1186 10.2227 11.4239 10.1192 11.7614H7.93576C8.10394 10.667 8.6574 9.7003 9.45198 9.00271ZM7.94787 13.2436H10.1281C10.2335 13.5741 10.4075 13.873 10.6317 14.1268L9.49863 15.9755C8.69565 15.2892 8.13171 14.3316 7.94787 13.2436ZM12.4817 17.0775C11.8742 17.0775 11.2947 16.9585 10.7639 16.7441L11.8982 14.8928C12.0856 14.9384 12.2803 14.9651 12.4815 14.9651C12.7012 14.9651 12.9131 14.9336 13.116 14.8797L14.2344 16.7301C13.6941 16.9535 13.1024 17.0775 12.4817 17.0775ZM15.4933 15.9509L14.3674 14.0879C14.5877 13.8272 14.7546 13.5206 14.8527 13.1841L17.0273 13.1788C16.8573 14.2806 16.2969 15.2525 15.4933 15.9509Z" fill="white"/>
<defs>
<filter id="filter0_f_306_1292" x="7.30283" y="11.3716" width="27.4646" height="27.1963" filterUnits="userSpaceOnUse" color-interpolation-filters="sRGB">
<feFlood flood-opacity="0" result="BackgroundImageFix"/>
<feBlend mode="normal" in="SourceGraphic" in2="BackgroundImageFix" result="shape"/>
<feGaussianBlur stdDeviation="2" result="effect1_foregroundBlur_306_1292"/>
</filter>
</defs>
</svg>
