<svg width="27" height="27" viewBox="0 0 27 27" fill="none" xmlns="http://www.w3.org/2000/svg">
<circle cx="13.5" cy="13.1863" r="12" fill="#E5FF9D" stroke="#354800" stroke-width="2"/>
<path fill-rule="evenodd" clip-rule="evenodd" d="M6.5 7.84003C6.5 7.41048 6.8134 7.06226 7.2 7.06226H9.3C10.5996 7.06226 11.8459 7.63587 12.7648 8.6569C13.543 9.52158 14.0325 10.6472 14.1641 11.8486C14.1875 11.8215 14.2112 11.7946 14.2352 11.768C15.1541 10.747 16.4004 10.1734 17.7 10.1734H19.8C20.1866 10.1734 20.5 10.5216 20.5 10.9511V11.7289C20.5 13.1729 19.9838 14.5577 19.0648 15.5787C18.1459 16.5998 16.8996 17.1734 15.6 17.1734H14.2V20.2845C14.2 20.714 13.8866 21.0623 13.5 21.0623C13.1134 21.0623 12.8 20.714 12.8 20.2845V14.84H11.4C10.1004 14.84 8.8541 14.2664 7.93518 13.2454C7.01625 12.2244 6.5 10.8395 6.5 9.39559V7.84003ZM12.8 13.2845H11.4C10.4717 13.2845 9.5815 12.8748 8.92513 12.1454C8.26875 11.4161 7.9 10.427 7.9 9.39559V8.61781H9.3C10.2283 8.61781 11.1185 9.02753 11.7749 9.75684C12.4313 10.4861 12.8 11.4753 12.8 12.5067V13.2845ZM14.2 15.6178H15.6C16.5283 15.6178 17.4185 15.2081 18.0749 14.4788C18.7313 13.7495 19.1 12.7603 19.1 11.7289H17.7C16.7717 11.7289 15.8815 12.1386 15.2251 12.868C14.5687 13.5973 14.2 14.5864 14.2 15.6178Z" fill="#354800"/>
</svg>
