<svg width="36" height="44" viewBox="0 0 36 44" fill="none" xmlns="http://www.w3.org/2000/svg">
    <g opacity="0.3" filter="url(#filter0_f_1230_1718)">
        <path
            d="M29.4914 18.607C28.0365 17.1714 26.0608 16.3673 23.999 16.3716C21.9371 16.3759 19.958 17.1883 18.497 18.63C17.7511 19.3906 17.1551 20.2813 16.7395 21.2564C14.9172 25.7696 15.6352 27.8611 12.4236 33.8793C11.9256 34.8124 13.0684 35.9401 14.0141 35.4487C20.113 32.2796 22.2326 32.9881 26.8064 31.1899C27.7946 30.7798 28.6972 30.1917 29.4681 29.4557C30.1946 28.7436 30.7718 27.8973 31.1664 26.9655C31.561 26.0337 31.7652 25.0349 31.7674 24.0266C31.7696 23.0183 31.5696 22.0203 31.179 21.0902C30.7883 20.1601 30.2148 19.3161 29.4914 18.607Z"
            fill="black" fill-opacity="0.71" />
    </g>
    <path
        d="M1.0009 13.3169C1.04615 17.4416 3.03558 20.3604 5.25588 23.269C5.49773 23.5859 5.74275 23.9032 5.98948 24.2227C8.02894 26.8636 10.1853 29.6558 11.6382 33.6041C11.9508 34.4534 12.7673 34.7707 13.3968 34.7704C14.0262 34.77 14.8423 34.4517 15.1539 33.6021C16.6109 29.6298 18.7925 26.7986 20.8474 24.1317C21.0886 23.8186 21.3281 23.5079 21.5644 23.1978C23.7893 20.2786 25.7865 17.3593 25.7865 13.3056C25.7865 7.1676 20.9811 1 13.3976 1C9.35571 1 6.21547 2.52297 4.10248 4.86277C2.00404 7.18647 0.965058 10.2632 1.0009 13.3169Z"
        fill="white" stroke="#440000" stroke-width="2" />
    <path fill-rule="evenodd" clip-rule="evenodd"
        d="M19.4694 7.05651C19.7913 7.16675 20 7.4199 20 7.70002V20.3C20 20.6866 19.6082 21 19.125 21H18.25C17.7668 21 17.375 20.6866 17.375 20.3V18.2C17.375 17.8134 17.7668 17.5 18.25 17.5V16.8H14.75C14.2689 16.8 13.878 16.4893 13.875 16.1044C13.8649 14.8064 13.9014 13.4118 14.5191 11.9196C15.1409 10.4173 16.3284 8.8668 18.521 7.19351C18.7744 7.00016 19.1475 6.94626 19.4694 7.05651ZM18.25 15.4V9.46838C17.1777 10.507 16.5519 11.4622 16.1803 12.3597C15.7545 13.3886 15.6471 14.376 15.6275 15.4H18.25ZM6.875 7.70002C7.35825 7.70002 7.75 8.01342 7.75 8.40002V10.5C7.75 10.8713 7.93437 11.2274 8.26256 11.49C8.37165 11.5772 8.49367 11.6518 8.625 11.7125V8.40002C8.625 8.01342 9.01675 7.70002 9.5 7.70002C9.98325 7.70002 10.375 8.01342 10.375 8.40002V11.7125C10.5063 11.6518 10.6283 11.5772 10.7374 11.49C11.0656 11.2274 11.25 10.8713 11.25 10.5V8.40002C11.25 8.01342 11.6418 7.70002 12.125 7.70002C12.6082 7.70002 13 8.01342 13 8.40002V10.5C13 11.2426 12.6313 11.9548 11.9749 12.4799C11.529 12.8366 10.9753 13.0871 10.375 13.2111V20.3C10.375 20.6866 9.98325 21 9.5 21C9.01675 21 8.625 20.6866 8.625 20.3V13.2111C8.02473 13.0871 7.47098 12.8366 7.02513 12.4799C6.36875 11.9548 6 11.2426 6 10.5V8.40002C6 8.01342 6.39175 7.70002 6.875 7.70002Z"
        fill="#440000" />
    <defs>
        <filter id="filter0_f_1230_1718" x="8.30282" y="12.3716" width="27.4646" height="27.1963"
            filterUnits="userSpaceOnUse" color-interpolation-filters="sRGB">
            <feFlood flood-opacity="0" result="BackgroundImageFix" />
            <feBlend mode="normal" in="SourceGraphic" in2="BackgroundImageFix" result="shape" />
            <feGaussianBlur stdDeviation="2" result="effect1_foregroundBlur_1230_1718" />
        </filter>
    </defs>
</svg>