<svg width="36" height="44" viewBox="0 0 36 44" fill="none" xmlns="http://www.w3.org/2000/svg">
    <g opacity="0.3" filter="url(#filter0_f_1230_1710)">
        <path
            d="M29.4914 18.607C28.0365 17.1714 26.0608 16.3673 23.999 16.3716C21.9371 16.3759 19.958 17.1883 18.497 18.63C17.7511 19.3906 17.1551 20.2813 16.7395 21.2564C14.9172 25.7696 15.6352 27.8611 12.4236 33.8793C11.9256 34.8124 13.0684 35.9401 14.0141 35.4487C20.113 32.2796 22.2326 32.9881 26.8064 31.1899C27.7946 30.7798 28.6972 30.1917 29.4681 29.4557C30.1946 28.7436 30.7718 27.8973 31.1664 26.9655C31.561 26.0337 31.7652 25.0349 31.7674 24.0266C31.7696 23.0183 31.5696 22.0203 31.179 21.0902C30.7883 20.1601 30.2148 19.3161 29.4914 18.607Z"
            fill="black" fill-opacity="0.71" />
    </g>
    <path
        d="M1.0009 13.3169C1.04615 17.4416 3.03558 20.3604 5.25588 23.269C5.49773 23.5859 5.74275 23.9032 5.98948 24.2227C8.02894 26.8636 10.1853 29.6558 11.6382 33.6041C11.9508 34.4534 12.7673 34.7707 13.3968 34.7704C14.0262 34.77 14.8423 34.4517 15.1539 33.6021C16.6109 29.6298 18.7925 26.7986 20.8474 24.1317C21.0886 23.8186 21.3281 23.5079 21.5644 23.1978C23.7893 20.2786 25.7865 17.3593 25.7865 13.3056C25.7865 7.1676 20.9811 1 13.3976 1C9.35571 1 6.21547 2.52297 4.10248 4.86277C2.00404 7.18647 0.965058 10.2632 1.0009 13.3169Z"
        fill="white" stroke="#482918" stroke-width="2" />
    <path fill-rule="evenodd" clip-rule="evenodd"
        d="M11.2286 9.10875C10.7665 8.59535 10.2869 8.39277 9.86219 8.40017L9.85 8.40028C9.57152 8.40028 9.30445 8.5109 9.10754 8.70781C8.91062 8.90471 8.8 9.17178 8.8 9.45025C8.8 9.72872 8.91062 9.99579 9.10754 10.1927C9.30445 10.3896 9.57152 10.5002 9.85 10.5002C9.85238 10.5002 9.85477 10.5002 9.85715 10.5003H12.0493C11.8276 9.93225 11.545 9.46032 11.2286 9.10875ZM12.3 11.9002V13.3002H7.4V11.9002H12.3ZM8.8 14.7002H12.3V19.6H9.5C9.31435 19.6 9.1363 19.5263 9.00503 19.395C8.87375 19.2637 8.8 19.0857 8.8 18.9001V14.7002ZM9.5 21C8.94304 21 8.4089 20.7788 8.01508 20.3849C7.62125 19.9911 7.4 19.457 7.4 18.9001V14.7002C7.0287 14.7002 6.6726 14.5527 6.41005 14.2901C6.1475 14.0276 6 13.6715 6 13.3002V11.9002C6 11.5289 6.1475 11.1728 6.41005 10.9103C6.6726 10.6478 7.0287 10.5003 7.4 10.5003H7.63642C7.48221 10.1752 7.4 9.81694 7.4 9.45025C7.4 8.80049 7.65812 8.17733 8.11759 7.71788C8.5756 7.25988 9.19628 7.00195 9.84384 7.00032C10.7674 6.98625 11.6089 7.43859 12.2692 8.17222C12.5448 8.47839 12.7891 8.83274 13 9.22386C13.2109 8.83274 13.4552 8.47839 13.7308 8.17222C14.3911 7.43859 15.2326 6.98625 16.1562 7.00032C16.8037 7.00194 17.4244 7.25988 17.8824 7.71788C18.3419 8.17733 18.6 8.80049 18.6 9.45025C18.6 9.81694 18.5178 10.1752 18.3636 10.5003H18.6C18.9713 10.5003 19.3274 10.6478 19.59 10.9103C19.8525 11.1728 20 11.5289 20 11.9002V13.3002C20 13.6715 19.8525 14.0276 19.59 14.2901C19.3274 14.5527 18.9713 14.7002 18.6 14.7002V18.9001C18.6 19.457 18.3788 19.9911 17.9849 20.3849C17.5911 20.7788 17.057 21 16.5 21H9.5ZM17.2 14.7002V18.9001C17.2 19.0857 17.1263 19.2637 16.995 19.395C16.8637 19.5263 16.6857 19.6 16.5 19.6H13.7V14.7002H17.2ZM18.6 13.3002V11.9002H13.7V13.3002H18.6ZM16.1429 10.5003C16.1452 10.5002 16.1476 10.5002 16.15 10.5002C16.4285 10.5002 16.6955 10.3896 16.8925 10.1927C17.0894 9.99579 17.2 9.72872 17.2 9.45025C17.2 9.17178 17.0894 8.90471 16.8925 8.70781C16.6955 8.5109 16.4285 8.40028 16.15 8.40028L16.1378 8.40017C15.7131 8.39277 15.2335 8.59535 14.7714 9.10875C14.455 9.46032 14.1724 9.93225 13.9507 10.5003H16.1429Z"
        fill="#482918" />
    <defs>
        <filter id="filter0_f_1230_1710" x="8.30282" y="12.3716" width="27.4646" height="27.1963"
            filterUnits="userSpaceOnUse" color-interpolation-filters="sRGB">
            <feFlood flood-opacity="0" result="BackgroundImageFix" />
            <feBlend mode="normal" in="SourceGraphic" in2="BackgroundImageFix" result="shape" />
            <feGaussianBlur stdDeviation="2" result="effect1_foregroundBlur_1230_1710" />
        </filter>
    </defs>
</svg>