<svg xmlns="http://www.w3.org/2000/svg" fill="currentColor" viewBox="2 5 110 38">
    <g>
        <path id="shape0" transform="translate(2,10.925)"
              d="M23.8 15.775C22.6 15.875 21.5 15.375 20.3 14.975C14 12.875 7.6 10.775 1.3 8.675C0.9 8.475 0.6 8.375 0.3 8.075C-0.1 7.775 -0.1 7.375 0.3 7.075C0.6 6.875 1 6.575 1.4 6.475C8.2 4.475 14.9 2.475 21.7 0.375C23.2 -0.125 24.8 -0.125 26.4 0.375C33.1 2.375 39.8 4.375 46.5 6.375C46.9 6.575 47.3 6.675 47.7 6.975C48.2 7.275 48.2 7.775 47.7 8.075C47.4 8.275 47.1 8.475 46.7 8.575C40 10.775 33.3 13.075 26.5 15.275C25.6 15.675 24.8 15.775 23.8 15.775Z"/>
        <path id="shape1" transform="translate(11.3,26.9605256435217)"
              d="M1.2 0.0394743C0.2 -0.160525 0 0.439475 0 0.939475C0 3.53947 0 6.03947 0 8.53947C0 9.43947 0.3 9.93947 0.9 10.5395C1.1 10.7395 1.4 10.9395 1.6 11.1395C3.2 12.2395 5.1 12.9395 7 13.4395C10.8 14.4395 14.6 14.6395 18.5 14.1395C21 13.8395 23.5 13.1395 25.8 12.1395C26.8 11.6395 27.8 11.1395 28.5 10.3395C29 9.83947 29.2 9.33947 29.1 8.63947C29.2 6.23947 29.2 3.73947 29.2 1.23947C29.2 -0.160525 28.2 0.0394743 27.8 0.139475C24.3 1.33947 20.6 2.43947 17.1 3.63947C15.3 4.23947 13.6 4.23947 11.9 3.63947Z"/>
        <path id="shape2" transform="translate(43.7,24.3183504929895)"
              d="M2.2 0.38165C1.9 0.48165 1.8 0.58165 1.8 0.98165C1.8 3.28165 1.8 5.48165 1.8 7.78165C1.8 7.98165 1.7 8.28165 1.6 8.48165C1.1 9.68165 0.6 10.8816 0.2 12.0816C-0.2 13.1816 -5.53261e-15 14.3816 0.8 15.1816C1 15.4816 1.4 15.7816 1.7 15.9816C2 16.2816 2.5 16.3816 2.9 16.4816C3.6 16.5816 4.2 16.1816 4.7 15.7816C4.9 15.5816 5.2 15.3816 5.4 15.0816C6 14.2816 6.1 13.2816 5.9 12.3816C5.6 10.9816 5 9.78165 4.4 8.58165C4.2 8.38165 4.2 7.98165 4.2 7.78165C4.2 5.28165 4.2 2.88165 4.2 0.38165C4.2 -0.11835 3.8 -0.0183505 3.6 0.0816495Z"/>
    </g>
    <text id="shape3" transform="translate(60,35)" font-family="DejaVu Sans" font-size-adjust="0.473684"
          font-style="italic" font-weight="700">Eleco
    </text>
</svg>