<?xml version="1.0" standalone="no"?>
<!DOCTYPE svg PUBLIC "-//W3C//DTD SVG 20010904//EN"
 "http://www.w3.org/TR/2001/REC-SVG-20010904/DTD/svg10.dtd">
<svg version="1.0" xmlns="http://www.w3.org/2000/svg"
 width="267.000000pt" height="87.000000pt" viewBox="0 0 267.000000 87.000000"
 preserveAspectRatio="xMidYMid meet">

<g transform="translate(0.000000,87.000000) scale(0.100000,-0.100000)"
fill="#000000" stroke="none">
<path d="M221 814 c-44 -38 -101 -119 -164 -235 -33 -60 -35 -69 -24 -98 9
-25 29 -41 94 -76 46 -25 88 -45 95 -45 6 0 19 -7 29 -16 9 -8 24 -17 33 -18
8 -1 24 -10 35 -20 10 -10 25 -19 33 -20 7 -1 31 -13 53 -27 22 -14 74 -43
115 -63 41 -21 82 -42 90 -47 8 -5 26 -14 40 -20 14 -6 43 -19 65 -29 130 -60
220 -84 288 -77 27 2 61 13 75 24 28 20 53 78 45 100 -3 7 -43 38 -90 69 -78
52 -151 127 -174 179 -5 11 -18 34 -29 50 -11 17 -23 37 -27 45 -3 8 -9 17
-12 20 -3 3 -15 21 -25 40 -11 19 -40 61 -64 94 l-45 59 -61 -7 c-164 -19
-169 -19 -206 6 -27 19 -38 36 -53 86 -17 56 -21 62 -46 62 -17 0 -43 -14 -70
-36z m98 -31 c15 -57 67 -112 108 -114 48 -2 126 2 170 11 38 6 45 4 67 -19
34 -35 33 -47 -5 -60 -60 -21 -196 -8 -260 25 -15 7 -41 38 -58 68 -16 30 -46
67 -66 82 -28 21 -33 29 -24 40 6 8 22 14 34 14 19 0 25 -8 34 -47z m-41 -34
c58 -58 84 -117 90 -205 3 -42 1 -74 -5 -74 -5 0 -51 23 -103 51 -52 28 -112
53 -133 56 -21 3 -39 9 -42 13 -4 6 86 150 117 188 17 20 32 14 76 -29z m417
-169 c-6 -18 -3 -20 19 -14 20 5 26 2 26 -10 0 -9 -4 -16 -10 -16 -5 0 -10 -5
-10 -11 0 -6 8 -8 19 -4 11 3 23 0 27 -7 4 -6 2 -14 -4 -16 -21 -7 -13 -29 9
-28 12 1 24 -5 26 -11 3 -7 -2 -13 -11 -13 -9 0 -16 -5 -16 -11 0 -6 9 -9 20
-6 26 7 34 -7 18 -33 -10 -16 -19 -19 -43 -14 -56 13 -89 12 -138 -3 l-49 -14
-52 34 c-62 41 -136 115 -136 136 0 12 2 12 18 -1 127 -107 180 -137 216 -120
22 10 26 18 26 52 0 42 -14 80 -29 80 -4 0 -13 -11 -19 -25 -6 -14 -20 -25
-29 -25 -20 0 -147 79 -140 87 3 2 33 -1 68 -7 61 -11 150 -6 179 11 21 12 22
11 15 -11z m-386 -103 c136 -72 165 -92 240 -166 75 -73 104 -93 218 -152 73
-37 158 -76 190 -85 79 -24 87 -34 27 -34 -57 0 -187 33 -192 49 -2 6 -14 11
-26 11 -13 0 -35 9 -49 20 -14 11 -35 20 -46 20 -12 0 -30 9 -41 20 -11 11
-25 20 -32 20 -15 0 -202 101 -206 112 -2 4 -12 8 -23 8 -10 0 -28 9 -39 20
-11 11 -26 20 -34 20 -7 0 -25 9 -39 20 -14 11 -29 20 -34 20 -4 0 -43 18 -86
41 -91 48 -107 70 -82 119 16 31 19 32 58 26 23 -4 111 -44 196 -89z m159 -54
c13 -11 51 -35 86 -52 55 -29 68 -31 114 -25 60 8 82 -4 82 -46 0 -42 32 -63
109 -71 54 -6 87 -18 157 -55 49 -26 91 -49 92 -50 10 -7 -35 -64 -50 -64 -29
0 -167 54 -283 111 -93 46 -124 68 -205 145 -53 51 -115 101 -138 113 -45 23
-56 36 -46 52 4 7 16 2 33 -14 14 -13 36 -33 49 -44z m389 -60 c-8 -7 -37 9
-31 19 3 5 12 4 20 -3 8 -6 13 -14 11 -16z m-177 7 c-8 -5 -24 -9 -35 -9 l-20
0 20 9 c11 5 27 9 35 9 13 1 13 0 0 -9z m157 -26 c69 -31 80 -49 25 -40 -34 5
-46 2 -62 -14 -26 -26 -30 -25 -30 5 0 14 -11 37 -25 51 -14 14 -25 27 -25 30
0 10 64 -8 117 -32z m79 -72 c53 -29 116 -73 111 -78 -2 -2 -33 9 -68 26 -43
20 -79 30 -111 30 -35 0 -48 4 -48 14 0 29 69 34 116 8z"/>
<path d="M600 635 c0 -10 8 -14 22 -12 32 5 35 27 4 27 -16 0 -26 -6 -26 -15z"/>
<path d="M196 461 c-13 -21 11 -44 100 -92 96 -51 124 -56 124 -20 0 15 -24
33 -94 70 -93 51 -120 59 -130 42z m120 -57 c46 -25 84 -49 84 -55 0 -5 -2 -9
-6 -9 -12 0 -184 96 -184 103 0 15 25 6 106 -39z"/>
<path d="M1412 518 c4 -245 5 -249 101 -268 36 -7 37 -6 37 21 0 24 -4 29 -24
29 -42 0 -51 24 -51 139 l0 106 38 3 c33 3 37 6 37 30 0 25 -3 27 -37 27 l-38
0 -3 58 c-3 56 -3 57 -33 57 l-30 0 3 -202z"/>
<path d="M2020 485 l0 -235 30 0 c28 0 30 2 30 38 0 28 7 45 26 63 l25 24 37
-45 c20 -24 44 -52 52 -63 11 -13 26 -18 53 -15 l38 3 -66 79 c-36 43 -68 82
-71 87 -3 5 21 44 54 86 78 104 76 99 31 95 -36 -4 -45 -11 -100 -83 -34 -43
-65 -79 -70 -79 -5 0 -9 63 -9 140 l0 140 -30 0 -30 0 0 -235z"/>
<path d="M1081 603 c-78 -39 -118 -145 -87 -228 66 -171 304 -155 344 23 34
149 -121 272 -257 205z m139 -58 c64 -33 81 -132 33 -185 -76 -83 -203 -35
-203 76 0 56 12 79 53 104 38 24 78 25 117 5z"/>
<path d="M1170 503 c-41 -15 -54 -78 -22 -106 27 -25 78 -22 96 5 22 32 20 55
-9 83 -24 25 -36 28 -65 18z m68 -56 c4 -20 -25 -34 -40 -19 -15 15 -1 44 19
40 10 -2 19 -11 21 -21z"/>
<path d="M1675 596 c-61 -37 -88 -93 -83 -171 3 -48 10 -70 30 -97 51 -66 154
-91 226 -54 38 20 42 20 42 1 0 -10 10 -15 30 -15 l30 0 0 93 c-1 151 -20 201
-96 244 -54 31 -126 31 -179 -1z m164 -62 c100 -84 13 -250 -109 -210 -67 22
-99 110 -65 176 32 62 121 79 174 34z"/>
<path d="M2350 487 c0 -77 5 -129 14 -150 41 -97 178 -124 248 -50 43 47 48
66 48 196 l0 124 -30 -5 -30 -4 0 -115 c0 -63 -5 -123 -10 -134 -16 -29 -67
-51 -100 -44 -16 4 -41 20 -55 37 -24 28 -25 36 -25 146 l0 117 -30 0 -30 0 0
-118z"/>
</g>
</svg>
