// Validating benchmarks:
// ***** BenchmarkRunner: Start   *****
// ***** Found 4 benchmark(s) in total *****
// ***** Building 1 exe(s) in Parallel: Start   *****
// start dotnet restore  /p:UseSharedCompilation=false /p:BuildInParallel=false /m:1 /p:Deterministic=true /p:Optimize=true in C:\Users\mihol\source\repos\parallelprograming\Performance\bin\Release\net5.0\8536fc4a-683d-4ccf-b6fa-d2cbea36c4f6
// command took 1,61s and exited with 0
// start dotnet build -c Release  --no-restore /p:UseSharedCompilation=false /p:BuildInParallel=false /m:1 /p:Deterministic=true /p:Optimize=true in C:\Users\mihol\source\repos\parallelprograming\Performance\bin\Release\net5.0\8536fc4a-683d-4ccf-b6fa-d2cbea36c4f6
// command took 2,84s and exited with 0
// ***** Done, took 00:00:04 (4.56 sec)   *****
// Found 4 benchmarks:
//   PerformanceTests.PrimesParallelSynchronized_1: DefaultJob
//   PerformanceTests.PrimesParallelSynchronized_2: DefaultJob
//   PerformanceTests.NewThreadsSynchronized_1: DefaultJob
//   PerformanceTests.ThreadPoolThreadsSynchronized_1: DefaultJob

// **************************
// Benchmark: PerformanceTests.PrimesParallelSynchronized_1: DefaultJob
// *** Execute ***
// Launch: 1 / 1
// Execute: dotnet "8536fc4a-683d-4ccf-b6fa-d2cbea36c4f6.dll" --benchmarkName "Performance.PerformanceTests.PrimesParallelSynchronized_1" --job "Default" --benchmarkId 0 in C:\Users\mihol\source\repos\parallelprograming\Performance\bin\Release\net5.0\8536fc4a-683d-4ccf-b6fa-d2cbea36c4f6\bin\Release\net5.0
// BeforeAnythingElse

// Benchmark Process Environment Information:
// Runtime=.NET 5.0.7 (5.0.721.25508), X64 RyuJIT
// GC=Concurrent Workstation
// Job: DefaultJob

OverheadJitting  1: 1 op, 219500.00 ns, 219.5000 us/op
WorkloadJitting  1: 1 op, 267506800.00 ns, 267.5068 ms/op

WorkloadPilot    1: 2 op, 476770200.00 ns, 238.3851 ms/op
WorkloadPilot    2: 3 op, 732979400.00 ns, 244.3265 ms/op

WorkloadWarmup   1: 3 op, 723396000.00 ns, 241.1320 ms/op
WorkloadWarmup   2: 3 op, 720769200.00 ns, 240.2564 ms/op
WorkloadWarmup   3: 3 op, 732644700.00 ns, 244.2149 ms/op
WorkloadWarmup   4: 3 op, 728787200.00 ns, 242.9291 ms/op
WorkloadWarmup   5: 3 op, 721949900.00 ns, 240.6500 ms/op
WorkloadWarmup   6: 3 op, 746641600.00 ns, 248.8805 ms/op
WorkloadWarmup   7: 3 op, 749028500.00 ns, 249.6762 ms/op
WorkloadWarmup   8: 3 op, 759355400.00 ns, 253.1185 ms/op
WorkloadWarmup   9: 3 op, 777693000.00 ns, 259.2310 ms/op
WorkloadWarmup  10: 3 op, 791739800.00 ns, 263.9133 ms/op
WorkloadWarmup  11: 3 op, 729729600.00 ns, 243.2432 ms/op

// BeforeActualRun
WorkloadActual   1: 3 op, 730977500.00 ns, 243.6592 ms/op
WorkloadActual   2: 3 op, 751027200.00 ns, 250.3424 ms/op
WorkloadActual   3: 3 op, 770820900.00 ns, 256.9403 ms/op
WorkloadActual   4: 3 op, 765948400.00 ns, 255.3161 ms/op
WorkloadActual   5: 3 op, 788735800.00 ns, 262.9119 ms/op
WorkloadActual   6: 3 op, 775710600.00 ns, 258.5702 ms/op
WorkloadActual   7: 3 op, 759829500.00 ns, 253.2765 ms/op
WorkloadActual   8: 3 op, 810423400.00 ns, 270.1411 ms/op
WorkloadActual   9: 3 op, 760169100.00 ns, 253.3897 ms/op
WorkloadActual  10: 3 op, 752823300.00 ns, 250.9411 ms/op
WorkloadActual  11: 3 op, 731869600.00 ns, 243.9565 ms/op
WorkloadActual  12: 3 op, 726676700.00 ns, 242.2256 ms/op
WorkloadActual  13: 3 op, 738922700.00 ns, 246.3076 ms/op
WorkloadActual  14: 3 op, 725656000.00 ns, 241.8853 ms/op
WorkloadActual  15: 3 op, 711792700.00 ns, 237.2642 ms/op
WorkloadActual  16: 3 op, 718064900.00 ns, 239.3550 ms/op
WorkloadActual  17: 3 op, 714914300.00 ns, 238.3048 ms/op
WorkloadActual  18: 3 op, 741750800.00 ns, 247.2503 ms/op
WorkloadActual  19: 3 op, 710394000.00 ns, 236.7980 ms/op
WorkloadActual  20: 3 op, 719813500.00 ns, 239.9378 ms/op
WorkloadActual  21: 3 op, 722722000.00 ns, 240.9073 ms/op
WorkloadActual  22: 3 op, 780611200.00 ns, 260.2037 ms/op
WorkloadActual  23: 3 op, 926341500.00 ns, 308.7805 ms/op
WorkloadActual  24: 3 op, 822338400.00 ns, 274.1128 ms/op
WorkloadActual  25: 3 op, 786115600.00 ns, 262.0385 ms/op
WorkloadActual  26: 3 op, 916741400.00 ns, 305.5805 ms/op
WorkloadActual  27: 3 op, 974872500.00 ns, 324.9575 ms/op
WorkloadActual  28: 3 op, 976251500.00 ns, 325.4172 ms/op
WorkloadActual  29: 3 op, 910497700.00 ns, 303.4992 ms/op
WorkloadActual  30: 3 op, 857571200.00 ns, 285.8571 ms/op
WorkloadActual  31: 3 op, 769715200.00 ns, 256.5717 ms/op
WorkloadActual  32: 3 op, 868744400.00 ns, 289.5815 ms/op
WorkloadActual  33: 3 op, 811905900.00 ns, 270.6353 ms/op
WorkloadActual  34: 3 op, 775471600.00 ns, 258.4905 ms/op
WorkloadActual  35: 3 op, 717308700.00 ns, 239.1029 ms/op
WorkloadActual  36: 3 op, 724684600.00 ns, 241.5615 ms/op
WorkloadActual  37: 3 op, 721263000.00 ns, 240.4210 ms/op
WorkloadActual  38: 3 op, 713518900.00 ns, 237.8396 ms/op
WorkloadActual  39: 3 op, 703756900.00 ns, 234.5856 ms/op
WorkloadActual  40: 3 op, 709870200.00 ns, 236.6234 ms/op
WorkloadActual  41: 3 op, 759840100.00 ns, 253.2800 ms/op
WorkloadActual  42: 3 op, 777924400.00 ns, 259.3081 ms/op
WorkloadActual  43: 3 op, 944618800.00 ns, 314.8729 ms/op
WorkloadActual  44: 3 op, 879484500.00 ns, 293.1615 ms/op
WorkloadActual  45: 3 op, 748060700.00 ns, 249.3536 ms/op
WorkloadActual  46: 3 op, 727973700.00 ns, 242.6579 ms/op
WorkloadActual  47: 3 op, 783386000.00 ns, 261.1287 ms/op
WorkloadActual  48: 3 op, 789436700.00 ns, 263.1456 ms/op
WorkloadActual  49: 3 op, 816906400.00 ns, 272.3021 ms/op
WorkloadActual  50: 3 op, 765347800.00 ns, 255.1159 ms/op
WorkloadActual  51: 3 op, 740743600.00 ns, 246.9145 ms/op
WorkloadActual  52: 3 op, 720798000.00 ns, 240.2660 ms/op
WorkloadActual  53: 3 op, 731256200.00 ns, 243.7521 ms/op
WorkloadActual  54: 3 op, 771639300.00 ns, 257.2131 ms/op
WorkloadActual  55: 3 op, 725072400.00 ns, 241.6908 ms/op
WorkloadActual  56: 3 op, 745449100.00 ns, 248.4830 ms/op
WorkloadActual  57: 3 op, 733018400.00 ns, 244.3395 ms/op
WorkloadActual  58: 3 op, 754015600.00 ns, 251.3385 ms/op
WorkloadActual  59: 3 op, 776517700.00 ns, 258.8392 ms/op
WorkloadActual  60: 3 op, 731323500.00 ns, 243.7745 ms/op
WorkloadActual  61: 3 op, 713675300.00 ns, 237.8918 ms/op
WorkloadActual  62: 3 op, 745820000.00 ns, 248.6067 ms/op
WorkloadActual  63: 3 op, 828982400.00 ns, 276.3275 ms/op
WorkloadActual  64: 3 op, 822281000.00 ns, 274.0937 ms/op
WorkloadActual  65: 3 op, 798828900.00 ns, 266.2763 ms/op
WorkloadActual  66: 3 op, 834971800.00 ns, 278.3239 ms/op
WorkloadActual  67: 3 op, 741730800.00 ns, 247.2436 ms/op
WorkloadActual  68: 3 op, 746195300.00 ns, 248.7318 ms/op
WorkloadActual  69: 3 op, 725522800.00 ns, 241.8409 ms/op
WorkloadActual  70: 3 op, 756759000.00 ns, 252.2530 ms/op
WorkloadActual  71: 3 op, 741305800.00 ns, 247.1019 ms/op
WorkloadActual  72: 3 op, 777498200.00 ns, 259.1661 ms/op
WorkloadActual  73: 3 op, 792347200.00 ns, 264.1157 ms/op
WorkloadActual  74: 3 op, 837241900.00 ns, 279.0806 ms/op
WorkloadActual  75: 3 op, 773121400.00 ns, 257.7071 ms/op
WorkloadActual  76: 3 op, 978161100.00 ns, 326.0537 ms/op
WorkloadActual  77: 3 op, 772190500.00 ns, 257.3968 ms/op
WorkloadActual  78: 3 op, 774809600.00 ns, 258.2699 ms/op
WorkloadActual  79: 3 op, 771698700.00 ns, 257.2329 ms/op
WorkloadActual  80: 3 op, 738221500.00 ns, 246.0738 ms/op
WorkloadActual  81: 3 op, 796803400.00 ns, 265.6011 ms/op
WorkloadActual  82: 3 op, 784720500.00 ns, 261.5735 ms/op
WorkloadActual  83: 3 op, 822947800.00 ns, 274.3159 ms/op
WorkloadActual  84: 3 op, 761618900.00 ns, 253.8730 ms/op
WorkloadActual  85: 3 op, 719604900.00 ns, 239.8683 ms/op
WorkloadActual  86: 3 op, 714577900.00 ns, 238.1926 ms/op
WorkloadActual  87: 3 op, 705068300.00 ns, 235.0228 ms/op
WorkloadActual  88: 3 op, 720418300.00 ns, 240.1394 ms/op
WorkloadActual  89: 3 op, 712183800.00 ns, 237.3946 ms/op
WorkloadActual  90: 3 op, 714936200.00 ns, 238.3121 ms/op
WorkloadActual  91: 3 op, 708137600.00 ns, 236.0459 ms/op
WorkloadActual  92: 3 op, 712028000.00 ns, 237.3427 ms/op

// AfterActualRun
WorkloadResult   1: 3 op, 730977500.00 ns, 243.6592 ms/op
WorkloadResult   2: 3 op, 751027200.00 ns, 250.3424 ms/op
WorkloadResult   3: 3 op, 770820900.00 ns, 256.9403 ms/op
WorkloadResult   4: 3 op, 765948400.00 ns, 255.3161 ms/op
WorkloadResult   5: 3 op, 788735800.00 ns, 262.9119 ms/op
WorkloadResult   6: 3 op, 775710600.00 ns, 258.5702 ms/op
WorkloadResult   7: 3 op, 759829500.00 ns, 253.2765 ms/op
WorkloadResult   8: 3 op, 810423400.00 ns, 270.1411 ms/op
WorkloadResult   9: 3 op, 760169100.00 ns, 253.3897 ms/op
WorkloadResult  10: 3 op, 752823300.00 ns, 250.9411 ms/op
WorkloadResult  11: 3 op, 731869600.00 ns, 243.9565 ms/op
WorkloadResult  12: 3 op, 726676700.00 ns, 242.2256 ms/op
WorkloadResult  13: 3 op, 738922700.00 ns, 246.3076 ms/op
WorkloadResult  14: 3 op, 725656000.00 ns, 241.8853 ms/op
WorkloadResult  15: 3 op, 711792700.00 ns, 237.2642 ms/op
WorkloadResult  16: 3 op, 718064900.00 ns, 239.3550 ms/op
WorkloadResult  17: 3 op, 714914300.00 ns, 238.3048 ms/op
WorkloadResult  18: 3 op, 741750800.00 ns, 247.2503 ms/op
WorkloadResult  19: 3 op, 710394000.00 ns, 236.7980 ms/op
WorkloadResult  20: 3 op, 719813500.00 ns, 239.9378 ms/op
WorkloadResult  21: 3 op, 722722000.00 ns, 240.9073 ms/op
WorkloadResult  22: 3 op, 780611200.00 ns, 260.2037 ms/op
WorkloadResult  23: 3 op, 822338400.00 ns, 274.1128 ms/op
WorkloadResult  24: 3 op, 786115600.00 ns, 262.0385 ms/op
WorkloadResult  25: 3 op, 857571200.00 ns, 285.8571 ms/op
WorkloadResult  26: 3 op, 769715200.00 ns, 256.5717 ms/op
WorkloadResult  27: 3 op, 868744400.00 ns, 289.5815 ms/op
WorkloadResult  28: 3 op, 811905900.00 ns, 270.6353 ms/op
WorkloadResult  29: 3 op, 775471600.00 ns, 258.4905 ms/op
WorkloadResult  30: 3 op, 717308700.00 ns, 239.1029 ms/op
WorkloadResult  31: 3 op, 724684600.00 ns, 241.5615 ms/op
WorkloadResult  32: 3 op, 721263000.00 ns, 240.4210 ms/op
WorkloadResult  33: 3 op, 713518900.00 ns, 237.8396 ms/op
WorkloadResult  34: 3 op, 703756900.00 ns, 234.5856 ms/op
WorkloadResult  35: 3 op, 709870200.00 ns, 236.6234 ms/op
WorkloadResult  36: 3 op, 759840100.00 ns, 253.2800 ms/op
WorkloadResult  37: 3 op, 777924400.00 ns, 259.3081 ms/op
WorkloadResult  38: 3 op, 879484500.00 ns, 293.1615 ms/op
WorkloadResult  39: 3 op, 748060700.00 ns, 249.3536 ms/op
WorkloadResult  40: 3 op, 727973700.00 ns, 242.6579 ms/op
WorkloadResult  41: 3 op, 783386000.00 ns, 261.1287 ms/op
WorkloadResult  42: 3 op, 789436700.00 ns, 263.1456 ms/op
WorkloadResult  43: 3 op, 816906400.00 ns, 272.3021 ms/op
WorkloadResult  44: 3 op, 765347800.00 ns, 255.1159 ms/op
WorkloadResult  45: 3 op, 740743600.00 ns, 246.9145 ms/op
WorkloadResult  46: 3 op, 720798000.00 ns, 240.2660 ms/op
WorkloadResult  47: 3 op, 731256200.00 ns, 243.7521 ms/op
WorkloadResult  48: 3 op, 771639300.00 ns, 257.2131 ms/op
WorkloadResult  49: 3 op, 725072400.00 ns, 241.6908 ms/op
WorkloadResult  50: 3 op, 745449100.00 ns, 248.4830 ms/op
WorkloadResult  51: 3 op, 733018400.00 ns, 244.3395 ms/op
WorkloadResult  52: 3 op, 754015600.00 ns, 251.3385 ms/op
WorkloadResult  53: 3 op, 776517700.00 ns, 258.8392 ms/op
WorkloadResult  54: 3 op, 731323500.00 ns, 243.7745 ms/op
WorkloadResult  55: 3 op, 713675300.00 ns, 237.8918 ms/op
WorkloadResult  56: 3 op, 745820000.00 ns, 248.6067 ms/op
WorkloadResult  57: 3 op, 828982400.00 ns, 276.3275 ms/op
WorkloadResult  58: 3 op, 822281000.00 ns, 274.0937 ms/op
WorkloadResult  59: 3 op, 798828900.00 ns, 266.2763 ms/op
WorkloadResult  60: 3 op, 834971800.00 ns, 278.3239 ms/op
WorkloadResult  61: 3 op, 741730800.00 ns, 247.2436 ms/op
WorkloadResult  62: 3 op, 746195300.00 ns, 248.7318 ms/op
WorkloadResult  63: 3 op, 725522800.00 ns, 241.8409 ms/op
WorkloadResult  64: 3 op, 756759000.00 ns, 252.2530 ms/op
WorkloadResult  65: 3 op, 741305800.00 ns, 247.1019 ms/op
WorkloadResult  66: 3 op, 777498200.00 ns, 259.1661 ms/op
WorkloadResult  67: 3 op, 792347200.00 ns, 264.1157 ms/op
WorkloadResult  68: 3 op, 837241900.00 ns, 279.0806 ms/op
WorkloadResult  69: 3 op, 773121400.00 ns, 257.7071 ms/op
WorkloadResult  70: 3 op, 772190500.00 ns, 257.3968 ms/op
WorkloadResult  71: 3 op, 774809600.00 ns, 258.2699 ms/op
WorkloadResult  72: 3 op, 771698700.00 ns, 257.2329 ms/op
WorkloadResult  73: 3 op, 738221500.00 ns, 246.0738 ms/op
WorkloadResult  74: 3 op, 796803400.00 ns, 265.6011 ms/op
WorkloadResult  75: 3 op, 784720500.00 ns, 261.5735 ms/op
WorkloadResult  76: 3 op, 822947800.00 ns, 274.3159 ms/op
WorkloadResult  77: 3 op, 761618900.00 ns, 253.8730 ms/op
WorkloadResult  78: 3 op, 719604900.00 ns, 239.8683 ms/op
WorkloadResult  79: 3 op, 714577900.00 ns, 238.1926 ms/op
WorkloadResult  80: 3 op, 705068300.00 ns, 235.0228 ms/op
WorkloadResult  81: 3 op, 720418300.00 ns, 240.1394 ms/op
WorkloadResult  82: 3 op, 712183800.00 ns, 237.3946 ms/op
WorkloadResult  83: 3 op, 714936200.00 ns, 238.3121 ms/op
WorkloadResult  84: 3 op, 708137600.00 ns, 236.0459 ms/op
WorkloadResult  85: 3 op, 712028000.00 ns, 237.3427 ms/op
GC:  1 1 1 37510152 3
Threading:  17 0 3

// AfterAll
// Benchmark Process 7560 has exited with code 0

Mean = 252.692 ms, StdErr = 1.478 ms (0.58%), N = 85, StdDev = 13.629 ms
Min = 234.586 ms, Q1 = 241.562 ms, Median = 250.342 ms, Q3 = 259.308 ms, Max = 293.161 ms
IQR = 17.747 ms, LowerFence = 214.942 ms, UpperFence = 285.928 ms
ConfidenceInterval = [247.651 ms; 257.733 ms] (CI 99.9%), Margin = 5.041 ms (1.99% of Mean)
Skewness = 0.85, Kurtosis = 3.15, MValue = 2.34

// **************************
// Benchmark: PerformanceTests.PrimesParallelSynchronized_2: DefaultJob
// *** Execute ***
// Launch: 1 / 1
// Execute: dotnet "8536fc4a-683d-4ccf-b6fa-d2cbea36c4f6.dll" --benchmarkName "Performance.PerformanceTests.PrimesParallelSynchronized_2" --job "Default" --benchmarkId 1 in C:\Users\mihol\source\repos\parallelprograming\Performance\bin\Release\net5.0\8536fc4a-683d-4ccf-b6fa-d2cbea36c4f6\bin\Release\net5.0
// BeforeAnythingElse

// Benchmark Process Environment Information:
// Runtime=.NET 5.0.7 (5.0.721.25508), X64 RyuJIT
// GC=Concurrent Workstation
// Job: DefaultJob

OverheadJitting  1: 1 op, 190400.00 ns, 190.4000 us/op
WorkloadJitting  1: 1 op, 264317100.00 ns, 264.3171 ms/op

WorkloadPilot    1: 2 op, 535272300.00 ns, 267.6362 ms/op

WorkloadWarmup   1: 2 op, 548610000.00 ns, 274.3050 ms/op
WorkloadWarmup   2: 2 op, 592857300.00 ns, 296.4287 ms/op
WorkloadWarmup   3: 2 op, 547934200.00 ns, 273.9671 ms/op
WorkloadWarmup   4: 2 op, 523065900.00 ns, 261.5330 ms/op
WorkloadWarmup   5: 2 op, 534572500.00 ns, 267.2862 ms/op
WorkloadWarmup   6: 2 op, 550668500.00 ns, 275.3342 ms/op
WorkloadWarmup   7: 2 op, 550756100.00 ns, 275.3780 ms/op
WorkloadWarmup   8: 2 op, 539033400.00 ns, 269.5167 ms/op

// BeforeActualRun
WorkloadActual   1: 2 op, 569689400.00 ns, 284.8447 ms/op
WorkloadActual   2: 2 op, 583121400.00 ns, 291.5607 ms/op
WorkloadActual   3: 2 op, 601341400.00 ns, 300.6707 ms/op
WorkloadActual   4: 2 op, 596239300.00 ns, 298.1196 ms/op
WorkloadActual   5: 2 op, 576182300.00 ns, 288.0912 ms/op
WorkloadActual   6: 2 op, 581903000.00 ns, 290.9515 ms/op
WorkloadActual   7: 2 op, 598651900.00 ns, 299.3259 ms/op
WorkloadActual   8: 2 op, 558364800.00 ns, 279.1824 ms/op
WorkloadActual   9: 2 op, 573976100.00 ns, 286.9880 ms/op
WorkloadActual  10: 2 op, 567107300.00 ns, 283.5537 ms/op
WorkloadActual  11: 2 op, 575677700.00 ns, 287.8388 ms/op
WorkloadActual  12: 2 op, 587776300.00 ns, 293.8881 ms/op
WorkloadActual  13: 2 op, 583147000.00 ns, 291.5735 ms/op
WorkloadActual  14: 2 op, 566960900.00 ns, 283.4805 ms/op
WorkloadActual  15: 2 op, 605306400.00 ns, 302.6532 ms/op
WorkloadActual  16: 2 op, 718605300.00 ns, 359.3027 ms/op
WorkloadActual  17: 2 op, 747627100.00 ns, 373.8136 ms/op
WorkloadActual  18: 2 op, 702515000.00 ns, 351.2575 ms/op
WorkloadActual  19: 2 op, 739882000.00 ns, 369.9410 ms/op
WorkloadActual  20: 2 op, 673605400.00 ns, 336.8027 ms/op
WorkloadActual  21: 2 op, 735400200.00 ns, 367.7001 ms/op
WorkloadActual  22: 2 op, 689003700.00 ns, 344.5018 ms/op
WorkloadActual  23: 2 op, 737335500.00 ns, 368.6678 ms/op
WorkloadActual  24: 2 op, 735289300.00 ns, 367.6447 ms/op
WorkloadActual  25: 2 op, 632260600.00 ns, 316.1303 ms/op
WorkloadActual  26: 2 op, 663009800.00 ns, 331.5049 ms/op
WorkloadActual  27: 2 op, 738824300.00 ns, 369.4121 ms/op
WorkloadActual  28: 2 op, 653206900.00 ns, 326.6035 ms/op
WorkloadActual  29: 2 op, 609791300.00 ns, 304.8956 ms/op
WorkloadActual  30: 2 op, 585578800.00 ns, 292.7894 ms/op
WorkloadActual  31: 2 op, 606954500.00 ns, 303.4773 ms/op
WorkloadActual  32: 2 op, 718562200.00 ns, 359.2811 ms/op
WorkloadActual  33: 2 op, 619368000.00 ns, 309.6840 ms/op
WorkloadActual  34: 2 op, 694654600.00 ns, 347.3273 ms/op
WorkloadActual  35: 2 op, 738385300.00 ns, 369.1927 ms/op
WorkloadActual  36: 2 op, 695503600.00 ns, 347.7518 ms/op
WorkloadActual  37: 2 op, 691243600.00 ns, 345.6218 ms/op
WorkloadActual  38: 2 op, 749723600.00 ns, 374.8618 ms/op
WorkloadActual  39: 2 op, 709179300.00 ns, 354.5897 ms/op
WorkloadActual  40: 2 op, 695476200.00 ns, 347.7381 ms/op
WorkloadActual  41: 2 op, 609605400.00 ns, 304.8027 ms/op
WorkloadActual  42: 2 op, 718729500.00 ns, 359.3648 ms/op
WorkloadActual  43: 2 op, 609148900.00 ns, 304.5745 ms/op
WorkloadActual  44: 2 op, 597709800.00 ns, 298.8549 ms/op
WorkloadActual  45: 2 op, 629039300.00 ns, 314.5197 ms/op
WorkloadActual  46: 2 op, 659390100.00 ns, 329.6950 ms/op
WorkloadActual  47: 2 op, 594559700.00 ns, 297.2799 ms/op
WorkloadActual  48: 2 op, 710059200.00 ns, 355.0296 ms/op
WorkloadActual  49: 2 op, 627479000.00 ns, 313.7395 ms/op
WorkloadActual  50: 2 op, 593948800.00 ns, 296.9744 ms/op
WorkloadActual  51: 2 op, 587934500.00 ns, 293.9672 ms/op
WorkloadActual  52: 2 op, 579485900.00 ns, 289.7430 ms/op
WorkloadActual  53: 2 op, 597828900.00 ns, 298.9144 ms/op
WorkloadActual  54: 2 op, 631007100.00 ns, 315.5036 ms/op
WorkloadActual  55: 2 op, 670220900.00 ns, 335.1105 ms/op
WorkloadActual  56: 2 op, 600386200.00 ns, 300.1931 ms/op
WorkloadActual  57: 2 op, 572570400.00 ns, 286.2852 ms/op
WorkloadActual  58: 2 op, 559212300.00 ns, 279.6062 ms/op
WorkloadActual  59: 2 op, 588723000.00 ns, 294.3615 ms/op
WorkloadActual  60: 2 op, 562451800.00 ns, 281.2259 ms/op
WorkloadActual  61: 2 op, 557815300.00 ns, 278.9076 ms/op
WorkloadActual  62: 2 op, 555769000.00 ns, 277.8845 ms/op
WorkloadActual  63: 2 op, 575354100.00 ns, 287.6771 ms/op
WorkloadActual  64: 2 op, 568472700.00 ns, 284.2364 ms/op
WorkloadActual  65: 2 op, 559914200.00 ns, 279.9571 ms/op
WorkloadActual  66: 2 op, 598251700.00 ns, 299.1259 ms/op
WorkloadActual  67: 2 op, 545364500.00 ns, 272.6823 ms/op
WorkloadActual  68: 2 op, 557981400.00 ns, 278.9907 ms/op
WorkloadActual  69: 2 op, 552291200.00 ns, 276.1456 ms/op
WorkloadActual  70: 2 op, 557220400.00 ns, 278.6102 ms/op
WorkloadActual  71: 2 op, 555078000.00 ns, 277.5390 ms/op
WorkloadActual  72: 2 op, 555658300.00 ns, 277.8292 ms/op
WorkloadActual  73: 2 op, 558558300.00 ns, 279.2792 ms/op
WorkloadActual  74: 2 op, 576639600.00 ns, 288.3198 ms/op
WorkloadActual  75: 2 op, 566866400.00 ns, 283.4332 ms/op
WorkloadActual  76: 2 op, 560027500.00 ns, 280.0138 ms/op
WorkloadActual  77: 2 op, 557592700.00 ns, 278.7964 ms/op
WorkloadActual  78: 2 op, 568269500.00 ns, 284.1347 ms/op
WorkloadActual  79: 2 op, 599035800.00 ns, 299.5179 ms/op
WorkloadActual  80: 2 op, 567177200.00 ns, 283.5886 ms/op
WorkloadActual  81: 2 op, 562015300.00 ns, 281.0077 ms/op
WorkloadActual  82: 2 op, 560172700.00 ns, 280.0863 ms/op
WorkloadActual  83: 2 op, 575330400.00 ns, 287.6652 ms/op
WorkloadActual  84: 2 op, 592865400.00 ns, 296.4327 ms/op
WorkloadActual  85: 2 op, 603799100.00 ns, 301.8995 ms/op
WorkloadActual  86: 2 op, 570789800.00 ns, 285.3949 ms/op
WorkloadActual  87: 2 op, 565480900.00 ns, 282.7405 ms/op
WorkloadActual  88: 2 op, 569876800.00 ns, 284.9384 ms/op
WorkloadActual  89: 2 op, 596905900.00 ns, 298.4529 ms/op
WorkloadActual  90: 2 op, 542296100.00 ns, 271.1481 ms/op
WorkloadActual  91: 2 op, 579620300.00 ns, 289.8102 ms/op
WorkloadActual  92: 2 op, 612079500.00 ns, 306.0398 ms/op
WorkloadActual  93: 2 op, 561926200.00 ns, 280.9631 ms/op
WorkloadActual  94: 2 op, 582074400.00 ns, 291.0372 ms/op
WorkloadActual  95: 2 op, 646843800.00 ns, 323.4219 ms/op
WorkloadActual  96: 2 op, 718207100.00 ns, 359.1035 ms/op
WorkloadActual  97: 2 op, 640685700.00 ns, 320.3428 ms/op
WorkloadActual  98: 2 op, 601053800.00 ns, 300.5269 ms/op
WorkloadActual  99: 2 op, 585827900.00 ns, 292.9139 ms/op
WorkloadActual  100: 2 op, 609378900.00 ns, 304.6895 ms/op

// AfterActualRun
WorkloadResult   1: 2 op, 569689400.00 ns, 284.8447 ms/op
WorkloadResult   2: 2 op, 583121400.00 ns, 291.5607 ms/op
WorkloadResult   3: 2 op, 601341400.00 ns, 300.6707 ms/op
WorkloadResult   4: 2 op, 596239300.00 ns, 298.1196 ms/op
WorkloadResult   5: 2 op, 576182300.00 ns, 288.0912 ms/op
WorkloadResult   6: 2 op, 581903000.00 ns, 290.9515 ms/op
WorkloadResult   7: 2 op, 598651900.00 ns, 299.3259 ms/op
WorkloadResult   8: 2 op, 558364800.00 ns, 279.1824 ms/op
WorkloadResult   9: 2 op, 573976100.00 ns, 286.9880 ms/op
WorkloadResult  10: 2 op, 567107300.00 ns, 283.5537 ms/op
WorkloadResult  11: 2 op, 575677700.00 ns, 287.8388 ms/op
WorkloadResult  12: 2 op, 587776300.00 ns, 293.8881 ms/op
WorkloadResult  13: 2 op, 583147000.00 ns, 291.5735 ms/op
WorkloadResult  14: 2 op, 566960900.00 ns, 283.4805 ms/op
WorkloadResult  15: 2 op, 605306400.00 ns, 302.6532 ms/op
WorkloadResult  16: 2 op, 718605300.00 ns, 359.3027 ms/op
WorkloadResult  17: 2 op, 747627100.00 ns, 373.8136 ms/op
WorkloadResult  18: 2 op, 702515000.00 ns, 351.2575 ms/op
WorkloadResult  19: 2 op, 739882000.00 ns, 369.9410 ms/op
WorkloadResult  20: 2 op, 673605400.00 ns, 336.8027 ms/op
WorkloadResult  21: 2 op, 735400200.00 ns, 367.7001 ms/op
WorkloadResult  22: 2 op, 689003700.00 ns, 344.5018 ms/op
WorkloadResult  23: 2 op, 737335500.00 ns, 368.6678 ms/op
WorkloadResult  24: 2 op, 735289300.00 ns, 367.6447 ms/op
WorkloadResult  25: 2 op, 632260600.00 ns, 316.1303 ms/op
WorkloadResult  26: 2 op, 663009800.00 ns, 331.5049 ms/op
WorkloadResult  27: 2 op, 738824300.00 ns, 369.4121 ms/op
WorkloadResult  28: 2 op, 653206900.00 ns, 326.6035 ms/op
WorkloadResult  29: 2 op, 609791300.00 ns, 304.8956 ms/op
WorkloadResult  30: 2 op, 585578800.00 ns, 292.7894 ms/op
WorkloadResult  31: 2 op, 606954500.00 ns, 303.4773 ms/op
WorkloadResult  32: 2 op, 718562200.00 ns, 359.2811 ms/op
WorkloadResult  33: 2 op, 619368000.00 ns, 309.6840 ms/op
WorkloadResult  34: 2 op, 694654600.00 ns, 347.3273 ms/op
WorkloadResult  35: 2 op, 738385300.00 ns, 369.1927 ms/op
WorkloadResult  36: 2 op, 695503600.00 ns, 347.7518 ms/op
WorkloadResult  37: 2 op, 691243600.00 ns, 345.6218 ms/op
WorkloadResult  38: 2 op, 749723600.00 ns, 374.8618 ms/op
WorkloadResult  39: 2 op, 709179300.00 ns, 354.5897 ms/op
WorkloadResult  40: 2 op, 695476200.00 ns, 347.7381 ms/op
WorkloadResult  41: 2 op, 609605400.00 ns, 304.8027 ms/op
WorkloadResult  42: 2 op, 718729500.00 ns, 359.3648 ms/op
WorkloadResult  43: 2 op, 609148900.00 ns, 304.5745 ms/op
WorkloadResult  44: 2 op, 597709800.00 ns, 298.8549 ms/op
WorkloadResult  45: 2 op, 629039300.00 ns, 314.5197 ms/op
WorkloadResult  46: 2 op, 659390100.00 ns, 329.6950 ms/op
WorkloadResult  47: 2 op, 594559700.00 ns, 297.2799 ms/op
WorkloadResult  48: 2 op, 710059200.00 ns, 355.0296 ms/op
WorkloadResult  49: 2 op, 627479000.00 ns, 313.7395 ms/op
WorkloadResult  50: 2 op, 593948800.00 ns, 296.9744 ms/op
WorkloadResult  51: 2 op, 587934500.00 ns, 293.9672 ms/op
WorkloadResult  52: 2 op, 579485900.00 ns, 289.7430 ms/op
WorkloadResult  53: 2 op, 597828900.00 ns, 298.9144 ms/op
WorkloadResult  54: 2 op, 631007100.00 ns, 315.5036 ms/op
WorkloadResult  55: 2 op, 670220900.00 ns, 335.1105 ms/op
WorkloadResult  56: 2 op, 600386200.00 ns, 300.1931 ms/op
WorkloadResult  57: 2 op, 572570400.00 ns, 286.2852 ms/op
WorkloadResult  58: 2 op, 559212300.00 ns, 279.6062 ms/op
WorkloadResult  59: 2 op, 588723000.00 ns, 294.3615 ms/op
WorkloadResult  60: 2 op, 562451800.00 ns, 281.2259 ms/op
WorkloadResult  61: 2 op, 557815300.00 ns, 278.9076 ms/op
WorkloadResult  62: 2 op, 555769000.00 ns, 277.8845 ms/op
WorkloadResult  63: 2 op, 575354100.00 ns, 287.6771 ms/op
WorkloadResult  64: 2 op, 568472700.00 ns, 284.2364 ms/op
WorkloadResult  65: 2 op, 559914200.00 ns, 279.9571 ms/op
WorkloadResult  66: 2 op, 598251700.00 ns, 299.1259 ms/op
WorkloadResult  67: 2 op, 545364500.00 ns, 272.6823 ms/op
WorkloadResult  68: 2 op, 557981400.00 ns, 278.9907 ms/op
WorkloadResult  69: 2 op, 552291200.00 ns, 276.1456 ms/op
WorkloadResult  70: 2 op, 557220400.00 ns, 278.6102 ms/op
WorkloadResult  71: 2 op, 555078000.00 ns, 277.5390 ms/op
WorkloadResult  72: 2 op, 555658300.00 ns, 277.8292 ms/op
WorkloadResult  73: 2 op, 558558300.00 ns, 279.2792 ms/op
WorkloadResult  74: 2 op, 576639600.00 ns, 288.3198 ms/op
WorkloadResult  75: 2 op, 566866400.00 ns, 283.4332 ms/op
WorkloadResult  76: 2 op, 560027500.00 ns, 280.0138 ms/op
WorkloadResult  77: 2 op, 557592700.00 ns, 278.7964 ms/op
WorkloadResult  78: 2 op, 568269500.00 ns, 284.1347 ms/op
WorkloadResult  79: 2 op, 599035800.00 ns, 299.5179 ms/op
WorkloadResult  80: 2 op, 567177200.00 ns, 283.5886 ms/op
WorkloadResult  81: 2 op, 562015300.00 ns, 281.0077 ms/op
WorkloadResult  82: 2 op, 560172700.00 ns, 280.0863 ms/op
WorkloadResult  83: 2 op, 575330400.00 ns, 287.6652 ms/op
WorkloadResult  84: 2 op, 592865400.00 ns, 296.4327 ms/op
WorkloadResult  85: 2 op, 603799100.00 ns, 301.8995 ms/op
WorkloadResult  86: 2 op, 570789800.00 ns, 285.3949 ms/op
WorkloadResult  87: 2 op, 565480900.00 ns, 282.7405 ms/op
WorkloadResult  88: 2 op, 569876800.00 ns, 284.9384 ms/op
WorkloadResult  89: 2 op, 596905900.00 ns, 298.4529 ms/op
WorkloadResult  90: 2 op, 542296100.00 ns, 271.1481 ms/op
WorkloadResult  91: 2 op, 579620300.00 ns, 289.8102 ms/op
WorkloadResult  92: 2 op, 612079500.00 ns, 306.0398 ms/op
WorkloadResult  93: 2 op, 561926200.00 ns, 280.9631 ms/op
WorkloadResult  94: 2 op, 582074400.00 ns, 291.0372 ms/op
WorkloadResult  95: 2 op, 646843800.00 ns, 323.4219 ms/op
WorkloadResult  96: 2 op, 718207100.00 ns, 359.1035 ms/op
WorkloadResult  97: 2 op, 640685700.00 ns, 320.3428 ms/op
WorkloadResult  98: 2 op, 601053800.00 ns, 300.5269 ms/op
WorkloadResult  99: 2 op, 585827900.00 ns, 292.9139 ms/op
WorkloadResult  100: 2 op, 609378900.00 ns, 304.6895 ms/op
GC:  1 1 1 25009200 2
Threading:  13 0 2

// AfterAll
// Benchmark Process 15340 has exited with code 0

Mean = 307.382 ms, StdErr = 2.984 ms (0.97%), N = 100, StdDev = 29.844 ms
Min = 271.148 ms, Q1 = 284.211 ms, Median = 297.700 ms, Q3 = 324.217 ms, Max = 374.862 ms
IQR = 40.006 ms, LowerFence = 224.201 ms, UpperFence = 384.227 ms
ConfidenceInterval = [297.261 ms; 317.504 ms] (CI 99.9%), Margin = 10.122 ms (3.29% of Mean)
Skewness = 0.95, Kurtosis = 2.54, MValue = 2.41

// **************************
// Benchmark: PerformanceTests.NewThreadsSynchronized_1: DefaultJob
// *** Execute ***
// Launch: 1 / 1
// Execute: dotnet "8536fc4a-683d-4ccf-b6fa-d2cbea36c4f6.dll" --benchmarkName "Performance.PerformanceTests.NewThreadsSynchronized_1" --job "Default" --benchmarkId 2 in C:\Users\mihol\source\repos\parallelprograming\Performance\bin\Release\net5.0\8536fc4a-683d-4ccf-b6fa-d2cbea36c4f6\bin\Release\net5.0
// BeforeAnythingElse

// Benchmark Process Environment Information:
// Runtime=.NET 5.0.7 (5.0.721.25508), X64 RyuJIT
// GC=Concurrent Workstation
// Job: DefaultJob

OverheadJitting  1: 1 op, 392800.00 ns, 392.8000 us/op
WorkloadJitting  1: 1 op, 257473300.00 ns, 257.4733 ms/op

WorkloadPilot    1: 2 op, 518076000.00 ns, 259.0380 ms/op

WorkloadWarmup   1: 2 op, 509407500.00 ns, 254.7038 ms/op
WorkloadWarmup   2: 2 op, 509945600.00 ns, 254.9728 ms/op
WorkloadWarmup   3: 2 op, 559948400.00 ns, 279.9742 ms/op
WorkloadWarmup   4: 2 op, 527127100.00 ns, 263.5635 ms/op
WorkloadWarmup   5: 2 op, 520091900.00 ns, 260.0460 ms/op
WorkloadWarmup   6: 2 op, 497408200.00 ns, 248.7041 ms/op
WorkloadWarmup   7: 2 op, 507641000.00 ns, 253.8205 ms/op
WorkloadWarmup   8: 2 op, 505572700.00 ns, 252.7863 ms/op

// BeforeActualRun
WorkloadActual   1: 2 op, 521617900.00 ns, 260.8089 ms/op
WorkloadActual   2: 2 op, 502301400.00 ns, 251.1507 ms/op
WorkloadActual   3: 2 op, 497767800.00 ns, 248.8839 ms/op
WorkloadActual   4: 2 op, 490413500.00 ns, 245.2067 ms/op
WorkloadActual   5: 2 op, 475778200.00 ns, 237.8891 ms/op
WorkloadActual   6: 2 op, 490034400.00 ns, 245.0172 ms/op
WorkloadActual   7: 2 op, 545916100.00 ns, 272.9581 ms/op
WorkloadActual   8: 2 op, 580250300.00 ns, 290.1252 ms/op
WorkloadActual   9: 2 op, 617081300.00 ns, 308.5407 ms/op
WorkloadActual  10: 2 op, 621296600.00 ns, 310.6483 ms/op
WorkloadActual  11: 2 op, 595924700.00 ns, 297.9624 ms/op
WorkloadActual  12: 2 op, 599236300.00 ns, 299.6182 ms/op
WorkloadActual  13: 2 op, 567002100.00 ns, 283.5011 ms/op
WorkloadActual  14: 2 op, 576214700.00 ns, 288.1073 ms/op
WorkloadActual  15: 2 op, 526044600.00 ns, 263.0223 ms/op
WorkloadActual  16: 2 op, 495408800.00 ns, 247.7044 ms/op
WorkloadActual  17: 2 op, 517967600.00 ns, 258.9838 ms/op
WorkloadActual  18: 2 op, 526935700.00 ns, 263.4678 ms/op
WorkloadActual  19: 2 op, 514903700.00 ns, 257.4518 ms/op
WorkloadActual  20: 2 op, 530029000.00 ns, 265.0145 ms/op
WorkloadActual  21: 2 op, 547173100.00 ns, 273.5865 ms/op
WorkloadActual  22: 2 op, 522734700.00 ns, 261.3673 ms/op
WorkloadActual  23: 2 op, 514439900.00 ns, 257.2199 ms/op
WorkloadActual  24: 2 op, 493191300.00 ns, 246.5957 ms/op
WorkloadActual  25: 2 op, 493605100.00 ns, 246.8025 ms/op
WorkloadActual  26: 2 op, 534204000.00 ns, 267.1020 ms/op
WorkloadActual  27: 2 op, 579505100.00 ns, 289.7525 ms/op
WorkloadActual  28: 2 op, 596733300.00 ns, 298.3666 ms/op
WorkloadActual  29: 2 op, 568635900.00 ns, 284.3179 ms/op
WorkloadActual  30: 2 op, 548590100.00 ns, 274.2951 ms/op
WorkloadActual  31: 2 op, 519690900.00 ns, 259.8454 ms/op
WorkloadActual  32: 2 op, 527753900.00 ns, 263.8770 ms/op
WorkloadActual  33: 2 op, 529046500.00 ns, 264.5233 ms/op
WorkloadActual  34: 2 op, 525700200.00 ns, 262.8501 ms/op
WorkloadActual  35: 2 op, 523513700.00 ns, 261.7568 ms/op
WorkloadActual  36: 2 op, 500996100.00 ns, 250.4981 ms/op
WorkloadActual  37: 2 op, 489479600.00 ns, 244.7398 ms/op
WorkloadActual  38: 2 op, 517770800.00 ns, 258.8854 ms/op
WorkloadActual  39: 2 op, 548366900.00 ns, 274.1834 ms/op
WorkloadActual  40: 2 op, 560275300.00 ns, 280.1377 ms/op
WorkloadActual  41: 2 op, 526970100.00 ns, 263.4851 ms/op
WorkloadActual  42: 2 op, 504403300.00 ns, 252.2017 ms/op
WorkloadActual  43: 2 op, 493259900.00 ns, 246.6300 ms/op
WorkloadActual  44: 2 op, 483551900.00 ns, 241.7759 ms/op
WorkloadActual  45: 2 op, 503441500.00 ns, 251.7208 ms/op
WorkloadActual  46: 2 op, 487905300.00 ns, 243.9527 ms/op
WorkloadActual  47: 2 op, 499859400.00 ns, 249.9297 ms/op
WorkloadActual  48: 2 op, 485886900.00 ns, 242.9435 ms/op
WorkloadActual  49: 2 op, 493362000.00 ns, 246.6810 ms/op
WorkloadActual  50: 2 op, 491495800.00 ns, 245.7479 ms/op
WorkloadActual  51: 2 op, 488837700.00 ns, 244.4188 ms/op
WorkloadActual  52: 2 op, 499276500.00 ns, 249.6382 ms/op
WorkloadActual  53: 2 op, 483100100.00 ns, 241.5500 ms/op
WorkloadActual  54: 2 op, 482593000.00 ns, 241.2965 ms/op
WorkloadActual  55: 2 op, 477583100.00 ns, 238.7916 ms/op
WorkloadActual  56: 2 op, 481425000.00 ns, 240.7125 ms/op
WorkloadActual  57: 2 op, 493317900.00 ns, 246.6590 ms/op
WorkloadActual  58: 2 op, 485850000.00 ns, 242.9250 ms/op
WorkloadActual  59: 2 op, 491912400.00 ns, 245.9562 ms/op
WorkloadActual  60: 2 op, 481566000.00 ns, 240.7830 ms/op
WorkloadActual  61: 2 op, 476936200.00 ns, 238.4681 ms/op
WorkloadActual  62: 2 op, 487436500.00 ns, 243.7183 ms/op
WorkloadActual  63: 2 op, 496006200.00 ns, 248.0031 ms/op
WorkloadActual  64: 2 op, 494229300.00 ns, 247.1147 ms/op
WorkloadActual  65: 2 op, 484491700.00 ns, 242.2458 ms/op
WorkloadActual  66: 2 op, 479938300.00 ns, 239.9692 ms/op
WorkloadActual  67: 2 op, 466457200.00 ns, 233.2286 ms/op
WorkloadActual  68: 2 op, 481184600.00 ns, 240.5923 ms/op
WorkloadActual  69: 2 op, 484280400.00 ns, 242.1402 ms/op
WorkloadActual  70: 2 op, 495456800.00 ns, 247.7284 ms/op
WorkloadActual  71: 2 op, 495479400.00 ns, 247.7397 ms/op
WorkloadActual  72: 2 op, 487662400.00 ns, 243.8312 ms/op
WorkloadActual  73: 2 op, 483139000.00 ns, 241.5695 ms/op
WorkloadActual  74: 2 op, 492951300.00 ns, 246.4757 ms/op
WorkloadActual  75: 2 op, 487987600.00 ns, 243.9938 ms/op
WorkloadActual  76: 2 op, 495364600.00 ns, 247.6823 ms/op
WorkloadActual  77: 2 op, 495631700.00 ns, 247.8159 ms/op
WorkloadActual  78: 2 op, 489531700.00 ns, 244.7659 ms/op
WorkloadActual  79: 2 op, 475794800.00 ns, 237.8974 ms/op
WorkloadActual  80: 2 op, 488422700.00 ns, 244.2114 ms/op
WorkloadActual  81: 2 op, 505080100.00 ns, 252.5401 ms/op
WorkloadActual  82: 2 op, 490682500.00 ns, 245.3413 ms/op
WorkloadActual  83: 2 op, 493636500.00 ns, 246.8183 ms/op
WorkloadActual  84: 2 op, 503238100.00 ns, 251.6190 ms/op
WorkloadActual  85: 2 op, 496807200.00 ns, 248.4036 ms/op
WorkloadActual  86: 2 op, 488900300.00 ns, 244.4502 ms/op

// AfterActualRun
WorkloadResult   1: 2 op, 521617900.00 ns, 260.8089 ms/op
WorkloadResult   2: 2 op, 502301400.00 ns, 251.1507 ms/op
WorkloadResult   3: 2 op, 497767800.00 ns, 248.8839 ms/op
WorkloadResult   4: 2 op, 490413500.00 ns, 245.2067 ms/op
WorkloadResult   5: 2 op, 475778200.00 ns, 237.8891 ms/op
WorkloadResult   6: 2 op, 490034400.00 ns, 245.0172 ms/op
WorkloadResult   7: 2 op, 545916100.00 ns, 272.9581 ms/op
WorkloadResult   8: 2 op, 580250300.00 ns, 290.1252 ms/op
WorkloadResult   9: 2 op, 567002100.00 ns, 283.5011 ms/op
WorkloadResult  10: 2 op, 576214700.00 ns, 288.1073 ms/op
WorkloadResult  11: 2 op, 526044600.00 ns, 263.0223 ms/op
WorkloadResult  12: 2 op, 495408800.00 ns, 247.7044 ms/op
WorkloadResult  13: 2 op, 517967600.00 ns, 258.9838 ms/op
WorkloadResult  14: 2 op, 526935700.00 ns, 263.4678 ms/op
WorkloadResult  15: 2 op, 514903700.00 ns, 257.4518 ms/op
WorkloadResult  16: 2 op, 530029000.00 ns, 265.0145 ms/op
WorkloadResult  17: 2 op, 547173100.00 ns, 273.5865 ms/op
WorkloadResult  18: 2 op, 522734700.00 ns, 261.3673 ms/op
WorkloadResult  19: 2 op, 514439900.00 ns, 257.2199 ms/op
WorkloadResult  20: 2 op, 493191300.00 ns, 246.5957 ms/op
WorkloadResult  21: 2 op, 493605100.00 ns, 246.8025 ms/op
WorkloadResult  22: 2 op, 534204000.00 ns, 267.1020 ms/op
WorkloadResult  23: 2 op, 579505100.00 ns, 289.7525 ms/op
WorkloadResult  24: 2 op, 568635900.00 ns, 284.3179 ms/op
WorkloadResult  25: 2 op, 548590100.00 ns, 274.2951 ms/op
WorkloadResult  26: 2 op, 519690900.00 ns, 259.8454 ms/op
WorkloadResult  27: 2 op, 527753900.00 ns, 263.8770 ms/op
WorkloadResult  28: 2 op, 529046500.00 ns, 264.5233 ms/op
WorkloadResult  29: 2 op, 525700200.00 ns, 262.8501 ms/op
WorkloadResult  30: 2 op, 523513700.00 ns, 261.7568 ms/op
WorkloadResult  31: 2 op, 500996100.00 ns, 250.4981 ms/op
WorkloadResult  32: 2 op, 489479600.00 ns, 244.7398 ms/op
WorkloadResult  33: 2 op, 517770800.00 ns, 258.8854 ms/op
WorkloadResult  34: 2 op, 548366900.00 ns, 274.1834 ms/op
WorkloadResult  35: 2 op, 560275300.00 ns, 280.1377 ms/op
WorkloadResult  36: 2 op, 526970100.00 ns, 263.4851 ms/op
WorkloadResult  37: 2 op, 504403300.00 ns, 252.2017 ms/op
WorkloadResult  38: 2 op, 493259900.00 ns, 246.6300 ms/op
WorkloadResult  39: 2 op, 483551900.00 ns, 241.7759 ms/op
WorkloadResult  40: 2 op, 503441500.00 ns, 251.7208 ms/op
WorkloadResult  41: 2 op, 487905300.00 ns, 243.9527 ms/op
WorkloadResult  42: 2 op, 499859400.00 ns, 249.9297 ms/op
WorkloadResult  43: 2 op, 485886900.00 ns, 242.9435 ms/op
WorkloadResult  44: 2 op, 493362000.00 ns, 246.6810 ms/op
WorkloadResult  45: 2 op, 491495800.00 ns, 245.7479 ms/op
WorkloadResult  46: 2 op, 488837700.00 ns, 244.4188 ms/op
WorkloadResult  47: 2 op, 499276500.00 ns, 249.6382 ms/op
WorkloadResult  48: 2 op, 483100100.00 ns, 241.5500 ms/op
WorkloadResult  49: 2 op, 482593000.00 ns, 241.2965 ms/op
WorkloadResult  50: 2 op, 477583100.00 ns, 238.7916 ms/op
WorkloadResult  51: 2 op, 481425000.00 ns, 240.7125 ms/op
WorkloadResult  52: 2 op, 493317900.00 ns, 246.6590 ms/op
WorkloadResult  53: 2 op, 485850000.00 ns, 242.9250 ms/op
WorkloadResult  54: 2 op, 491912400.00 ns, 245.9562 ms/op
WorkloadResult  55: 2 op, 481566000.00 ns, 240.7830 ms/op
WorkloadResult  56: 2 op, 476936200.00 ns, 238.4681 ms/op
WorkloadResult  57: 2 op, 487436500.00 ns, 243.7183 ms/op
WorkloadResult  58: 2 op, 496006200.00 ns, 248.0031 ms/op
WorkloadResult  59: 2 op, 494229300.00 ns, 247.1147 ms/op
WorkloadResult  60: 2 op, 484491700.00 ns, 242.2458 ms/op
WorkloadResult  61: 2 op, 479938300.00 ns, 239.9692 ms/op
WorkloadResult  62: 2 op, 466457200.00 ns, 233.2286 ms/op
WorkloadResult  63: 2 op, 481184600.00 ns, 240.5923 ms/op
WorkloadResult  64: 2 op, 484280400.00 ns, 242.1402 ms/op
WorkloadResult  65: 2 op, 495456800.00 ns, 247.7284 ms/op
WorkloadResult  66: 2 op, 495479400.00 ns, 247.7397 ms/op
WorkloadResult  67: 2 op, 487662400.00 ns, 243.8312 ms/op
WorkloadResult  68: 2 op, 483139000.00 ns, 241.5695 ms/op
WorkloadResult  69: 2 op, 492951300.00 ns, 246.4757 ms/op
WorkloadResult  70: 2 op, 487987600.00 ns, 243.9938 ms/op
WorkloadResult  71: 2 op, 495364600.00 ns, 247.6823 ms/op
WorkloadResult  72: 2 op, 495631700.00 ns, 247.8159 ms/op
WorkloadResult  73: 2 op, 489531700.00 ns, 244.7659 ms/op
WorkloadResult  74: 2 op, 475794800.00 ns, 237.8974 ms/op
WorkloadResult  75: 2 op, 488422700.00 ns, 244.2114 ms/op
WorkloadResult  76: 2 op, 505080100.00 ns, 252.5401 ms/op
WorkloadResult  77: 2 op, 490682500.00 ns, 245.3413 ms/op
WorkloadResult  78: 2 op, 493636500.00 ns, 246.8183 ms/op
WorkloadResult  79: 2 op, 503238100.00 ns, 251.6190 ms/op
WorkloadResult  80: 2 op, 496807200.00 ns, 248.4036 ms/op
WorkloadResult  81: 2 op, 488900300.00 ns, 244.4502 ms/op
GC:  1 1 1 25010800 2
Threading:  2 0 2

// AfterAll
// Benchmark Process 11676 has exited with code 0

Mean = 252.812 ms, StdErr = 1.474 ms (0.58%), N = 81, StdDev = 13.267 ms
Min = 233.229 ms, Q1 = 243.994 ms, Median = 247.704 ms, Q3 = 260.809 ms, Max = 290.125 ms
IQR = 16.815 ms, LowerFence = 218.771 ms, UpperFence = 286.032 ms
ConfidenceInterval = [247.776 ms; 257.848 ms] (CI 99.9%), Margin = 5.036 ms (1.99% of Mean)
Skewness = 1.22, Kurtosis = 3.72, MValue = 2.23

// **************************
// Benchmark: PerformanceTests.ThreadPoolThreadsSynchronized_1: DefaultJob
// *** Execute ***
// Launch: 1 / 1
// Execute: dotnet "8536fc4a-683d-4ccf-b6fa-d2cbea36c4f6.dll" --benchmarkName "Performance.PerformanceTests.ThreadPoolThreadsSynchronized_1" --job "Default" --benchmarkId 3 in C:\Users\mihol\source\repos\parallelprograming\Performance\bin\Release\net5.0\8536fc4a-683d-4ccf-b6fa-d2cbea36c4f6\bin\Release\net5.0
// BeforeAnythingElse

// Benchmark Process Environment Information:
// Runtime=.NET 5.0.7 (5.0.721.25508), X64 RyuJIT
// GC=Concurrent Workstation
// Job: DefaultJob

OverheadJitting  1: 1 op, 200800.00 ns, 200.8000 us/op
WorkloadJitting  1: 1 op, 241019600.00 ns, 241.0196 ms/op

WorkloadPilot    1: 2 op, 481202400.00 ns, 240.6012 ms/op
WorkloadPilot    2: 3 op, 730833000.00 ns, 243.6110 ms/op

WorkloadWarmup   1: 3 op, 726484100.00 ns, 242.1614 ms/op
WorkloadWarmup   2: 3 op, 718562900.00 ns, 239.5210 ms/op
WorkloadWarmup   3: 3 op, 717062200.00 ns, 239.0207 ms/op
WorkloadWarmup   4: 3 op, 732834900.00 ns, 244.2783 ms/op
WorkloadWarmup   5: 3 op, 738564100.00 ns, 246.1880 ms/op
WorkloadWarmup   6: 3 op, 729485300.00 ns, 243.1618 ms/op
WorkloadWarmup   7: 3 op, 712576400.00 ns, 237.5255 ms/op
WorkloadWarmup   8: 3 op, 753472800.00 ns, 251.1576 ms/op
WorkloadWarmup   9: 3 op, 743359800.00 ns, 247.7866 ms/op

// BeforeActualRun
WorkloadActual   1: 3 op, 720310100.00 ns, 240.1034 ms/op
WorkloadActual   2: 3 op, 737121400.00 ns, 245.7071 ms/op
WorkloadActual   3: 3 op, 722837200.00 ns, 240.9457 ms/op
WorkloadActual   4: 3 op, 743451400.00 ns, 247.8171 ms/op
WorkloadActual   5: 3 op, 734772200.00 ns, 244.9241 ms/op
WorkloadActual   6: 3 op, 737273400.00 ns, 245.7578 ms/op
WorkloadActual   7: 3 op, 740502300.00 ns, 246.8341 ms/op
WorkloadActual   8: 3 op, 740271300.00 ns, 246.7571 ms/op
WorkloadActual   9: 3 op, 744370800.00 ns, 248.1236 ms/op
WorkloadActual  10: 3 op, 735382300.00 ns, 245.1274 ms/op
WorkloadActual  11: 3 op, 709657800.00 ns, 236.5526 ms/op
WorkloadActual  12: 3 op, 726631800.00 ns, 242.2106 ms/op
WorkloadActual  13: 3 op, 743919300.00 ns, 247.9731 ms/op
WorkloadActual  14: 3 op, 720523800.00 ns, 240.1746 ms/op
WorkloadActual  15: 3 op, 749784500.00 ns, 249.9282 ms/op

// AfterActualRun
WorkloadResult   1: 3 op, 720310100.00 ns, 240.1034 ms/op
WorkloadResult   2: 3 op, 737121400.00 ns, 245.7071 ms/op
WorkloadResult   3: 3 op, 722837200.00 ns, 240.9457 ms/op
WorkloadResult   4: 3 op, 743451400.00 ns, 247.8171 ms/op
WorkloadResult   5: 3 op, 734772200.00 ns, 244.9241 ms/op
WorkloadResult   6: 3 op, 737273400.00 ns, 245.7578 ms/op
WorkloadResult   7: 3 op, 740502300.00 ns, 246.8341 ms/op
WorkloadResult   8: 3 op, 740271300.00 ns, 246.7571 ms/op
WorkloadResult   9: 3 op, 744370800.00 ns, 248.1236 ms/op
WorkloadResult  10: 3 op, 735382300.00 ns, 245.1274 ms/op
WorkloadResult  11: 3 op, 709657800.00 ns, 236.5526 ms/op
WorkloadResult  12: 3 op, 726631800.00 ns, 242.2106 ms/op
WorkloadResult  13: 3 op, 743919300.00 ns, 247.9731 ms/op
WorkloadResult  14: 3 op, 720523800.00 ns, 240.1746 ms/op
WorkloadResult  15: 3 op, 749784500.00 ns, 249.9282 ms/op
GC:  1 1 1 37509744 3
Threading:  17 0 3

// AfterAll
// Benchmark Process 5716 has exited with code 0

Mean = 244.596 ms, StdErr = 0.973 ms (0.40%), N = 15, StdDev = 3.768 ms
Min = 236.553 ms, Q1 = 241.578 ms, Median = 245.707 ms, Q3 = 247.326 ms, Max = 249.928 ms
IQR = 5.747 ms, LowerFence = 232.957 ms, UpperFence = 255.947 ms
ConfidenceInterval = [240.568 ms; 248.624 ms] (CI 99.9%), Margin = 4.028 ms (1.65% of Mean)
Skewness = -0.58, Kurtosis = 2.13, MValue = 2

// ***** BenchmarkRunner: Finish  *****

// * Export *
  BenchmarkDotNet.Artifacts\results\Performance.PerformanceTests-report.csv
  BenchmarkDotNet.Artifacts\results\Performance.PerformanceTests-report-github.md
  BenchmarkDotNet.Artifacts\results\Performance.PerformanceTests-report.html

// * Detailed results *
PerformanceTests.PrimesParallelSynchronized_1: DefaultJob
Runtime = .NET 5.0.7 (5.0.721.25508), X64 RyuJIT; GC = Concurrent Workstation
Mean = 252.692 ms, StdErr = 1.478 ms (0.58%), N = 85, StdDev = 13.629 ms
Min = 234.586 ms, Q1 = 241.562 ms, Median = 250.342 ms, Q3 = 259.308 ms, Max = 293.161 ms
IQR = 17.747 ms, LowerFence = 214.942 ms, UpperFence = 285.928 ms
ConfidenceInterval = [247.651 ms; 257.733 ms] (CI 99.9%), Margin = 5.041 ms (1.99% of Mean)
Skewness = 0.85, Kurtosis = 3.15, MValue = 2.34
-------------------- Histogram --------------------
[230.517 ms ; 236.413 ms) | @@@
[236.413 ms ; 244.550 ms) | @@@@@@@@@@@@@@@@@@@@@@@@@@@@@
[244.550 ms ; 253.134 ms) | @@@@@@@@@@@@@@
[253.134 ms ; 261.271 ms) | @@@@@@@@@@@@@@@@@@@@
[261.271 ms ; 269.166 ms) | @@@@@@@
[269.166 ms ; 277.303 ms) | @@@@@@@
[277.303 ms ; 285.441 ms) | @@
[285.441 ms ; 293.578 ms) | @@@
---------------------------------------------------

PerformanceTests.PrimesParallelSynchronized_2: DefaultJob
Runtime = .NET 5.0.7 (5.0.721.25508), X64 RyuJIT; GC = Concurrent Workstation
Mean = 307.382 ms, StdErr = 2.984 ms (0.97%), N = 100, StdDev = 29.844 ms
Min = 271.148 ms, Q1 = 284.211 ms, Median = 297.700 ms, Q3 = 324.217 ms, Max = 374.862 ms
IQR = 40.006 ms, LowerFence = 224.201 ms, UpperFence = 384.227 ms
ConfidenceInterval = [297.261 ms; 317.504 ms] (CI 99.9%), Margin = 10.122 ms (3.29% of Mean)
Skewness = 0.95, Kurtosis = 2.54, MValue = 2.41
-------------------- Histogram --------------------
[262.709 ms ; 277.511 ms) | @@@
[277.511 ms ; 294.389 ms) | @@@@@@@@@@@@@@@@@@@@@@@@@@@@@@@@@@@@@@@@@@@@
[294.389 ms ; 311.497 ms) | @@@@@@@@@@@@@@@@@@@@@@
[311.497 ms ; 330.156 ms) | @@@@@@@@
[330.156 ms ; 343.494 ms) | @@@
[343.494 ms ; 360.372 ms) | @@@@@@@@@@@@
[360.372 ms ; 379.692 ms) | @@@@@@@@
---------------------------------------------------

PerformanceTests.NewThreadsSynchronized_1: DefaultJob
Runtime = .NET 5.0.7 (5.0.721.25508), X64 RyuJIT; GC = Concurrent Workstation
Mean = 252.812 ms, StdErr = 1.474 ms (0.58%), N = 81, StdDev = 13.267 ms
Min = 233.229 ms, Q1 = 243.994 ms, Median = 247.704 ms, Q3 = 260.809 ms, Max = 290.125 ms
IQR = 16.815 ms, LowerFence = 218.771 ms, UpperFence = 286.032 ms
ConfidenceInterval = [247.776 ms; 257.848 ms] (CI 99.9%), Margin = 5.036 ms (1.99% of Mean)
Skewness = 1.22, Kurtosis = 3.72, MValue = 2.23
-------------------- Histogram --------------------
[232.574 ms ; 240.474 ms) | @@@@@@
[240.474 ms ; 248.522 ms) | @@@@@@@@@@@@@@@@@@@@@@@@@@@@@@@@@@@@@@@@
[248.522 ms ; 257.093 ms) | @@@@@@@@@
[257.093 ms ; 265.142 ms) | @@@@@@@@@@@@@@@
[265.142 ms ; 272.523 ms) | @
[272.523 ms ; 280.572 ms) | @@@@@
[280.572 ms ; 290.837 ms) | @@@@@
---------------------------------------------------

PerformanceTests.ThreadPoolThreadsSynchronized_1: DefaultJob
Runtime = .NET 5.0.7 (5.0.721.25508), X64 RyuJIT; GC = Concurrent Workstation
Mean = 244.596 ms, StdErr = 0.973 ms (0.40%), N = 15, StdDev = 3.768 ms
Min = 236.553 ms, Q1 = 241.578 ms, Median = 245.707 ms, Q3 = 247.326 ms, Max = 249.928 ms
IQR = 5.747 ms, LowerFence = 232.957 ms, UpperFence = 255.947 ms
ConfidenceInterval = [240.568 ms; 248.624 ms] (CI 99.9%), Margin = 4.028 ms (1.65% of Mean)
Skewness = -0.58, Kurtosis = 2.13, MValue = 2
-------------------- Histogram --------------------
[234.547 ms ; 243.569 ms) | @@@@@
[243.569 ms ; 251.933 ms) | @@@@@@@@@@
---------------------------------------------------

// * Summary *

BenchmarkDotNet=v0.13.0, OS=Windows 10.0.19041.1110 (2004/May2020Update/20H1)
Intel Core i5-8265U CPU 1.60GHz (Whiskey Lake), 1 CPU, 8 logical and 4 physical cores
.NET SDK=5.0.301
  [Host]     : .NET 5.0.7 (5.0.721.25508), X64 RyuJIT
  DefaultJob : .NET 5.0.7 (5.0.721.25508), X64 RyuJIT


|                          Method |     Mean |    Error |   StdDev |   Median |    Gen 0 |    Gen 1 |    Gen 2 | Allocated |
|-------------------------------- |---------:|---------:|---------:|---------:|---------:|---------:|---------:|----------:|
|    PrimesParallelSynchronized_1 | 252.7 ms |  5.04 ms | 13.63 ms | 250.3 ms | 333.3333 | 333.3333 | 333.3333 |     12 MB |
|    PrimesParallelSynchronized_2 | 307.4 ms | 10.12 ms | 29.84 ms | 297.7 ms | 500.0000 | 500.0000 | 500.0000 |     12 MB |
|        NewThreadsSynchronized_1 | 252.8 ms |  5.04 ms | 13.27 ms | 247.7 ms | 500.0000 | 500.0000 | 500.0000 |     12 MB |
| ThreadPoolThreadsSynchronized_1 | 244.6 ms |  4.03 ms |  3.77 ms | 245.7 ms | 333.3333 | 333.3333 | 333.3333 |     12 MB |

// * Hints *
Outliers
  PerformanceTests.PrimesParallelSynchronized_1: Default -> 7 outliers were removed (303.50 ms..326.05 ms)
  PerformanceTests.NewThreadsSynchronized_1: Default     -> 5 outliers were removed (297.96 ms..310.65 ms)

// * Legends *
  Mean      : Arithmetic mean of all measurements
  Error     : Half of 99.9% confidence interval
  StdDev    : Standard deviation of all measurements
  Median    : Value separating the higher half of all measurements (50th percentile)
  Gen 0     : GC Generation 0 collects per 1000 operations
  Gen 1     : GC Generation 1 collects per 1000 operations
  Gen 2     : GC Generation 2 collects per 1000 operations
  Allocated : Allocated memory per single operation (managed only, inclusive, 1KB = 1024B)
  1 ms      : 1 Millisecond (0.001 sec)

// * Diagnostic Output - MemoryDiagnoser *


// ***** BenchmarkRunner: End *****
// ** Remained 0 benchmark(s) to run **
Run time: 00:03:40 (220.84 sec), executed benchmarks: 4

Global total time: 00:03:45 (225.41 sec), executed benchmarks: 4
// * Artifacts cleanup *
