clname,clport,clhost,cluser,clpass,cldesc
# first line is the header and must be present
# fields in the header are used as keys in the database config dictionary
# in the scripts using this file
# if database has no password use "" in fourth field
northcluster,8070,north.redislabs-training.org,admin@redislabs-training.org,YWRtaW4K,"North Training Cluster"
southcluster,8070,south.redislabs-training.org,admin@redislabs-training.org,YWRtaW4K,"South Training Cluster"
