Place,Name,State,WeightClassKg,BodyweightKg,BirthDate,Age,Squat1Kg,Squat2Kg,Squat3Kg,Best3SquatKg,Bench1Kg,Bench2Kg,Bench3Kg,Best3BenchKg,Deadlift1Kg,Deadlift2Kg,Deadlift3Kg,Best3DeadliftKg,TotalKg,Event,Equipment,Sex,Division,Tested
1,Olivia DeNoto,OH,75,70.8,,20,140,147.5,152.5,152.5,65,70,72.5,72.5,145,155,165,165,390,SBD,Raw,F,Juniors 20-23,Yes
1,Jessica Oakes,OH,60,58.9,,17,85,-95,-95,85,50,-55,-55,50,95,107.5,112.5,112.5,247.5,SBD,Raw,F,Open,Yes
1,Courtney Yopp,OH,67.5,67.5,,30,117.5,127.5,-137.5,127.5,80,-85,-85,80,127.5,137.5,145,145,352.5,SBD,Raw,F,Open,Yes
2,Somer Brown,OH,67.5,66.2,,18,100,112.5,120,120,52.5,57.5,62.5,62.5,112.5,122.5,132.5,132.5,315,SBD,Raw,F,Open,Yes
3,Danielle Skelly-Murphy,OH,67.5,67.4,,50,80,82.5,85,85,50,52.5,-55,52.5,85,90,95,95,232.5,SBD,Raw,F,Open,Yes
1,Olivia DeNoto,OH,75,70.8,,20,140,147.5,152.5,152.5,65,70,72.5,72.5,145,155,165,165,390,SBD,Raw,F,Open,Yes
2,Danielle Heckman,OH,75,70.8,,29,125,-130,130,130,60,-65,65,65,137.5,145,147.5,147.5,342.5,SBD,Raw,F,Open,Yes
3,Alicia Tapper,OH,75,68.2,,31,85,95,-97.5,95,-67.5,67.5,72.5,72.5,147.5,155,162.5,162.5,330,SBD,Raw,F,Open,Yes
1,Alexandra Donald,OH,90,88.9,,29,165,-175,180,180,100,105,107.5,107.5,205,217.5,227.5,227.5,515,SBD,Raw,F,Open,Yes
2,Lesli Roberts,OH,90,82.7,,27,100,107.5,115,115,55,-60,-60,55,105,115,-120,115,285,SBD,Raw,F,Open,Yes
1,Madison Reiheld,OH,90+,104.2,,26,100,110,115,115,60,67.5,72.5,72.5,117.5,127.5,135,135,322.5,SBD,Raw,F,Open,Yes
1,Crystal Macklin Macklin,OH,67.5,66.8,,41,97.5,-105,-105,97.5,50,52.5,55,55,107.5,115,120,120,272.5,SBD,Raw,F,Masters 40-44,Yes
1,Danielle Skelly-Murphy,OH,67.5,67.4,,50,80,82.5,85,85,50,52.5,-55,52.5,85,90,95,95,232.5,SBD,Raw,F,Masters 50-54,Yes
1,Lance Jelen,OH,82.5,79.2,,15,182.5,195,205,205,125,135,140,140,200,217.5,227.5,227.5,572.5,SBD,Raw,M,Juniors 13-15,Yes
1,Julio Navarro,IN,82.5,80.8,,19,185,212.5,220,220,-115,132.5,-140,132.5,205,222.5,-235,222.5,575,SBD,Raw,M,Juniors 18-19,Yes
1,Charlie Ellis,OH,82.5,82,,23,150,165,-170,165,120,-127.5,-130,120,202.5,217.5,225,225,510,SBD,Raw,M,Juniors 20-23,Yes
1,Evan Moore,MI,90,89.5,,18,170,190,,190,110,130,147.5,147.5,165,190,,190,527.5,SBD,Raw,M,Juniors 18-19,Yes
1,Nicholas Elia,OH,90,86.1,,21,207.5,220,230,230,137.5,142.5,152.5,152.5,247.5,265,-272.5,265,647.5,SBD,Raw,M,Juniors 20-23,Yes
2,James Cellio,OH,90,88.7,,21,205,215,220,220,145,157.5,-160,157.5,265,-282.5,-295,265,642.5,SBD,Raw,M,Juniors 20-23,Yes
3,Matthew Erba,OH,90,88.4,,20,182.5,195,-200,195,95,102.5,107.5,107.5,215,230,-240,230,532.5,SBD,Raw,M,Juniors 20-23,Yes
1,Gino Bertolone,OH,110,109.1,,22,-225,-225,225,225,110,115,-120,115,245,262.5,-267.5,262.5,602.5,SBD,Raw,M,Juniors 20-23,Yes
1,Andrew Garcia,IN,125,117.6,,20,200,225,240,240,145,165,-170,165,230,250,-272.5,250,655,SBD,Raw,M,Juniors 20-23,Yes
DQ,Dante Petrella,PA,125,121.8,,23,250,-265,265,265,-175,-175,-175,,280,290,-297.5,290,,SBD,Raw,M,Juniors 20-23,Yes
1,Jose Rosales,IN,140,132.5,,19,200,220,237.5,237.5,125,150,-157.5,150,205,-225,-225,205,592.5,SBD,Raw,M,Juniors 18-19,Yes
1,Carlo Lomanto,OH,75,74.1,,37,185,-195,-195,185,105,110,-115,110,-227.5,245,-262.5,245,540,SBD,Raw,M,Open,Yes
2,Jason Hatchard,OH,75,74.7,,29,155,157.5,-160,157.5,117.5,-120,-120,117.5,225,230,232.5,232.5,507.5,SBD,Raw,M,Open,Yes
1,Nicholas Bank,IL,82.5,80.5,,23,210,220,230,230,130,132.5,142.5,142.5,255,262.5,-265,262.5,635,SBD,Raw,M,Open,Yes
2,Jason Breininger,OH,82.5,81.5,,24,185,190,-205,190,120,-130,-130,120,250,262.5,275,275,585,SBD,Raw,M,Open,Yes
3,Tyler Harris,OH,82.5,80.3,,25,145,162.5,172.5,172.5,110,-122.5,122.5,122.5,215,227.5,-240,227.5,522.5,SBD,Raw,M,Open,Yes
4,Charlie Ellis,OH,82.5,82,,23,150,165,-170,165,120,-127.5,-130,120,202.5,217.5,225,225,510,SBD,Raw,M,Open,Yes
1,Mark Lombardo,OH,90,88.6,,28,185,-192.5,-197.5,185,135,140,-142.5,140,210,220,230,230,555,SBD,Raw,M,Open,Yes
1,Tyler Nunn,OH,100,96.2,,27,165,182.5,190,190,120,127.5,132.5,132.5,215,227.5,-232.5,227.5,550,SBD,Raw,M,Open,Yes
1,Brian Moore,OH,110,108.4,,30,210,225,235,235,165,-172.5,-172.5,165,250,270,-277.5,270,670,SBD,Raw,M,Open,Yes
2,Terry Smith #7,OH,110,106.4,,27,217.5,232.5,-240,232.5,160,-175,,160,215,235,245,245,637.5,SBD,Raw,M,Open,Yes
1,Walter Watts,OH,125,120.9,,30,247.5,-265,272.5,272.5,170,187.5,-197.5,187.5,295,322.5,-327.5,322.5,782.5,SBD,Raw,M,Open,Yes
2,Andrew Garcia,IN,125,117.6,,20,200,225,240,240,145,165,-170,165,230,250,-272.5,250,655,SBD,Raw,M,Open,Yes
3,Alan Stevens,OH,125,122,,32,205,220,-227.5,220,155,-167.5,-167.5,155,215,232.5,-240,232.5,607.5,SBD,Raw,M,Open,Yes
DQ,Dante Petrella,PA,125,121.8,,23,250,-265,265,265,-175,-175,-175,,280,290,-297.5,290,,SBD,Raw,M,Open,Yes
1,Joe Gillespie,OH,140,135.5,,26,245,257.5,265,265,155,165,-172.5,165,287.5,-297.5,-297.5,287.5,717.5,SBD,Raw,M,Open,Yes
2,Tyler Stagani,OH,140,125.5,,24,-200,200,210,210,145,150,152.5,152.5,185,205,-227.5,205,567.5,SBD,Raw,M,Open,Yes
1,Daniel Miller,OH,140+,155.1,,29,192.5,207.5,222.5,222.5,142.5,157.5,,157.5,230,-245,-245,230,610,SBD,Raw,M,Open,Yes
1,Carlo Lomanto,OH,75,74.1,,37,185,-195,-195,185,105,110,-115,110,-227.5,245,-262.5,245,540,SBD,Raw,M,Submasters 35-39,Yes
DQ,Jason Shockey,IN,110,105.1,,42,195,205,220,220,-137.5,,,,-192.5,,,,,SBD,Raw,M,Masters 40-44,Yes
1,Bill Humphrys,OH,110,108.3,,50,170,190,200,200,125,142.5,-147.5,142.5,185,205,227.5,227.5,570,SBD,Raw,M,Masters 50-54,Yes
1,Dante Petrella Sr,PA,125,120.5,,54,-137.5,137.5,,137.5,115,117.5,127.5,127.5,115,137.5,147.5,147.5,412.5,SBD,Raw,M,Masters 50-54,Yes
1,Elton Rains,MI,100,96.3,,21,215,225,230,230,127.5,-137.5,137.5,137.5,215,-227.5,227.5,227.5,595,SBD,Wraps,M,Juniors 20-23,Yes
2,Gavin Smith #1,OH,100,99.1,,20,187.5,202.5,-220,202.5,147.5,157.5,-165,157.5,202.5,-215,225,225,585,SBD,Wraps,M,Juniors 20-23,Yes
DQ,Nick Isla,OH,90,88.5,,28,207.5,-220,-220,207.5,-140,-140,-140,,,,,,,SBD,Wraps,M,Open,Yes
1,Gavin Smith #1,OH,100,99.1,,20,187.5,202.5,-220,202.5,147.5,157.5,-165,157.5,202.5,-215,225,225,585,SBD,Wraps,M,Open,Yes
1,Chari Figurski,PA,90+,104.6,,55,,,,,57.5,-62.5,-62.5,57.5,,,,,57.5,B,Raw,F,Masters 55-59,Yes
1,Anthony Mascia,OH,67.5,66.5,,27,,,,,120,-132.5,-132.5,120,,,,,120,B,Raw,M,Open,Yes
1,Mark Lombardo,OH,90,88.6,,28,,,,,135,140,-142.5,140,,,,,140,B,Raw,M,Open,Yes
1,Mark Lombardo,OH,90,88.6,,28,,,,,,,,,210,220,230,230,230,D,Raw,M,Open,Yes
1,Joseph Young,OH,110,104,,46,,,,,,,,,190,205,210,210,210,D,Raw,M,Masters 45-49,Yes
1,Chari Figurski,PA,90+,104.6,,55,,,,,57.5,-62.5,-62.5,57.5,100,110,117.5,117.5,175,BD,Raw,F,Masters 55-59,Yes
