Name,WeightClassKg,Division,AgeRange,Sex,Best3SquatKg,Best3BenchKg,Best3DeadliftKg,TotalKg,Event,Equipment,Place
Pagan,56,17-19,17-19,F,,70.31,,70.31,B,Raw,1
Plamer,60,JR,20-25,F,,56.7,,56.7,B,Raw,1
Beau Greer,67.5,20-25,20-25,M,,149.69,,149.69,B,Raw,1
Beau Greer,67.5,O,,M,,149.69,,149.69,B,Raw,1
Matt Elrod,75,20-25,20-25,M,,172.37,,172.37,B,Raw,1
Matt Elrod,75,20-25,20-25,M,,185.97,,185.97,B,Multi-ply,1
Embler,75,50-59,50-59,M,,106.59,,106.59,B,Raw,1
Jason Pagan,82.5,20-25,20-25,M,,201.85,,201.85,B,Raw,1
Rayner,82.5,20-25,20-25,M,,149.69,,149.69,B,Raw,2
Jason Pagan,82.5,LT,,M,,199.58,,199.58,B,Raw,1
Sean Redfern,82.5,LT,,M,,165.56,,165.56,B,Raw,2
Robinson,82.5,LT,,M,,163.29,,163.29,B,Raw,3
Patrick,82.5,SM,35-39,M,,140.61,,140.61,B,Raw,1
Blackmon,90,17-19,,M,,140.61,,140.61,B,Multi-ply,1
Washington,90,LT,,M,,172.37,,172.37,B,Raw,1
S. Blassingame,90,LT,,M,,147.42,,147.42,B,Raw,2
Davis,90,LT,,M,,170.1,,170.1,B,Multi-ply,2
Greene,90,LT,,M,,145.15,,145.15,B,Multi-ply,3
Jones #3,100,17-19,17-19,M,,133.81,,133.81,B,Raw,1
Perkins,90,O,,M,,188.24,,188.24,B,Multi-ply,1
Mitchell,90,O,,M,,174.63,,174.63,B,Multi-ply,2
Perkins,90,LT,,M,,188.24,,188.24,B,Multi-ply,1
Mitchell,90,SM,35-39,M,,174.63,,174.63,B,Multi-ply,1
Nelson,90,SM,35-39,M,,151.95,,151.95,B,Multi-ply,2
Rose,90,O,,M,,151.95,,151.95,B,Raw,1
Mark Wade,90,40-49,40-49,M,,192.78,,192.78,B,Multi-ply,1
Ray,90,40-49,40-49,M,,181.44,,181.44,B,Multi-ply,2
Tony Caterisano,90,40-49,40-49,M,,158.76,,158.76,B,Multi-ply,3
Ray,90,40-49,40-49,M,,151.95,,151.95,B,Multi-ply,4
Jonathan Moore,90,40-49,40-49,M,,145.15,,145.15,B,Raw,1
Johnson,110,O,,M,,149.69,,149.69,B,Raw,1
Gilliam,110,LT,,M,,185.97,,185.97,B,Raw,1
Jones,110,O,,M,,181.44,,181.44,B,Multi-ply,1
Roger Flynn,110,40-49,40-49,M,,167.83,,167.83,B,Raw,1
Davis,110,50-59,50-59,M,,158.76,,158.76,B,Multi-ply,1
Lee,125,O,,M,,242.67,,242.67,B,Multi-ply,1
Lee,125,LT,,M,,242.67,,242.67,B,Multi-ply,1
Gardner,125,LT,,M,,136.08,,136.08,B,Multi-ply,2
Michael Belk,125,LT,,M,,226.8,,226.8,B,Raw,1
Shortt,125,O,,M,,185.97,,185.97,B,Raw,1
Shupe,125,SM,35-39,M,,151.95,,151.95,B,Multi-ply,1
Bob Fultz,125,40-49,40-49,M,,149.69,,149.69,B,Raw,1
Chambers,125,50-59,50-59,M,,226.8,,226.8,B,Multi-ply,1
Walter Ferguson,125+,LT,,M,,163.29,,163.29,B,Raw,1
Walter Ferguson,125+,40-49,40-49,M,,163.29,,163.29,B,Raw,1
Pagan,56,17-19,17-19,F,,,95.25,95.25,D,Raw,1
Beau Greer,67.5,20-25,20-25,M,,,181.44,181.44,D,Raw,1
Embler,75,50-59,50-59,M,,,167.83,167.83,D,Raw,1
Rayner,82.5,20-25,20-25,M,,,219.99,219.99,D,Raw,1
Patrick,82.5,SM,35-39,M,,,174.63,174.63,D,Raw,1
Blackmon,90,17-19,17-19,M,,,213.19,213.19,D,Multi-ply,1
S. Blassingame,90,LT,,M,,,226.8,226.8,D,Raw,1
Davis,90,LT,,M,,,278.96,278.96,D,Multi-ply,1
Welton,90,40-49,40-49,M,,,217.72,217.72,D,Multi-ply,1
Jones #3,100,17-19,17-19,M,,,263.08,263.08,D,Raw,1
Stuart,100,LT,,M,,,265.35,265.35,D,Raw,1
Tony Caterisano,100,40-49,40-49,M,,,199.58,199.58,D,Raw,1
Crain,100,50-59,50-59,M,,,213.19,213.19,D,Raw,1
Johnson,110,O,,M,,,,,D,Raw,DQ
Roger Flynn,110,40-49,40-49,M,,,226.8,226.8,D,Raw,1
Davis,110,50-59,50-59,M,,,272.16,272.16,D,Multi-ply,1
Shortt,125,O,,M,,,,,D,Raw,DQ
James Searcy Sr,125+,LT,,M,,,294.84,294.84,D,Multi-ply,1
Roger Flynn,110,40-49,40-49,M,222.26,,,,S,Wraps,DQ
Harley Alerman,52,14-15,14-15,M,47.63,38.56,74.84,161.03,SBD,Wraps,2
Tyler Brown,52,14-15,14-15,M,97.52,58.97,102.06,258.55,SBD,Wraps,1
Pagan,56,17-19,17-19,F,88.45,70.31,95.25,254.01,SBD,Wraps,1
Calais,56,50-59,50-59,F,99.79,43.09,124.74,267.62,SBD,Multi-ply,1
Calais,56,O,,F,99.79,43.09,124.74,267.62,SBD,Multi-ply,1
Burguess,75,O,,F,136.08,79.38,149.69,365.14,SBD,Wraps,1
Wade,75,14-15,14-15,M,158.76,97.52,158.76,415.04,SBD,Wraps,1
Moore,75,40-49,40-49,M,149.69,99.79,176.9,426.38,SBD,Wraps,1
Steve Yeargin,82.5,40-49,40-49,M,238.14,145.15,240.4,623.69,SBD,Multi-ply,1
Jason Pagan,82.5,40-49,40-49,M,195.04,138.35,215.46,548.85,SBD,Multi-ply,2
Blackmon,90,17-19,17-19,M,215.46,140.61,213.19,569.26,SBD,Multi-ply,1
Johnson,90,20-25,20-25,M,181.44,136.08,199.58,517.1,SBD,Multi-ply,1
David #2,90,LT,,M,238.14,170.1,278.96,687.19,SBD,Multi-ply,1
Johnson,90,LT,,M,181.44,136.08,199.58,517.1,SBD,Multi-ply,2
Greydon,90,LT,,M,158.76,120.2,204.12,483.08,SBD,Multi-ply,3
Greydon,90,40-49,40-49,M,158.76,120.2,204.12,483.08,SBD,Multi-ply,1
Langenfeld,90,40-49,40-49,M,140.61,111.13,151.95,403.7,SBD,Multi-ply,2
Mark Wade,90,O,,M,272.16,192.78,244.94,709.87,SBD,Multi-ply,1
Rose,100,O,,M,238.14,151.95,210.92,601.01,SBD,Wraps,1
Jones,110,O,,M,217.72,181.44,226.8,625.96,SBD,Multi-ply,1
Lewis,110,O,,M,190.51,138.35,272.16,601.01,SBD,Wraps,1
Roger Flynn,110,40-49,40-49,M,222.26,167.83,226.8,616.89,SBD,Wraps,1
Davis,110,50-59,50-59,M,199.58,158.76,272.16,630.49,SBD,Multi-ply,1
Cornell Raynor,125,O,,M,276.69,219.99,281.23,777.91,SBD,Wraps,1
Modica,125,O,,M,283.5,,,,SBD,Multi-ply,DQ
Pagan,56,17-19,17-19,F,,70.31,95.25,165.56,BD,Raw,1
Beau Greer,67.5,20-25,20-25,M,,149.69,181.44,331.12,BD,Raw,1
Embler,75,50-59,50-59,M,,106.59,167.83,274.42,BD,Raw,1
Jason Pagan,82.5,40-49,40-49,M,,138.35,215.46,353.8,BD,Multi-ply,1
Patrick,82.5,SM,35-39,M,,140.61,174.63,315.25,BD,Raw,1
Gardner,90,SM,35-39,M,,151.95,219.99,371.95,BD,Multi-ply,1
Greene,90,40-49,40-49,M,,145.15,240.4,385.55,BD,Multi-ply,1
Blassingame,90,LT,,M,,147.42,226.8,374.21,BD,Raw,1
Blackmon,90,17-19,17-19,M,,140.61,213.19,353.8,BD,Multi-ply,1
Jones #3,100,17-19,17-19,M,,133.81,263.08,396.89,BD,Raw,1
Tony Caterisano,100,40-49,40-49,M,,158.76,199.58,358.34,BD,Multi-ply,1
Crain,100,50-59,50-59,M,,149.69,213.19,362.87,BD,Multi-ply,1
Johnson,110,O,,M,,149.69,,,BD,Raw,DQ
Cornell Raynor,125,O,,M,,219.99,281.23,501.22,BD,Raw,1
Shortt,125,O,,M,,185.97,,,BD,Raw,DQ
Gardner,125,LT,,M,,136.08,176.9,312.98,BD,Multi-ply,1
