<svg xmlns="http://www.w3.org/2000/svg" width="29" height="32" viewBox="0 0 29 32">
  <g id="Icon_feather-shopping-bag" data-name="Icon feather-shopping-bag" transform="translate(1 1)">
    <path id="Path_19" data-name="Path 19" d="M9,3,4.5,9V30a3,3,0,0,0,3,3h21a3,3,0,0,0,3-3V9L27,3Z" transform="translate(-4.5 -3)" fill="none" stroke="#fff" stroke-linecap="round" stroke-linejoin="round" stroke-width="2"/>
    <path id="Path_20" data-name="Path 20" d="M4.5,9h27" transform="translate(-4.5 -3)" fill="none" stroke="#fff" stroke-linecap="round" stroke-linejoin="round" stroke-width="2"/>
    <path id="Path_21" data-name="Path 21" d="M24,15a6,6,0,0,1-12,0" transform="translate(-4.5 -3)" fill="none" stroke="#fff" stroke-linecap="round" stroke-linejoin="round" stroke-width="2"/>
  </g>
</svg>
