<?xml version="1.0" encoding="utf-8"?>
<!-- Generator: Adobe Illustrator 24.0.0, SVG Export Plug-In . SVG Version: 6.00 Build 0)  -->
<svg version="1.1" id="Layer_1" xmlns="http://www.w3.org/2000/svg" xmlns:xlink="http://www.w3.org/1999/xlink" x="0px" y="0px"
	 viewBox="0 0 185 85" enable-background="new 0 0 185 85" xml:space="preserve">
<g>
	<path fill="#FFFFFF" d="M42.8,31.9c-2.1,0-4.2,0.4-6.3,1.2c-0.5,0.2-0.8,0.2-0.9,0.2c0,0,0.5-1,1.5-2.8c3.2-5.4,5.4-10.4,6.7-14.9
		c0.5-1.6,0.8-3.3,0.8-5c0-1.8-0.1-2.9-0.4-3.6c-0.6-1.6-1.6-2.6-2.8-3.1c-1.3-0.5-2.7-0.4-4.2,0.3c-1.8,1-3.8,2.7-6,5.1
		c-2.2,2.5-4.2,5.4-6.1,8.8c-3,5.1-5.6,11.8-7.9,20c-0.4,1.5-0.7,2.3-0.7,2.4c0,0.1,0-0.4,0.1-1.6c0.4-5,1.5-11.9,3.2-20.7
		c0.7-3.3,1.1-5.3,1.1-6.3c0-0.9-0.2-1.6-0.6-2c-0.8-0.8-1.7-0.8-2.8,0c-2,1.5-3.9,7.5-5.7,17.9c-0.8,4.7-1.3,9.6-1.6,14.8L10,46.2
		l-0.7,0.5c-0.7,0.5-1.6,1.4-2.8,2.8s-2,2.3-2.4,3C0.7,58.1,0,63.6,2,69.2c1.1,3.3,3.1,6.1,5.9,8.3c2.8,2.2,6,3.5,9.6,3.8
		C21.8,81.8,26,81,30,78.9c1.8-0.9,4-2.3,6.3-4.4c4.6-3.8,8.3-8.5,11.3-14.2c3-5.7,4.6-11.1,4.9-16.3c0.1-3.2-0.3-5.6-1.2-7.2
		C49.6,33.5,46.7,31.9,42.8,31.9z M46.7,49c-1.1,2.6-2.3,5.3-3.7,7.9c-2.5,4.6-5.7,8.5-9.4,11.9c-3.7,3.4-7.5,5.7-11.3,7.1
		c-1.2,0.4-2.7,0.7-4.5,0.8c-2.6,0-4.8-0.5-6.7-1.5c-2.7-1.5-4.7-3.7-5.9-6.7c-0.7-1.8-1-3.9-0.9-6.2c0.2-2.8,1-5.4,2.4-7.9
		c0.4-0.8,1-1.6,1.7-2.5C9,51,9.4,50.6,9.6,50.6c0.2,0,0.3,2.1,0.3,6.2c0,5.4,0.3,8.7,1.1,9.8c0.7,1,1.5,1.5,2.4,1.5
		c0.9,0,1.5-0.5,1.8-1.5c0.3-0.4,0.5-1.7,0.7-3.7c0.5-4.8,1.4-10.1,2.5-15.9l0.3-1.2l1.1-0.3c0.8-0.2,2.4-0.3,4.9-0.4
		c3.7,0,5.7-0.2,6.1-0.5c0.1-0.2,0.1-0.3,0.1-0.5c0-1.1-1.4-1.8-4.4-2.1c-0.9-0.1-2.1-0.1-3.7,0c-1.6,0.1-2.6,0.2-3,0.4h-0.1
		c-0.1,0,0.1-1.2,0.7-3.7c0.1-0.4,0.2-0.7,0.3-0.9c1-3.9,2.1-7.3,3.3-10.4c1.9-5.1,4.3-9.6,7.2-13.4C33.8,9.9,36.1,8,38,7.9h0.9v1.1
		c0.2,2.3-0.8,5.8-2.9,10.7c-1.2,2.7-3,6.1-5.4,10c-1.9,3.2-3.1,5.4-3.4,6.7c-0.4,1.3-0.1,2.4,0.7,3.2c0.5,0.5,1,0.8,1.5,0.7
		c0.5,0,1.4-0.5,2.7-1.3c2.7-1.6,5.4-2.7,8-3.4c3.9-0.9,6.4-0.1,7.6,2.4c0.3,0.7,0.5,1.8,0.5,3.2C48.2,43.6,47.7,46.3,46.7,49z"/>
	<path fill="#FFFFFF" d="M183.3,43.3c-0.4,0-0.9,0.3-1.4,0.9c-0.5,0.6-1.1,1.5-1.8,2.7c-3,5.4-5.8,8.4-8.4,8.8
		c-0.4,0.1-0.8,0-1.3-0.3c-0.5-0.3-0.8-0.6-1-0.9c-0.4-1.1-0.5-2.5-0.1-4.4l0.3-1.4l1.3-0.5c1.8-0.7,3.4-1.7,4.6-2.9
		c0.8-0.9,1.3-1.7,1.4-2.5c0.6-2,0.3-3.7-0.8-5c-0.7-0.7-1.6-1.1-2.8-1.3c-1.1-0.1-2.2,0-3.2,0.5c-1.4,0.7-2.7,2-4,4
		c-1.2,2-2.2,4.2-2.8,6.7c0,0.2,0,0.3-0.1,0.5c-0.9,1.1-2,2.6-3.4,4.6c-0.7,1.1-1.4,2.1-2.1,3c-0.7,1-1.3,1.7-1.8,2.2
		c-0.5,0.5-0.8,0.7-0.9,0.7c-0.1-0.1,0-0.6,0.1-1.5c0.2-0.9,0.3-2.1,0.4-3.6c0.1-1.5,0.3-3.2,0.5-5.1c0.3-3.4,0.3-6,0.1-7.6
		c-0.2-1.7-0.8-2.9-1.8-3.7c-1.3-1.2-2.6-1.2-3.8,0c-0.5,0.5-1.3,2.3-2.4,5.2c-1.1,2.9-2,5.7-2.6,8.2c-0.4,1.5-0.6,2.3-0.7,2.4
		c-0.3-2.5-0.1-7,0.5-13.4c0.3-1.9,0.6-3.1,1-3.4c0.4-0.3,1.4-1.2,3-2.6c4.7-3.9,8.6-8,11.6-12.5c2.4-3.6,3.7-6.9,4-9.8
		c0.3-2.9-0.5-4.9-2.6-6c-1.8-1-3.9-0.9-6.5,0.3c-6.9,3.3-11.9,10.9-14.8,22.5c-1.5,6.5-2.4,13-2.5,19.7c-0.5,0.5-1,1.1-1.6,1.8
		c-1.4,1.8-2.5,3-3.4,3.8c-0.8,0.7-1.8,1.3-3,1.8c-1.1,0.4-1.9,0.1-2.5-0.9c-0.4-0.5-0.5-1.6-0.5-3.2c0-1.6,0.2-3,0.6-4.4
		c0.7-2.6,1.5-4.7,2.5-6.2c1.1-1.6,1.9-2.4,2.2-2.4c0.3,0,0.5,0.7,0.8,2c0.3,1.8,0,3.5-0.8,5.1c-0.4,0.8-0.6,1.3-0.5,1.6
		c0.1,0.3,0.3,0.4,0.7,0.5c0.3,0,0.6-0.1,0.8-0.3c0.3-0.3,0.8-1.7,1.4-4.2c0.6-2.4,0.9-4.2,0.9-5.2c0-1.4-0.4-2.5-1.1-3.4
		c-1-1.3-2.4-1.8-4.2-1.3c-2.1,0.4-4.1,2.3-5.9,5.7c-1.2,2.2-2.2,4.8-2.8,7.9c0,0.2-0.1,0.3-0.1,0.5c-0.1,0.2-0.2,0.5-0.4,0.7
		c-1.3,2.6-2.6,4.7-3.9,6.4c-1.3,1.7-2.4,2.9-3.4,3.5c-1,0.6-1.7,0.6-2.2,0c-0.3-0.3-0.3-1.6-0.1-4c0.2-2.4,0.5-5,0.9-7.8
		c0.9-5.3,1-8.6,0.4-9.9c-0.4-0.8-1-1.3-1.7-1.6c-0.7-0.3-1.4-0.2-2,0.1c-0.7,0.5-2.4,3.1-5,7.8c-1.2,2.3-2.1,3.7-2.5,4.3l-0.7,0.9
		l0.1-1.3c0.1-0.9,0.2-1.9,0.4-3.2c0.3-2.9-0.4-4.3-2-4.3c-0.9,0-1.6,0.5-2.1,1.6c-0.3,0.5-0.6,2-1,4.3c-0.3,1.9-0.5,3.4-0.6,4.6
		c-1.5,3.5-3.1,6.2-4.6,8.1c-0.4,0.4-0.8,0.8-1.3,1.2c-0.5,0.4-0.8,0.5-0.9,0.4c-0.3-0.3-0.5-1.6-0.6-4.2c-0.1-2.5-0.1-4.5,0.1-5.9
		c0.2-1.2,0.5-3,0.9-5.4c0.7-3.3,0.7-5.4,0.1-6.3c-0.4-0.8-1-1.2-1.8-1.1c-0.9,0-1.6,0.4-2.1,1.1l-0.5,0.7l-0.5-0.5
		c-1.4-1.4-3.1-1.8-5.1-1.3c-3.3,0.8-5.9,3.5-8,8c-0.5,1-0.9,2-1.2,3c-0.9,1.6-1.8,4.4-2.9,8.3c-1.3,4.7-2.7,8-4.2,10
		c-1.1,1.3-1.9,2-2.5,2.1c-0.8,0-1.3-2.9-1.6-8.6c-0.3-5.8-0.2-10.9,0.3-15.4l0.3-1.4l2.1-2.2c3.8-3.9,6.7-7.6,8.8-11.2
		c1.8-3.2,3.1-6.9,3.8-10.8c0.7-4,0.5-6.9-0.5-8.8c-1-1.8-2.4-2.5-4.4-2.4c-3.3,0.4-6.2,3.3-9,8.6c-2.7,5.3-4.8,12.2-6.2,20.7
		c-1,5.8-1.4,11.6-1.4,17.4v6.9c0.3,5.6,2.1,8.9,5.1,9.9l1.1,0.3c0.7,0.1,1.7-0.3,3-1.1c1.3-0.8,2.5-2.1,3.7-4
		c0.2-0.4,0.4-0.8,0.5-1.1c0.2-0.3,0.4-0.7,0.6-1.3c0.2-0.5,0.4-1,0.5-1.5c0.1-0.5,0.4-1.3,0.8-2.5c0.4-1.2,0.8-2.3,1.3-3.5
		c0,0,0-0.1,0-0.1c0,0,0,0.1,0,0.2c0.2,0.7,0.7,1.5,1.5,2.3c1.1,1.1,2.3,1.5,3.8,1.5c1.8-0.3,3.9-2.1,6.2-5.4l1.2-1.7l0.1,2.4
		c0.3,4,1.7,6.4,4.2,7.2c0.4,0.2,0.8,0.3,1.2,0.3c1.7,0.1,3.4-1,5.1-3.3c0.9-1.1,2-3.2,3.3-6.2c0.1,0.3,0.2,0.6,0.4,0.8
		c0.5,0.9,1.2,1.3,2.1,1.3c0.7,0,1.3-0.4,1.9-1.3c0.6-0.8,1.7-2.9,3.4-6.1c2-4,3.1-6.1,3.3-6.3l-0.3,1.8c-1.6,6.2-1.9,10.6-0.9,13.2
		c0.7,2.3,1.8,3.8,3.3,4.6c0.4,0.2,1,0.3,2,0.3c1.1-0.1,2.4-0.7,3.8-2c1.4-1.3,3.3-3.9,5.7-7.6c0-0.1,0.1-0.1,0.1-0.2
		c-0.1,1.2,0,2.3,0.1,3.2c0.5,3.2,1.9,5.1,4.2,5.8c1.2,0.4,2.7,0.2,4.5-0.7c1.7-0.9,3.4-2.5,5.1-5c1.2-1.6,2.2-2.9,3-3.9
		c0,0.9,0,1.8,0,2.7c0.2,4.9,0.5,8.4,0.9,10.3c0.4,2,1,3.2,1.9,3.6c0.8,0.4,1.6,0.5,2.4,0.1c0.8-0.4,1.3-1.9,1.5-4.4
		c0.2-2.7,0.7-5.9,1.4-9.5c1.1-5.2,2.2-8.7,3.3-10.5l0.1-0.1l0.1,1.4c0,1.2,0,2.4-0.1,3.6c-0.4,3.9-0.6,6.6-0.5,8.1
		c0.1,1.5,0.4,2.8,1.1,3.9c1,1.6,1.9,2.5,2.8,2.7c0.9,0.2,1.8-0.2,2.9-1.4c1.1-1.1,2.7-3.5,4.9-7.4c0.5-0.8,1-1.6,1.6-2.3
		c-0.2,2,0,3.8,0.5,5.3c0.4,1.4,1.1,2.5,1.8,3.3c0.8,0.8,1.7,1.3,2.8,1.6c0.6,0.1,1.1,0.1,1.3,0c0.6-0.1,1.4-0.4,2.2-0.9
		c0.9-0.5,1.5-0.9,2-1.4c1.8-1.8,4.5-5.6,7.9-11.6c0.6-1,1.1-1.7,1.6-2.1C184.3,44,184.4,43.5,183.3,43.3z M170.8,45
		c0.1-0.2,0.2-0.4,0.4-0.7c1.1-1.8,2.2-2.6,3-2.6c0.3-0.1,0.3,0.2,0,0.9c-0.4,0.9-1.1,1.6-2.1,2.2c-0.4,0.3-0.8,0.4-1.2,0.5
		c-0.2,0.1-0.3,0.1-0.3,0.1C170.6,45.5,170.6,45.3,170.8,45z M148.5,24.2c1.9-6.9,4.5-11.9,7.6-15c1.6-1.6,3.1-2.4,4.4-2.6
		c1.4-0.1,2.3,0.4,2.9,1.4c0.6,1.1,0.6,2.6,0.1,4.4c-0.6,2.6-2,5.4-4.1,8.3c-2.1,3-5.4,6.3-9.8,9.9c-0.8,0.6-1.4,1.1-1.7,1.4
		c-0.4,0.3-0.7,0.5-0.9,0.7c-0.3,0.2-0.4,0.3-0.5,0.3C146.6,31.7,147.2,28.8,148.5,24.2z M61,37.5c0.2-1.6,0.7-4.3,1.5-8.2
		c0.8-3.9,1.6-7,2.3-9.3c1.1-3.8,2.2-6.5,3.3-8.2c0.4-0.7,1-1.4,1.7-2c1.8-1.6,3.1-1.5,4,0.3c0.3,0.7,0.4,2,0.4,4
		c0,1.9-0.1,3.3-0.3,4.2c-0.8,2.9-1.9,5.6-3.4,8.1c-1.5,2.5-3.6,5.5-6.5,9c-1.2,1.5-2.1,2.4-2.5,2.8l-0.7,0.7L61,37.5z M84,44.1
		c-0.4,1.5-0.7,2.5-1,3c-0.7,1.3-1.6,2.7-2.8,4c-1.1,1.4-2,2.2-2.6,2.6C77.3,53.9,77,54,76.8,54c-0.3,0-0.4-0.3-0.5-0.9
		c-0.1-0.6-0.1-1.4,0.1-2.4c0.1-1,0.3-1.8,0.6-2.6c0.5-1.6,1.3-3.1,2.2-4.5c1-1.4,1.8-2.2,2.6-2.4c0.3-0.1,0.8-0.1,1.4,0
		c0.6,0.1,1,0.2,1.1,0.3C84.5,41.7,84.4,42.6,84,44.1z"/>
</g>
</svg>
