<?xml version="1.0" encoding="utf-8"?>
<!-- Generator: Adobe Illustrator 24.0.0, SVG Export Plug-In . SVG Version: 6.00 Build 0)  -->
<svg version="1.1" id="Layer_1" xmlns="http://www.w3.org/2000/svg" xmlns:xlink="http://www.w3.org/1999/xlink" x="0px" y="0px"
	 viewBox="0 0 185 85" style="enable-background:new 0 0 185 85;" xml:space="preserve">
<style type="text/css">
	.st0{fill:#FFFFFF;}
</style>
<path class="st0" d="M39.2,80.3c-0.6,0-1.1-0.2-1.5-0.6c-0.4-0.4-0.6-1-0.7-2.1c0-1,0.1-2.9,0.3-5.7c1.4-12.6,2-22.9,1.8-31.4
	c-0.5-8.9-1-14.9-1.7-19.5c-0.4-2.8-0.3-4.4,0.2-5.1C38,15.3,38.4,15,39,15c0.3,0,0.6,0.1,1,0.2c1.1,0.5,1.8,1.3,2.2,2.7
	c1.1,3.6,1.8,10.2,2.1,19.8c0.2,3.8,0.3,3.8,0.7,3.8c0.4,0,0.5-0.3,1.1-1.9c2.4-6.5,4.7-11.6,6.9-15.1c4.1-6.5,7.9-9.8,11.1-9.8
	l0.1,0c2.9,0,5,2,6.2,5.9c0.5,2.3,0.8,4.7,0.8,7.4c0.1,6.8-1.6,13.7-5,20.5c-1.4,2.9-3.1,5.1-5,7c-1.8,1.6-3.7,2.5-5.6,2.5
	c-1.5,0-2.9-0.5-3.9-1.6c-1.4-1.2-2.2-2.7-2.5-4.6c-0.6-3.9,0.2-7.7,2.4-11.4c0.7-1.2,1.3-2,1.6-2.4c0.4-0.3,1-0.8,1.9-1.3
	c0.3-0.1,1.2-0.5,1.5-0.5c0,0,0,0.2-0.1,0.6c-0.2,0.5-0.4,1-0.5,1.6c-0.1,0.3-0.3,1.1-1.3,2.7c-1.5,2.6-2.3,5.1-2.3,7.4
	c0,3.8,1.5,4.4,2.4,4.4c1.3,0,2.6-0.7,3.9-2.1c1.4-1.6,2.7-3.9,4-6.8c1.2-2.7,2.2-5.8,2.8-9c0.3-2,0.5-4.3,0.5-6.8
	c0-2.6-0.2-4.6-0.5-5.8c-0.8-2.2-1.4-3.4-1.9-4c-0.4-0.4-0.8-0.6-1.4-0.6c-1.1,0-2.5,0.8-4.3,2.6c-1.9,1.8-3.8,4.6-5.7,8.3
	c-1.9,3.9-3.4,7.9-4.5,12.2c-2,7.4-3.2,13.2-3.6,17.9C43.1,70,42.4,76,41.7,77.9c-0.3,0.7-0.6,1.2-1,1.6
	C40.3,80,39.7,80.3,39.2,80.3z M107.1,66.4c-0.4,0-0.7-0.1-1.1-0.3c-0.8-0.4-1.3-1.4-1.7-3.3c-0.4-2-0.7-5.4-0.9-10.2l0-3.8
	l-0.7,0.9c-0.8,1-1.8,2.3-3,3.9c-1.7,2.3-3.4,4-5,4.9c-1.1,0.6-2.1,0.8-3,0.8c-0.4,0-0.8-0.1-1.1-0.2c-2.2-0.7-3.5-2.5-3.9-5.5
	c-0.1-0.8-0.2-1.7-0.2-2.7v-1.4l-0.7,1.2c-2.2,3.6-4.1,6.3-5.5,7.7c-0.4,0.4-1.1,0.9-1.9,1.3c-0.9,0.5-1.5,0.8-2.1,0.9
	c-0.2,0.1-0.3,0.1-0.5,0.1c-0.2,0-0.4,0-0.7-0.1c-1-0.3-1.8-0.8-2.6-1.5c-0.7-0.7-1.3-1.8-1.7-3.1c-0.8-2.1-0.8-4.8-0.1-8.1
	c0.6-2.5,1.5-4.6,2.7-6.6c1.2-1.9,2.4-3.2,3.8-3.9c0.8-0.3,1.6-0.5,2.4-0.5c0.2,0,0.4,0,0.6,0c1.1,0.1,2,0.5,2.5,1.2
	c1,1.2,1.3,2.8,0.7,4.6c-0.2,0.7-0.6,1.4-1.3,2.4c-1.1,1.1-2.7,2.1-4.4,2.8l-1.5,0.6l-0.3,1.6c-0.4,1.7-0.3,3.3,0.1,4.6
	c0.3,0.6,0.7,0.9,1.2,1.1c0.4,0.2,0.8,0.4,1.1,0.4c0.1,0,0.3,0,0.4,0c2.6-0.4,5.5-3.4,8.4-8.5l0,0l0-0.1c0.1-0.2,0.1-0.5,0.1-0.7
	c0-0.2,0-0.4,0.1-0.6c0.7-3.1,1.6-5.7,2.8-7.8c1.7-3.2,3.6-5,5.6-5.5c0.4-0.1,0.8-0.1,1.2-0.1c1.1,0,2,0.4,2.6,1.3
	c0.7,0.9,1,1.9,1,3.2c0,1-0.3,2.7-0.9,5.1c-0.5,1.8-0.9,3.7-1.3,4c-0.2,0.2-0.2,0.2-0.3,0.2c0,0-0.1,0-0.2,0c-0.3,0-0.4-0.1-0.4-0.2
	c-0.1-0.2,0.3-1,0.5-1.3c0.9-1.8,1.1-3.6,0.8-5.3c-0.4-1.5-0.6-2.3-1.2-2.3c-0.5,0-1.1,0.4-2.5,2.6c-1,1.4-1.8,3.5-2.6,6.3
	c-0.4,1.4-0.5,2.9-0.6,4.5c0,1.6,0.1,2.7,0.6,3.4c0.5,0.9,1.1,1.3,1.9,1.3c0.3,0,0.7-0.1,1.1-0.3c1.1-0.4,2.2-1,3.1-1.9
	c0.9-0.8,2.2-2.2,3.4-3.9l0.3-0.3c0.5-0.6,0.9-1.1,1.3-1.5l0.1-0.1l0-0.2c0.1-6.3,0.9-12.8,2.5-19.6c2.9-11.5,7.8-19,14.6-22.2
	c1.3-0.6,2.5-0.9,3.7-0.9c0.9,0,1.7,0.2,2.5,0.6c1.9,1,2.7,2.9,2.4,5.6c-0.3,2.9-1.6,6.2-3.9,9.6c-3,4.5-6.8,8.6-11.5,12.4l-1.2,1.1
	c-0.9,0.8-1.5,1.3-1.8,1.5c-0.5,0.5-0.8,1.5-1.2,3.7c-0.6,6.8-0.8,11.1-0.5,13.5l0.1,0.8l0.6-0.6c0.2-0.2,0.2-0.4,0.6-2l0.2-0.6
	c0.6-2.4,1.5-5.2,2.6-8.2c0.4-1.1,1.7-4.4,2.3-5.1c0.5-0.5,1-0.8,1.6-0.8c0.5,0,1.1,0.3,1.7,0.8c0.9,0.8,1.5,1.9,1.7,3.5
	c0.2,1.8,0.2,4.3-0.1,7.5c-0.3,1.8-0.4,3.4-0.5,4.8l0,0.3c-0.1,1.6-0.2,2.7-0.4,3.5c-0.3,1.5-0.1,1.8,0,1.9l0.1,0.1l0.2,0
	c0.2,0,0.5-0.1,1.1-0.9c0.4-0.4,0.9-1.1,1.5-1.8l0.3-0.4l2.1-3l0.7-1c1.1-1.4,1.9-2.6,2.7-3.6l0.1-0.1v-0.1c0-0.2,0-0.2,0.1-0.3
	c0.6-2.6,1.5-4.7,2.8-6.7c1.2-1.9,2.4-3.2,3.8-3.9c0.8-0.3,1.6-0.5,2.4-0.5c0.2,0,0.4,0,0.6,0c1.1,0.1,2,0.5,2.5,1.2
	c1,1.2,1.3,2.8,0.7,4.6c-0.2,0.7-0.6,1.4-1.3,2.4c-1.1,1.1-2.7,2.1-4.4,2.8l-1.5,0.6l-0.3,1.6c-0.4,1.7-0.3,3.3,0.1,4.6
	c0.3,0.6,0.7,0.9,1.2,1.1c0.4,0.2,0.8,0.4,1.1,0.4c0.1,0,0.3,0,0.4,0c2.7-0.4,5.5-3.4,8.7-9c0.7-1.2,1.3-2.1,1.8-2.6
	c0.4-0.5,0.7-0.7,0.9-0.7c0.1,0.1,0.1,0.2,0.1,0.2c0,0.1-0.1,0.4-0.9,1c-0.4,0.4-1,1.1-1.7,2.2c-3.1,5.5-5.9,9.6-7.8,11.5
	c-0.4,0.4-1.1,0.9-1.9,1.3c-0.9,0.5-1.5,0.8-2.1,0.9c-0.2,0.1-0.3,0.1-0.5,0.1c-0.2,0-0.4,0-0.7-0.1c-1-0.3-1.8-0.8-2.6-1.5
	c-0.7-0.7-1.3-1.8-1.7-3.1c-0.5-1.5-0.7-3.3-0.5-5.1l0.1-1.5l-1.2,1.7c-0.4,0.6-0.9,1.2-1.3,1.9c-2.1,3.8-3.8,6.3-4.8,7.3
	c-0.9,0.9-1.6,1.3-2.2,1.3c-0.1,0-0.2,0-0.3,0c-0.8-0.2-1.6-1-2.5-2.5c-0.6-1.2-1-2.3-1-3.7c-0.1-1.3,0.1-3.7,0.5-8
	c0.1-1.1,0.1-2.3,0.1-3.6l-0.2-2.3l-0.7,0.7c-1.2,1.9-2.3,5.4-3.4,10.7c-0.9,3.8-1.3,7-1.4,9.6c-0.2,2.9-0.8,3.8-1.3,4.1
	C107.7,66.4,107.4,66.4,107.1,66.4z M138.3,41.4c-1,0-2.1,0.9-3.3,2.8c-0.2,0.3-0.3,0.5-0.4,0.7c0,0.1-0.1,0.1-0.1,0.2
	c-0.1,0.1-0.2,0.2-0.2,0.4v0.4h0.4c0.1,0,0.3,0,0.5-0.1c0.2-0.1,0.4-0.1,0.6-0.2c0.2-0.1,0.4-0.2,0.6-0.2c1.2-0.6,2-1.5,2.3-2.4
	c0.3-0.6,0.3-1,0.2-1.2c-0.1-0.1-0.3-0.2-0.4-0.2L138.3,41.4L138.3,41.4z M77.3,44.8C77.1,45,77,45.1,77,45.4v0.2l0.2,0.2l0.1,0.1
	h0.2c0.1,0,0.3,0,0.5-0.1c0.2-0.1,0.4-0.1,0.6-0.2c0.2-0.1,0.4-0.2,0.6-0.2c1.2-0.6,2-1.5,2.3-2.4c0.3-0.6,0.3-1,0.2-1.2
	c-0.1-0.1-0.3-0.2-0.4-0.2H81l-0.1,0c-1,0-2.1,0.9-3.3,2.8C77.5,44.4,77.4,44.6,77.3,44.8z M125.4,6.1c-0.2,0-0.4,0-0.6,0
	c-1.4,0.1-2.9,0.9-4.6,2.7c-3.2,3.1-5.8,8.1-7.7,15.2c-1.3,4.3-2,7.4-2,8.9v0.4h0.4c0.2,0,0.5-0.2,0.8-0.4c0.3-0.2,0.6-0.4,0.9-0.7
	c0.3-0.3,0.9-0.8,1.7-1.4c4.3-3.5,7.6-6.8,9.9-10c2.2-3,3.6-5.8,4.2-8.4c0.5-1.9,0.5-3.5-0.1-4.7C127.4,6.7,126.6,6.1,125.4,6.1z
	 M87.8,30.8c-0.5,0-1-0.2-1.4-0.7c-0.6-0.6-1.1-1.1-1.4-1.6c-0.4-0.5-0.8-1.1-1.2-1.7c-0.6-0.7-0.9-1-1.2-1c-0.2,0-0.5,0.1-1.4,0.7
	c-0.6,0.4-1.2,0.8-1.9,1.2c-0.4,0.2-0.7,0.4-1,0.6c-0.3,0.2-0.6,0.4-1,0.6c-0.7,0.4-1.1,0.5-1.4,0.5c-0.3,0-0.4-0.1-0.6-0.2
	c0,0-0.1,0-0.1-0.1c-0.1,0-0.1-0.1-0.2-0.2c0,0,0-0.1,0-0.2l0-0.1v-0.1c0-0.1,0.1-0.4,0.5-0.7l1.5-1.5c0.4-0.4,0.8-0.7,1.2-1.1
	c0.2-0.2,0.5-0.4,0.8-0.6c0.7-0.6,1.4-1.1,2.1-1.6c0.6-0.4,1.2-0.9,1.9-1.2c0.5-0.3,0.9-0.5,1.1-0.5c0.1,0,0.3,0.1,0.7,0.5
	c0.5,0.5,0.9,1,1.3,1.8c0.4,0.7,0.8,1.5,1.2,2.4c0.4,0.8,0.7,1.6,0.9,2.3c0.2,0.7,0.3,1.3,0.2,1.7C88,30.8,87.9,30.8,87.8,30.8z"/>
</svg>
