<svg xmlns="http://www.w3.org/2000/svg" width="17.5" height="31" viewBox="0 0 17.5 31">
  <path id="Icon_feather-facebook" data-name="Icon feather-facebook" d="M27,3H22.5A7.5,7.5,0,0,0,15,10.5V15H10.5v6H15V33h6V21h4.5L27,15H21V10.5A1.5,1.5,0,0,1,22.5,9H27Z" transform="translate(-10 -2.5)" fill="none" stroke="#0F1665" stroke-linecap="round" stroke-linejoin="round" stroke-width="1"/>
</svg>
