<?xml version="1.0" encoding="utf-8"?>
<!-- Generator: Adobe Illustrator 24.0.0, SVG Export Plug-In . SVG Version: 6.00 Build 0)  -->
<svg version="1.1" id="Layer_1" xmlns="http://www.w3.org/2000/svg" xmlns:xlink="http://www.w3.org/1999/xlink" x="0px" y="0px"
	 viewBox="0 0 185 85" enable-background="new 0 0 185 85" xml:space="preserve">
<path fill="#FFFFFF" d="M71.6,28.1c0.1,7-1.6,13.9-5,20.7c-1.5,3-3.2,5.3-5.1,7.1c-1.9,1.7-3.9,2.6-5.9,2.6c-1.7,0-3.1-0.6-4.2-1.7
	C50,55.6,49.1,54,48.8,52c-0.6-4,0.2-7.9,2.4-11.7c0.7-1.2,1.3-2,1.6-2.4c0.4-0.4,1.1-0.9,2-1.4c1.1-0.5,1.7-0.7,1.9-0.5
	c0.2,0.2,0.2,0.6,0,1.1c-0.2,0.5-0.4,1-0.5,1.5c-0.1,0.5-0.5,1.4-1.3,2.8c-1.5,2.6-2.2,5.1-2.2,7.2c0,2.6,0.7,4,2,4
	c1.2,0,2.4-0.7,3.6-2c1.3-1.5,2.6-3.7,3.9-6.7c1.3-2.9,2.2-5.9,2.8-8.9c0.3-1.8,0.5-4,0.5-6.7c0-2.7-0.2-4.6-0.5-5.7
	c-0.7-2-1.3-3.3-1.8-3.8c-1-1-2.7-0.3-5.1,2c-1.8,1.7-3.7,4.4-5.6,8.2c-1.9,3.8-3.4,7.8-4.5,12.1c-2,7.3-3.2,13.2-3.6,17.8
	c-0.8,10.8-1.5,17.2-2.2,19.2c-0.3,0.7-0.6,1.3-1.1,1.8c-0.5,0.5-1.1,0.8-1.8,0.8c-0.7,0-1.3-0.2-1.8-0.7c-0.5-0.5-0.7-1.3-0.8-2.3
	c0-1.1,0.1-3,0.3-5.8C38.4,59.4,39,49,38.8,40.5c-0.4-7.9-0.9-14.4-1.7-19.4c-0.4-2.7-0.4-4.5,0.3-5.4c0.7-1.1,1.6-1.3,2.8-0.8
	c1.2,0.5,2,1.5,2.4,3c1.1,3.6,1.8,10.2,2.1,19.9c0.1,2.3,0.2,3.4,0.3,3.4c0.1,0,0.3-0.5,0.7-1.6c2.4-6.5,4.7-11.6,6.9-15.2
	c4.3-6.8,8.2-10.1,11.6-10c3.1,0,5.3,2.1,6.6,6.2C71.3,22.8,71.6,25.2,71.6,28.1z M147.5,44.9c-0.4,0.4-1,1.1-1.6,2.1
	c-3.4,6-6.1,9.8-7.9,11.6c-0.4,0.4-1.1,0.9-2,1.4c-0.9,0.5-1.6,0.8-2.2,0.9c-0.3,0.1-0.7,0.1-1.3,0c-1.1-0.3-2-0.8-2.8-1.6
	c-0.8-0.8-1.4-1.9-1.8-3.3c-0.5-1.5-0.7-3.3-0.5-5.3c-0.5,0.7-1.1,1.5-1.6,2.3c-2.2,3.9-3.8,6.3-4.9,7.4c-1.1,1.1-2,1.6-2.9,1.4
	c-0.9-0.2-1.8-1.1-2.8-2.7c-0.6-1.1-1-2.3-1.1-3.9c-0.1-1.5,0.1-4.2,0.5-8.1c0.1-1.1,0.1-2.3,0.1-3.6l-0.1-1.4l-0.1,0.1
	c-1.1,1.8-2.2,5.4-3.3,10.5c-0.8,3.6-1.3,6.8-1.4,9.5c-0.2,2.6-0.7,4-1.5,4.4c-0.8,0.4-1.6,0.4-2.4-0.1c-0.9-0.4-1.5-1.6-1.9-3.6
	c-0.4-2-0.7-5.4-0.9-10.3c0-0.9,0-1.8,0-2.7c-0.8,1-1.8,2.3-3,3.9c-1.8,2.5-3.5,4.1-5.1,5c-1.8,0.9-3.3,1.1-4.5,0.7
	c-2.3-0.7-3.7-2.6-4.2-5.8c-0.1-0.8-0.2-1.7-0.2-2.8c-2.3,3.8-4.2,6.4-5.6,7.8c-0.4,0.4-1.1,0.9-2,1.4c-0.9,0.5-1.6,0.8-2.2,0.9
	c-0.3,0.1-0.7,0.1-1.3,0c-1.1-0.3-2-0.8-2.8-1.6c-0.8-0.8-1.4-1.9-1.8-3.3c-0.8-2.2-0.8-5-0.1-8.3c0.6-2.5,1.5-4.7,2.8-6.7
	c1.2-2,2.5-3.3,4-4c1-0.4,2-0.6,3.2-0.5c1.1,0.1,2.1,0.5,2.8,1.3c1.1,1.3,1.4,3,0.8,5c-0.2,0.8-0.7,1.6-1.4,2.5
	c-1.2,1.2-2.8,2.2-4.6,2.9l-1.3,0.5l-0.3,1.4c-0.4,1.8-0.3,3.3,0.1,4.4c0.2,0.4,0.5,0.7,1,0.9c0.5,0.3,0.9,0.4,1.3,0.3
	c2.5-0.4,5.3-3.2,8.1-8.3c0.1-0.4,0.1-0.9,0.2-1.3c0.7-3.1,1.6-5.7,2.8-7.9c1.8-3.3,3.8-5.2,5.9-5.7c1.8-0.4,3.3,0,4.2,1.3
	c0.7,0.9,1.1,2,1.1,3.4c0,1.1-0.3,2.8-0.9,5.2c-0.6,2.4-1,3.8-1.4,4.2c-0.2,0.3-0.4,0.4-0.8,0.3c-0.4,0-0.6-0.2-0.7-0.5
	c-0.1-0.3,0.1-0.8,0.5-1.6c0.8-1.7,1.1-3.4,0.8-5.1c-0.3-1.3-0.5-2-0.8-2c-0.4,0-1.1,0.8-2.2,2.4c-1,1.5-1.8,3.6-2.5,6.2
	c-0.4,1.3-0.5,2.8-0.6,4.4c0,1.6,0.1,2.6,0.5,3.2c0.6,1.1,1.4,1.4,2.5,0.9c1.1-0.4,2.1-1,3-1.8c0.8-0.7,2-2,3.4-3.8
	c0.6-0.7,1.1-1.3,1.6-1.8c0.1-6.7,1-13.2,2.5-19.7c2.9-11.7,7.8-19.2,14.8-22.5c2.5-1.1,4.7-1.2,6.5-0.3c2,1.1,2.9,3.1,2.6,6
	c-0.3,2.9-1.6,6.2-4,9.8c-3,4.5-6.9,8.7-11.6,12.5c-1.6,1.4-2.6,2.3-3,2.6c-0.4,0.4-0.7,1.5-1,3.4c-0.6,6.4-0.8,10.9-0.5,13.4
	c0.1-0.1,0.3-0.9,0.7-2.4c0.6-2.5,1.5-5.3,2.6-8.2c1.1-2.9,1.9-4.7,2.4-5.2c1.2-1.2,2.5-1.2,3.8,0c1,0.8,1.6,2,1.8,3.7
	c0.2,1.7,0.2,4.2-0.1,7.6c-0.3,1.9-0.4,3.6-0.5,5.1c-0.1,1.5-0.2,2.7-0.4,3.6c-0.2,0.9-0.2,1.4-0.1,1.5c0.1,0.1,0.4-0.1,0.9-0.7
	c0.5-0.5,1.1-1.3,1.8-2.2c0.7-1,1.4-2,2.1-3c1.4-1.9,2.5-3.4,3.4-4.6c0-0.2,0-0.3,0.1-0.5c0.6-2.5,1.5-4.7,2.8-6.7
	c1.2-2,2.5-3.3,4-4c1-0.4,2-0.6,3.2-0.5c1.1,0.1,2.1,0.5,2.8,1.3c1.1,1.3,1.4,3,0.8,5c-0.2,0.8-0.7,1.6-1.4,2.5
	c-1.2,1.2-2.8,2.2-4.6,2.9l-1.3,0.5l-0.3,1.4c-0.4,1.8-0.3,3.3,0.1,4.4c0.2,0.4,0.5,0.7,1,0.9c0.5,0.3,0.9,0.4,1.3,0.3
	c2.6-0.4,5.4-3.4,8.4-8.8c0.7-1.2,1.3-2.1,1.8-2.7c0.5-0.6,1-0.9,1.4-0.9C148.7,43.5,148.7,44,147.5,44.9z M134.9,45.5
	c0,0,0.2,0,0.3-0.1c0.3-0.1,0.7-0.3,1.2-0.5c1.1-0.6,1.8-1.4,2.1-2.2c0.3-0.7,0.3-1,0-0.9c-0.9,0-1.9,0.9-3,2.6
	c-0.2,0.3-0.3,0.5-0.4,0.7C135,45.3,134.9,45.4,134.9,45.5z M110.9,33c0.1,0,0.3-0.1,0.5-0.3c0.3-0.2,0.6-0.4,0.9-0.7
	c0.3-0.3,0.9-0.8,1.7-1.4c4.4-3.6,7.6-6.9,9.8-9.9c2.1-2.9,3.5-5.7,4.1-8.3c0.5-1.8,0.5-3.3-0.1-4.4c-0.6-1.1-1.5-1.6-2.9-1.4
	c-1.4,0.1-2.8,1-4.4,2.6c-3.2,3.1-5.7,8.1-7.6,15C111.5,28.8,110.9,31.7,110.9,33z M77.5,45.5c0,0,0.2,0,0.3-0.1
	c0.3-0.1,0.7-0.3,1.2-0.5c1.1-0.6,1.8-1.4,2.1-2.2c0.3-0.7,0.3-1,0-0.9c-0.9,0-1.9,0.9-3,2.6c-0.2,0.3-0.3,0.5-0.4,0.7
	C77.5,45.3,77.4,45.4,77.5,45.5z M75.1,29.6c0.2,0.1,0.4,0.2,0.8,0.2c0.4,0,0.9-0.2,1.6-0.6c0.7-0.4,1.3-0.8,2-1.2
	c0.7-0.4,1.3-0.8,1.9-1.2c0.6-0.4,1-0.6,1.2-0.6c0.2,0,0.5,0.3,0.9,0.8c0.3,0.5,0.7,1.1,1.2,1.7c0.4,0.6,0.9,1.1,1.5,1.7
	c0.5,0.5,1.1,0.8,1.7,0.8c0.4,0,0.6-0.2,0.7-0.7c0.1-0.5,0-1.1-0.2-1.9c-0.2-0.8-0.5-1.6-0.9-2.4c-0.4-0.9-0.8-1.7-1.2-2.4
	c-0.4-0.8-0.8-1.4-1.3-1.9c-0.4-0.5-0.8-0.7-1-0.7c-0.3,0-0.7,0.2-1.3,0.5c-0.6,0.3-1.2,0.7-1.9,1.2c-0.7,0.5-1.4,1-2.1,1.6
	c-0.7,0.6-1.4,1.1-2,1.7c-0.6,0.6-1.1,1.1-1.5,1.5c-0.4,0.4-0.6,0.8-0.6,1c-0.1,0.3-0.1,0.5,0,0.7C74.8,29.3,74.9,29.5,75.1,29.6z"
	/>
</svg>
