<svg xmlns="http://www.w3.org/2000/svg" width="25.111" height="21.795" viewBox="0 0 25.111 21.795">
  <path id="phone" d="M488.742,894.83c-1.682.8-1.543,2-3.855.8s-5.985-4.061-6.3-4.66q-.257-.482.732-2.632h0a2.069,2.069,0,0,0-.3-2.2,12.121,12.121,0,0,0-4.741-3.68c-1.288-.49-6.946,6,2.869,13.7s15.519,6.989,16.708,3.625a10.888,10.888,0,0,0,.735-2.5C494.584,896.383,489.932,894.264,488.742,894.83Z" transform="translate(-470.473 -881.416)" fill="none" stroke="#fff" stroke-width="2"/>
</svg>
