<?xml version="1.0" encoding="utf-8"?>
<!-- Generator: Adobe Illustrator 24.0.0, SVG Export Plug-In . SVG Version: 6.00 Build 0)  -->
<svg version="1.1" id="Layer_1" xmlns="http://www.w3.org/2000/svg" xmlns:xlink="http://www.w3.org/1999/xlink" x="0px" y="0px"
	 viewBox="0 0 185 85" enable-background="new 0 0 185 85" xml:space="preserve">
<g>
	<path fill="#121212" d="M108.1,37.1c-0.4-1.5-1.2-2.5-2.3-3.1c-1.1-0.6-2.3-0.5-3.6,0.1c-2.5,1.1-4.8,4-7,8.4l-0.9,1.7l0.1-3.3
		c0.1-1.8,0.1-3.1-0.1-3.7c-0.1-0.6-0.5-1.1-1.1-1.5c-0.9-0.5-1.8-0.4-2.6,0.4c-0.9,0.8-1.5,2.1-2,4c-0.2,0.6-0.4,2.6-0.6,5.9
		c0,0.3,0,0.5-0.1,0.8c-2.8,5-5.5,7.8-8.1,8.2c-0.4,0.1-0.8,0-1.3-0.3c-0.5-0.3-0.8-0.6-1-0.9c-0.4-1.1-0.5-2.5-0.1-4.4l0.3-1.4
		l1.3-0.5c1.8-0.7,3.4-1.7,4.6-2.9c0.8-0.9,1.3-1.7,1.4-2.5c0.6-2,0.3-3.7-0.8-5c-0.7-0.7-1.6-1.1-2.8-1.3c-1.1-0.1-2.2,0-3.2,0.5
		c-1.4,0.7-2.7,2-4,4c-0.4,0.6-0.8,1.3-1.1,2c-0.6,0.8-1.3,1.9-2.1,3.2c-3.1,5.2-6.8,9.8-11.1,14c-3,2.9-5.9,5.1-8.7,6.6
		c-5.1,2.5-9.2,3.2-12.3,1.8c-3.6-1.7-5.4-5.3-5.4-10.8c0-7.1,2.4-15.5,7.1-25.2c3.3-6.8,7.2-12.3,11.5-16.5c2.5-2.6,4.6-4,6.1-4.1
		c0.6-0.1,1.1,0.1,1.5,0.5c0.4,0.4,0.7,1.1,1.1,2c0.3,1,0.4,2.1,0.3,3.4c-0.5,5.9-2.2,11.4-5,16.6c-0.9,1.7-1,2.6-0.4,2.9
		c1,0.4,2.1-0.5,3.4-2.8c1.3-2.3,2.5-5.4,3.6-9.3c1.2-4.6,1.8-8.2,1.8-10.9c0.1-1.9-0.1-3.3-0.5-4.2c-1.2-2.6-3.1-4-5.7-4.2
		c-0.9-0.1-1.9,0.1-3.2,0.5c-2.1,0.7-4.4,2.3-7,4.9c-4.7,4.5-8.9,10.5-12.8,18.2c-3.3,6.4-5.5,12.7-6.8,18.7
		c-1.3,6.1-1.4,11.2-0.5,15.4c0.4,2,1.2,3.8,2.3,5.4c1.1,1.6,2.5,2.9,4.1,4c1.6,1.1,3.4,1.8,5.3,2.1c1.6,0.3,3.3,0.3,5,0
		c3.9-0.5,7.2-1.8,9.9-3.8c5.4-3.9,10.1-8.9,14.4-15c0.5-0.6,1.1-1.6,1.8-3c0.1,0.9,0.2,1.8,0.5,2.6c0.4,1.4,1.1,2.5,1.8,3.3
		c0.8,0.8,1.7,1.3,2.8,1.6c0.6,0.1,1.1,0.1,1.3,0c0.6-0.1,1.4-0.4,2.2-0.9c0.9-0.5,1.5-0.9,2-1.4c1.4-1.4,3.4-4,5.8-8
		c-0.1,1.4-0.1,2.5-0.1,3.4c0,4.5,0.9,7.1,2.6,7.8c1.3,0.5,2.3,0,3-1.5c0.3-0.7,0.4-2,0.5-4c0-1.9,0.2-3.3,0.3-4.1
		c1-3.6,2.3-6.9,4-9.8c1.7-2.9,3.2-4.6,4.5-4.9c0.6-0.2,1-0.1,1.3,0.2c0.2,0.3,0.4,0.8,0.6,1.5c0.3,1.8,0.8,2.8,1.4,3.2
		c0.4,0.3,0.9,0.3,1.3,0.1C108.7,41.4,109,39.9,108.1,37.1z M79.1,44.4c0.1-0.2,0.2-0.4,0.4-0.7c1.1-1.8,2.2-2.6,3-2.6
		c0.3-0.1,0.3,0.2,0,0.9c-0.4,0.9-1.1,1.6-2.1,2.2c-0.4,0.3-0.8,0.4-1.2,0.5c-0.2,0.1-0.3,0.1-0.3,0.1
		C78.9,44.8,78.9,44.6,79.1,44.4z"/>
	<path fill="#121212" d="M111.7,36.5c1,0.6,2,0.6,3,0.1c1-0.6,1.5-1.4,1.5-2.6c0-1.2-0.5-2.1-1.4-2.6c-1-0.5-1.9-0.5-2.9-0.1
		c-1,0.5-1.5,1.3-1.6,2.5C110.1,35,110.6,35.9,111.7,36.5z"/>
	<path fill="#121212" d="M156.4,42.7c-0.4,0-0.9,0.3-1.4,0.9c-0.5,0.6-1.1,1.5-1.8,2.7c-3,5.4-5.8,8.4-8.4,8.8
		c-0.4,0.1-0.8,0-1.3-0.3c-0.5-0.3-0.8-0.6-1-0.9c-0.4-1.1-0.5-2.5-0.1-4.4l0.3-1.4l1.3-0.5c1.8-0.7,3.4-1.7,4.6-2.9
		c0.8-0.9,1.3-1.7,1.4-2.5c0.6-2,0.3-3.7-0.8-5c-0.7-0.7-1.6-1.1-2.8-1.3c-1.1-0.1-2.2,0-3.2,0.5c-1.4,0.7-2.7,2-4,4
		c-1.1,1.8-1.9,3.7-2.5,5.8c-1.4,0.6-3.1,1.5-5.1,2.8c-1.4,1-2.2,1.5-2.4,1.6c-0.3-0.4-0.5-0.7-0.6-1.1c-0.1-0.4-0.3-0.9-0.5-1.4
		l-0.8-2.6l0.9-0.8c1.5-1.2,2.8-2.9,3.8-5c0.5-1.1,0.8-2.1,0.9-3.2c0.1-1.7-0.4-2.9-1.3-3.6c-0.6-0.4-1.5-0.7-2.6-0.7
		c-1.1,0-2.2,0.3-3.2,0.8c-2.9,1.6-4.4,4.4-4.6,8.3c-0.1,1.5,0,3.3,0.4,5.2c-0.3,0.5-0.6,1.1-1,1.8c-2.3,4.2-4.1,7-5.5,8.4
		c-1.5,1.5-2.2,1.7-2.2,0.5c0-3.4,0.6-7.2,1.7-11.5c0.3-1.6,0.5-2.8,0.5-3.7c0-0.9-0.3-1.5-0.8-2c-0.5-0.4-1-0.7-1.5-0.7
		c-1.1,0-1.9,0.4-2.5,1.2c-0.6,0.8-1.1,2.1-1.6,4c-1.1,4-1.5,7.2-1.4,9.4c0.1,2.2,0.7,4.1,2,5.5c0.4,0.4,0.8,0.8,1.2,1.1
		c0.9,0.5,1.8,0.5,2.9,0c1.9-1,4.6-4.4,8-10.3c0.3-0.5,0.6-1,0.9-1.4c0.4,1.2,0.8,2.4,1.3,3.8c0.5,1.4,0.7,2.3,0.4,2.6
		c-0.3,0.3-0.8,1-1.7,2c-2.6,3.3-4.4,6.8-5.3,10.5c-0.7,3.1-0.7,5.6,0,7.5c0.8,2.2,2.1,3.6,4,4.1c1.3,0.4,2.9,0.2,4.6-0.7
		c3.1-1.5,5.1-4.3,6.2-8.3c1.1-4.5,0.8-9.4-0.9-14.8c-0.4-1.5-0.7-2.3-0.7-2.5c0-0.3,1.2-1.3,3.6-2.7c0.8-0.5,1.5-0.9,2.2-1.3
		c-0.3,2.4-0.1,4.4,0.5,6.1c0.4,1.4,1.1,2.5,1.8,3.3c0.8,0.8,1.7,1.3,2.8,1.6c0.6,0.1,1.1,0.1,1.3,0c0.6-0.1,1.4-0.4,2.2-0.9
		c0.9-0.5,1.5-0.9,2-1.4c1.8-1.8,4.5-5.6,7.9-11.6c0.6-1,1.1-1.7,1.6-2.1C157.4,43.4,157.4,42.8,156.4,42.7z M143.8,44.4
		c0.1-0.2,0.2-0.4,0.4-0.7c1.1-1.8,2.2-2.6,3-2.6c0.3-0.1,0.3,0.2,0,0.9c-0.4,0.9-1.1,1.6-2.1,2.2c-0.4,0.3-0.8,0.4-1.2,0.5
		c-0.2,0.1-0.3,0.1-0.3,0.1C143.6,44.8,143.7,44.6,143.8,44.4z M125.5,71.4c-0.8,2.5-1.7,4-2.6,4.5c-0.5,0.3-1.1,0.3-1.6,0
		c-0.6-0.4-1.1-1.3-1.5-2.8c-0.6-2.8,0-6.2,2-10.3c0.6-1.1,1.3-2.2,2-3.3c0.7-1.1,1.2-1.7,1.4-1.6c0.2,0,0.4,0.6,0.7,1.7
		c0.3,1.1,0.5,2.3,0.6,3.4C126.9,65.6,126.6,68.3,125.5,71.4z M127,42.9c-0.2-0.4-0.2-1.2-0.1-2.3c0.1-1.1,0.4-2,0.7-2.7
		c0.8-1.7,1.8-2.5,3-2.6c0.7-0.1,1,0.4,0.9,1.3c-0.3,1.5-1.1,3.1-2.5,4.7c-0.6,0.7-1.1,1.2-1.4,1.5C127.3,43.2,127.1,43.2,127,42.9z
		"/>
</g>
</svg>
