<svg id="nl" xmlns="http://www.w3.org/2000/svg" width="26.779" height="20.084" viewBox="0 0 26.779 20.084">
  <path id="Path_726" data-name="Path 726" d="M0,0H26.779V20.084H0Z" fill="#21468b"/>
  <path id="Path_727" data-name="Path 727" d="M0,0H26.779V13.39H0Z" fill="#fff"/>
  <path id="Path_728" data-name="Path 728" d="M0,0H26.779V6.695H0Z" fill="#ae1c28"/>
</svg>
