<svg xmlns="http://www.w3.org/2000/svg" width="800" height="500" viewBox="-8 -5 16 10">
<rect x="-8" y="-5" width="16" height="10" fill="#d20000"/>
<g style="fill:#ffe600;">
<path d="m -1,-5 h 2 l -2,10 h 2 z"/>
<path d="m -1,0 l 9,-1 v 2 z m 2,0 l -9,-1 v 2 z"/>
<path d="m -8,-5 l 9,5.625 -6,-5.625 z m 0,10 l 9,-5.625 -6,5.625 z m 16,0 l -9,-5.625 6,5.625 z m 0,-10 l -9,5.625 6,-5.625 z"/>
<circle r="1.414"/>
</g>
</svg>
