<?xml version="1.0" encoding="utf-8"?>
<!-- Generator: Adobe Illustrator 24.0.0, SVG Export Plug-In . SVG Version: 6.00 Build 0)  -->
<svg version="1.1" id="Layer_1" xmlns="http://www.w3.org/2000/svg" xmlns:xlink="http://www.w3.org/1999/xlink" x="0px" y="0px"
	 viewBox="0 0 297.6 124.7" style="enable-background:new 0 0 297.6 124.7;" xml:space="preserve">
<style type="text/css">
	.st0{fill-rule:evenodd;clip-rule:evenodd;fill:#FFF200;}
	.st1{fill-rule:evenodd;clip-rule:evenodd;fill:#ED1C24;}
	.st2{fill-rule:evenodd;clip-rule:evenodd;}
</style>
<g>
	<path class="st0" d="M240.2,27.1c-0.6-5.9-7-16.4-9-20.1c-0.1,0-0.2,0-0.3-0.1l0,0c0,0-0.5,0.1-0.5,0.6l-0.5,0.1l0,0
		c-0.5,0.1-0.5,0.1-1.1,0.1c-0.1-0.6-0.1-0.6-0.1-0.6s0,0-0.5,0.1c0,0,0,0-0.5-0.5l0,0c0,0,0,0-0.5,0.1l0,0
		c-0.5,0.1-0.5,0.1-0.5,0.1l0,0l-1.5,0.7l-0.5,0.6c-1.5,0.2-3.6-0.2-3.6-0.2l0,0L220.5,8l-1,0.1l0,0l0,0C219,8.2,219,8.2,219,8.2
		l0,0l0,0l0,0c-0.5,0.1-0.5,0.1-0.5,0.1l0,0l0,0c-0.5,0.1-0.5,0.1-0.5,0.1l0,0l0,0l0,0l0,0c0,0,0,0-0.2,0c-0.1,0.1-0.2,0.2-0.3,0.3
		l0,0.3l0,0l0,0c-0.5,0.3-0.9,0.5-1.3,0.7c-0.1,0.1-0.3,0.5,0,0.8l-0.4,0.4l0,0c-0.4,0.4-0.4,0.4-0.7,0.9c-0.4-0.4-0.4-0.4-0.4-0.4
		s0,0-0.4,0.4l-0.7,0c-0.1,0.1-0.2,0.2-0.3,0.4l-0.1,0.1l0,0c-0.4,0.4-0.4,0.4-0.4,0.4l0,0l-0.6,1.6l0,0.8c-1,1.2-2.8,2.5-2.8,2.5
		l0,0l-0.4,0.4l-0.7,0.8l0,0l0,0C208,19,208,19,208,19l0,0l0,0l0,0c-0.4,0.4-0.4,0.4-0.4,0.4l0,0l0,0c-0.4,0.4-0.4,0.4-0.4,0.4l0,0
		l0,0l0,0l0,0c0,0,0,0-0.4,0.4l0,0c0,0,0,0,0.4,0.4l0,0l0,0c-0.3,1.1-0.7,1.5-1,2.8l0,0c-0.3,0.4-0.3,0.4-0.3,0.4s0,0-0.4,0.4l0,0
		l0,0c0,0,0,0-0.4,0.4l0,0l0,0l0.4,0.4c-0.7,0.8-0.3,1.2-1,2c-0.3,1.1-1.1,2-1,2.8c0,0,0,0-0.3,0.4l0,0l0,0l0,0
		c-0.3,1.2-0.3,2-0.3,3.6c0.1,0.8-0.3,1.2-0.3,1.9c0,0.4-0.2,0.9-0.5,1.3c0.1,1.5,0.5,3,1,4.5c0.6,0.4,1.1,0.8,1.4,1.1l0,0
		c0.8,0.9,1.4,1.3,2.1,1.7c0.6,0.4,1.2,0.8,1.9,1.2c0.5,0.9,1.3,1.5,2.2,2c1.5-0.3,2.9-0.9,3.6-1.3c3.8-1.8,8.7-3.7,13.2-6.2
		c0.8-0.7,1.7-1.4,2.7-2.3c0,0,0.4-0.7,0.9-0.8c0.4-0.6,0.9-0.8,1.2-1.4c0.4-0.7,0.9-0.8,1.4-1c1-0.3,1.4-1,1.7-1.6
		c0.3-1.2,0.7-1.3,1.8-1.6l0,0c0,0,0,0,0.3-0.7l0,0l0,0l0,0c0.4-0.7,0.4-0.7,0.4-0.7l0,0c0,0,0,0,0.5-0.1l0,0c0,0,0.3-0.3,0.7-0.6
		C239.6,28.5,239.9,27.8,240.2,27.1L240.2,27.1z"/>
	<path class="st1" d="M28,89.1H0.8V58.1c0.1,0,0.2,0.1,0.3,0.2c-0.1,1.3,2-1.7,1.9-0.4c0,1.1,1.4,0.8,2.7-0.5c0,0,1.4,0.9,2.9,0.6
		c1.2-0.3,2.1-0.6,3.6-0.9c2.8,0.5,4.7,1.3,6.2,0.9l0.3-2.1c0.3,0.3,1.5,3.5,3.5,3.1c0,0,0,0,0.1,0c1.4-0.6,4.9-0.7,6.2-0.8
		c0.6,0,1.3-0.7,1.7-0.7c0.4,0,0.4,0.3,0.6,0.6c0.4,0.4,1.2,0.4,1.3,0.8c0.3,1,1.7,0,2.6-0.6c-0.5,3.3-1.9,6.3-3,9.4
		c1,6.1-5.4,12.8-3,18.6C28.5,87.2,28.2,88.1,28,89.1L28,89.1z M240.2,27.1c-0.6-5.9-7-16.4-9-20.1c-0.1,0-0.2,0-0.3-0.1l0,0
		c0,0-0.5,0.1-0.5,0.6l-0.5,0.1l0,0c-0.5,0.1-0.5,0.1-1.1,0.1c-0.1-0.6-0.1-0.6-0.1-0.6s0,0-0.5,0.1c0,0,0,0-0.5-0.5l0,0
		c0,0,0,0-0.5,0.1l0,0c-0.5,0.1-0.5,0.1-0.5,0.1l0,0l-1.5,0.7c0,0,0,0,0.1,0.6c-0.1-0.6-0.5,0.1-0.5,0.1c-1.5,0.2-3.6-0.2-3.6-0.2
		l0,0L220.5,8l-1,0.1l0,0l0,0C219,8.2,219,8.2,219,8.2l0,0l0,0l0,0c-0.5,0.1-0.5,0.1-0.5,0.1l0,0l0,0c-0.5,0.1-0.5,0.1-0.5,0.1l0,0
		l0,0l0,0l0,0c0,0,0,0-0.2,0c-0.1,0.1-0.2,0.2-0.3,0.3l0,0.3l0,0l0,0c-0.5,0.3-0.9,0.5-1.3,0.7c-0.1,0.1-0.3,0.5,0,0.8l-0.4,0.4l0,0
		c-0.4,0.4-0.4,0.4-0.7,0.8c-0.4-0.4-0.4-0.4-0.4-0.4s0,0-0.4,0.4l-0.7,0c-0.1,0.1-0.2,0.2-0.3,0.4l-0.1,0.1l0,0
		c-0.4,0.4-0.4,0.4-0.4,0.4l0,0l-0.6,1.6c0,0,0,0,0.4,0.4c-0.4-0.4-0.4,0.4-0.4,0.4c-1,1.2-2.8,2.5-2.8,2.5l0,0l-0.4,0.4l-0.7,0.8
		l0,0l0,0C208,19,208,19,208,19l0,0l0,0l0,0c-0.4,0.4-0.4,0.4-0.4,0.4l0,0l0,0c-0.4,0.4-0.4,0.4-0.4,0.4l0,0l0,0l0,0l0,0
		c0,0,0,0-0.4,0.4l0,0c0,0,0,0,0.4,0.4l0,0l0,0c-0.3,1.1-0.7,1.5-1,2.8l0,0c-0.3,0.4-0.3,0.4-0.3,0.4s0,0-0.4,0.4l0,0l0,0
		c0,0,0,0-0.4,0.4l0,0l0,0l0.4,0.4c-0.7,0.8-0.3,1.2-1,2c-0.3,1.1-1.1,2-1,2.8c0,0,0,0-0.3,0.4l0,0l0,0l0,0c-0.3,1.2-0.3,2-0.3,3.6
		c0.1,0.8-0.3,1.2-0.3,1.9c0,0.4-0.2,0.9-0.5,1.3c0.1,1.5,0.5,3,1,4.5c0.6,0.4,1.1,0.8,1.4,1.1l0,0c0.8,0.9,1.4,1.3,2.1,1.7
		c0.6,0.4,1.2,0.8,1.9,1.2c0.5,0.9,1.3,1.5,2.2,2c1.5-0.3,2.9-0.9,3.6-1.3c3.8-1.8,8.7-3.7,13.2-6.2c0.8-0.7,1.7-1.4,2.7-2.3
		c0,0,0.4-0.7,0.9-0.8c0.4-0.6,0.9-0.8,1.2-1.4c0.4-0.7,0.9-0.8,1.4-1c1-0.3,1.4-1,1.7-1.6c0.3-1.2,0.7-1.3,1.8-1.6l0,0
		c0,0,0,0,0.3-0.7l0,0l0,0l0,0c0.4-0.7,0.4-0.7,0.4-0.7l0,0c0,0,0,0,0.5-0.1l0,0c0,0,0.3-0.3,0.7-0.6
		C239.6,28.5,239.9,27.8,240.2,27.1L240.2,27.1z M82.5,0.9h214.4v33.2h-1.1l0,0c0.1,1.1-3,1.9-4,3.1l0,0c-3.1,0-4.9,3.1-8.2,3.1
		c-9.3,0-10.9,6.5-18,10.3l0,0h-1.3c-2.4,2.8-12.7,0.7-12.5,4.4l0,0h-4.2l0,0c-2.8,1.5-6,2.5-8.7,3.8l0,0l0.1,1.5l0,0h-1.5l0,0H236
		l0,0h-1.5l0,0H233l0,0c-4.6,0-9,0.6-13.5,0.6c0,0-1.4,1.5-1.5,0c0.2,2.8-3.1,3.1-5.5,3.1l0,0h-1.5l0,0c-2.7-1.8-3.1-1.3-5.9-1l0,0
		c-2.2,0-1.1,1.5-2.8,1.5l0,0c-4.3-1.5-8.6,0-11.4,1.6c-5.9,0-11.1-1.5-16.8-1.5c-1.3-1.3-2.5-4.4-3.7-4.4c0.3-9.1,1.7-22.9,4.7-31
		c2-2,2.6-3.8,3.3-5.6c1.8-1.9,4.8-4.3,3.6-7.1l0,0c-1.1-2.6-3-5.1-4.2-7.9l0,0c-0.7-1.6-0.4-1.6-2-1.4c-3.4-4.9-13-1.2-17.7-0.6
		c-18.1-1.1-25,13.4-39.5,21.1c-3.8,3.7-4.3,6.1-7.4,11.4c-2.7,1.9-9.3,9-12.4,9.4l0,0c-4.3-10.3-5.1-18-6.7-28.7
		c-1.4-3.3-3.5-9.6-5.4-14.1l0,0c-0.7-1.6-2-1.4-2.6-3l0,0c-0.7,0.1-3.2-1.2-0.7-1.6l0,0C83,1.2,82.7,1.1,82.5,0.9L82.5,0.9z
		 M0.8,0.9h63.6c-0.6,0.5-1.1,1-1.7,1.5c0.5,1.3-3,6.1-3.7,7.3c-6,6.9-10.8,16-13.9,24.8l0,0c-1.1,3.5-2.4,3.7-4.4,5.7
		c0.4,1,0.3,2.2-0.1,3.4c-1.3,0.1-2.7,0.2-4.2,0.4c0,0,0,0-1.6,0.4l0,0c-3.2,0.9-3.3,0-4.9-0.6c0,0-1.3,1.2-1.4,0.2
		c0,0-1.5,1.4-1.5,0.3c-1.5,0.5-7.2,0.3-10.1,1.7l0,0c-2.6,1.3-4,1.4-5.4,1.5c-1.4,0.3-2.5,0.1-3.9,0.2c-2.8,2-4.9,2-6.7,1.9V0.9
		L0.8,0.9z"/>
	<path class="st2" d="M296.9,39.5v49.6H36.1c0.7-2.4,1.3-5,1-5.6l1.3-0.2c0.8-2.9,2.6-12,5.6-12.4c0.1,0,3.6-6.4,3.8-7.1
		c0.3-0.8,0.6-1.7,1-2.6c1,0.1,2.2,0.2,3.6,0.3c1.4,0.1,3-3.3,4.7-3.1c1.1,0.1,2.7,3.6,4.7,3.2c1-1,3.2-1.2,5.2-1.5
		c2-0.4,3.7-1,3.6-1.9l1.2-2.2c1-2.1,0.3-3.3-0.8-4.1c-1.1-0.9-2.5-1.5-2.9-2.4c-0.8-1.8-2.5-2.7-4.1-3.4c-1.5,1.2-1.6,0.3-1.6,0.3
		c-1.7,0-3.4,0-5-0.2C57.2,46,57,46,56.8,45.9c-0.5-0.1-1-0.3-1.5-0.4c1.8-2.6,2.3-6.3,5.3-8.1c1.1-2.5,1.5-7.2,7.3-11.7
		c7.1-7.2,5.7-8.7,7.7-5.6c3.3,7.4,5.5,21.1,8,27.2c3,7.3,1.2,18.2,8.2,23.2c1.3-0.2,1.3-0.2,3.1,1.2l0,0c0.9,0.7,6-0.9,7.7-1.1
		c0.5-1.8,1.8-2,3.1-2.1c2.2-2.4,1.5-6.9,4.5-7.3c-0.3-0.7,2.8-3.8,3.7-3.9l1.3-0.2l0,0c0.9-2.5,3.5-8,6.4-8.5
		c0.5-1.4,2.9-3,2.7-3.5c1.3-0.2,1.9-0.2,3-0.4l0,0c-1.7-4,3.3,0.2,4.5-3.1l3.7-0.5l0,0l-0.6-1.4l1.1-0.2c5.9-4.9,7.9-6.2,13.2-12.1
		c4.2-0.6,6.7-2.5,10.2-4.6l-0.7,1.6c0.3,11.1-7.7,21.6-9.3,32.5c-3.8,10.6,13.6,23.4,24.5,24.5c12.3,0.2,48.8-0.7,66.4-6.8h1.5l0,0
		c-0.2-2.7,4.9-2.4,6.8-4.6l0,0l1.2-1.5l0,0c5.8,0,5.5-5.9,11-5.9c2.5,0,9.5-4.1,11.2-5.9c5.5-3.1,9.6-4.4,13.6-7.5
		c0.4-0.2,10.4-8.8,10.8-8.8l0,0C296.5,39.9,296.7,39.7,296.9,39.5L296.9,39.5z"/>
	<path d="M13.2,114.3l0.7,4h4.5l-3.2-17.2H9.6l-5.9,17.2H8l1.2-4H13.2L13.2,114.3z M10,110.9l0.9-3.1c0.3-1,0.7-2.4,1-3.4h0
		c0.1,1,0.3,2.4,0.5,3.4l0.5,3.1H10L10,110.9z M21.2,105.7l-1,12.6h4.2l0.7-9h4.1l0.3-3.6H21.2L21.2,105.7z M40.8,113.6
		c0.1-0.3,0.2-1,0.3-1.7c0.3-3.4-1-6.4-4.7-6.4c-4.2,0-6.2,3.8-6.4,6.7c-0.3,4,1.7,6.4,5.7,6.4c1.4,0,2.9-0.2,4.3-0.8l-0.3-3.1
		c-1,0.4-2.1,0.5-3.1,0.5c-1.5,0-2.7-0.6-2.8-1.6H40.8L40.8,113.6z M34,110.5c0.1-0.8,0.7-2,1.9-2c1.3,0,1.5,1.3,1.4,2H34L34,110.5z
		 M43.4,105.7l-1,12.6h4.2l0.4-4.7h2.8l-0.4,4.7h4.2l1-12.6h-4.2l-0.4,4.3h-2.8l0.4-4.3H43.4L43.4,105.7z M57.1,105.7l-1,12.6h9
		l-0.2,4.1h3.1l0.8-7.2l-1.3-0.1l0.8-9.4H64l-0.8,9.1h-2.8l0.8-9.1H57.1L57.1,105.7z M71,105.7l-1,12.6h5.1c0.8-1.8,1.6-3.9,2.4-5.6
		c0.5-1.1,0.7-1.9,1.1-3.1h0.1c-0.4,2.9-0.5,3.6-0.7,5.5l-0.3,3.2h3.9l1-12.6h-5.1l-2,4.9c-0.5,1.1-0.8,2.1-1.4,3.5H74
		c0.2-1.7,0.5-3.1,0.6-5.2l0.3-3.2H71L71,105.7z M82,123.8c1.9,0,3.7-0.5,4.9-1.6c1.2-1,1.9-2.8,2.2-5.6l0.9-10.9h-4.2l-0.8,9.9
		c-0.2,2.3-0.4,3.3-1,3.8c-0.5,0.5-1.2,0.7-2.1,0.8L82,123.8L82,123.8z M87.9,104.4c1.3,0,2.2-1,2.3-2.2c0.1-1.3-0.6-2.2-1.9-2.2
		c-1.3,0-2.2,0.9-2.3,2.2C85.9,103.5,86.6,104.4,87.9,104.4L87.9,104.4L87.9,104.4z M102,111c0.3-3.1-0.9-5.5-4.8-5.5
		c-2.3,0-4,0.7-4.8,1.1l0.5,2.9c0.8-0.5,2.1-0.9,3.3-0.9c1.5,0,1.8,0.6,1.8,1.1l0,0.1c-3.8,0-6.7,1.5-7,4.9c-0.2,2.1,1.1,4,3.4,4
		c1.2,0,2.4-0.4,3.2-1.4h0.1l0.1,1.1h3.7c-0.1-0.6,0-1.8,0.1-3.1L102,111L102,111z M97.8,113.6c0,0.2,0,0.5-0.1,0.7
		c-0.3,0.7-0.9,1.1-1.5,1.1c-0.7,0-1.1-0.4-1.1-1.2c0.1-1.1,1.1-1.6,2.8-1.6L97.8,113.6L97.8,113.6z M110.1,113.3h2
		c1.4,0,2.1,0.4,2,1.1c0,0.5-0.6,1-2,1c-1.2,0-2.6-0.4-3.3-0.9l-1.1,2.8c1.2,0.9,2.9,1.3,4.6,1.3c2.3,0,5.9-0.7,6.2-3.9
		c0.2-1.9-1.4-2.7-2.6-2.8l0-0.1c1.1-0.3,2.5-1.1,2.6-2.8c0.2-2.6-2.4-3.4-4.6-3.4c-1.7,0-3.6,0.4-5.1,1.4l0.5,2.6
		c0.9-0.5,2-0.9,3-0.9c1.2,0,1.8,0.4,1.7,1c0,0.5-0.6,0.9-1.9,0.9h-2L110.1,113.3L110.1,113.3z M130.9,111c0.3-3.1-0.9-5.5-4.8-5.5
		c-2.3,0-4,0.7-4.8,1.1l0.5,2.9c0.8-0.5,2.1-0.9,3.3-0.9c1.5,0,1.8,0.6,1.8,1.1l0,0.1c-3.8,0-6.7,1.5-7,4.9c-0.2,2.1,1.1,4,3.4,4
		c1.2,0,2.4-0.4,3.2-1.4h0.1l0.1,1.1h3.7c-0.1-0.6,0-1.8,0.1-3.1L130.9,111L130.9,111z M126.7,113.6c0,0.2,0,0.5-0.1,0.7
		c-0.3,0.7-0.9,1.1-1.5,1.1c-0.7,0-1.1-0.4-1.1-1.2c0.1-1.1,1.1-1.6,2.8-1.6L126.7,113.6L126.7,113.6z M137.2,118.3h3.7l0.5-4.5
		c0.1-0.9,0.3-2.7,0.5-4.3h0.1c0.2,1.2,0.3,2.9,0.5,4.2l0.7,4.4h3l1.6-4.6c0.7-2,0.7-2.2,1.4-4.1h0c-0.1,1.5-0.2,3.4-0.2,4.4
		l-0.2,4.6h3.8l0.4-12.6h-5.3l-1.3,4.1c-0.4,1.1-0.7,2.2-1,3.1h-0.1c-0.2-1.2-0.3-2.4-0.4-3l-0.5-4.1H139L137.2,118.3L137.2,118.3z
		 M156.4,105.7l-0.4,5.2c-0.2,1.8-0.3,2.7-0.8,3.4c-0.3,0.4-0.8,0.6-1.4,0.7l0.2,3.6c1.8,0,3-0.4,3.9-1.4c1.3-1.2,1.8-3.2,2-6.1
		l0.2-1.9h1.8l-0.8,9.1h4.2l1-12.6H156.4L156.4,105.7z M178.3,111c0.3-3.1-0.9-5.5-4.8-5.5c-2.3,0-4,0.7-4.8,1.1l0.5,2.9
		c0.8-0.5,2.1-0.9,3.3-0.9c1.5,0,1.8,0.6,1.8,1.1l0,0.1c-3.8,0-6.7,1.5-7,4.9c-0.2,2.1,1.1,4,3.4,4c1.2,0,2.4-0.4,3.2-1.4h0.1
		l0.1,1.1h3.7c-0.1-0.6,0-1.8,0.1-3.1L178.3,111L178.3,111z M174.1,113.6c0,0.2,0,0.5-0.1,0.7c-0.3,0.7-0.9,1.1-1.5,1.1
		c-0.7,0-1.1-0.4-1.1-1.2c0.1-1.1,1.1-1.6,2.8-1.6L174.1,113.6L174.1,113.6z M182.9,105.7l-0.3,3c-0.1,1.2-0.4,2.5-0.8,3.7
		c-0.3,0.9-0.8,1.9-1.3,2.6l-1.1,0.1l-0.5,7.2h3.1l0.5-4.1h6.8l-0.2,4.1h3.1l0.8-7.2l-1.3-0.1l0.8-9.4H182.9L182.9,105.7z
		 M186.2,109.1h2l-0.5,5.9h-3.1c0.4-0.6,0.7-1.4,0.9-2.1c0.3-0.9,0.5-1.9,0.6-2.6L186.2,109.1L186.2,109.1z M195.5,105.7l-1,12.6
		h5.1c0.8-1.8,1.6-3.9,2.4-5.6c0.5-1.1,0.7-1.9,1.1-3.1h0.1c-0.4,2.9-0.5,3.6-0.7,5.5l-0.3,3.2h3.9l1-12.6H202l-2,4.9
		c-0.5,1.1-0.8,2.1-1.4,3.5h-0.1c0.2-1.7,0.5-3.1,0.6-5.2l0.3-3.2H195.5L195.5,105.7z M214.2,105.7l-1,12.6h5.1
		c0.8-1.8,1.6-3.9,2.4-5.6c0.5-1.1,0.7-1.9,1.1-3.1h0.1c-0.4,2.9-0.5,3.6-0.7,5.5l-0.3,3.2h3.9l1-12.6h-5.1l-2,4.9
		c-0.5,1.1-0.8,2.1-1.4,3.5h-0.1c0.2-1.7,0.5-3.1,0.6-5.2l0.3-3.2H214.2L214.2,105.7z M240.4,114.7c-0.5,0.2-1.1,0.3-1.8,0.3
		c-1.5,0-2.7-1-2.5-3c0.1-1.8,1.3-3,2.9-3c0.9,0,1.4,0.1,1.8,0.3l0.9-3.4c-0.8-0.3-1.8-0.4-2.6-0.4c-4.4,0-6.9,3.1-7.2,6.6
		c-0.3,4,1.8,6.4,5.6,6.4c1.3,0,2.5-0.2,3.1-0.5L240.4,114.7L240.4,114.7z M243.3,105.7l-1,12.6h4.2l0.8-9.1h2.7l-0.8,9.1h4.2
		l1-12.6H243.3L243.3,105.7z M261.3,118.6c3.2,0,6.3-2.1,6.6-6.7c0.3-3.8-1.8-6.4-5.4-6.4c-3.9,0-6.5,2.7-6.8,6.7
		C255.4,116.2,257.9,118.6,261.3,118.6L261.3,118.6L261.3,118.6z M261.6,115.4c-1.3,0-1.7-1.4-1.5-3.3c0.1-1.7,0.7-3.3,2.1-3.3
		c1.2,0,1.6,1.6,1.4,3.3C263.5,114,262.8,115.4,261.6,115.4L261.6,115.4L261.6,115.4z M268.9,123.4h4.2l0.5-6h0
		c0.4,0.6,1.3,1.2,2.6,1.2c2.5,0,5.3-2.1,5.7-6.7c0.3-4.1-1.8-6.4-4.1-6.4c-1.6,0-2.9,0.6-3.8,1.9h0l-0.1-1.6h-3.6
		c-0.1,1.2-0.1,2.6-0.3,4.3L268.9,123.4L268.9,123.4z M274.1,111.3c0-0.2,0-0.4,0.1-0.6c0.2-0.9,1-1.6,1.8-1.6c1.3,0,1.9,1.3,1.7,3
		c-0.1,1.8-1,3-2.2,3c-0.8,0-1.4-0.7-1.5-1.5c0-0.2,0-0.5,0-0.8L274.1,111.3L274.1,111.3z M283.5,105.7l-0.3,3.5h3.2l-0.8,9.1h4.2
		l0.8-9.1h3.2l0.3-3.5H283.5L283.5,105.7z"/>
</g>
</svg>
