<svg xmlns="http://www.w3.org/2000/svg" width="6.591" height="11.061" viewBox="0 0 6.591 11.061">
  <g id="Arrow_Blue_Default_Fw" data-name="Arrow – Blue Default / Fw" transform="translate(0.53 0.53)">
    <path id="Line" d="M10,0,5,5,0,0" transform="translate(0 10) rotate(-90)" fill="none" stroke="#d8232a" stroke-miterlimit="10" stroke-width="1.5"/>
  </g>
</svg>
