<svg xmlns="http://www.w3.org/2000/svg" width="18.438" height="18.439" viewBox="0 0 18.438 18.439">
  <g id="streamline-phone-actions-ring--phones-mobile-devices--48x48" transform="translate(-0.627 -0.75)">
    <path id="Path_292" data-name="Path 292" d="M10.184,17.786l.007.005a3.363,3.363,0,0,0,4.185-.46l.47-.47a1.121,1.121,0,0,0,0-1.586l-1.983-1.981a1.121,1.121,0,0,0-1.586,0h0a1.121,1.121,0,0,1-1.585,0l-3.17-3.171a1.121,1.121,0,0,1,0-1.585h0a1.121,1.121,0,0,0,0-1.586L4.54,4.97a1.121,1.121,0,0,0-1.585,0l-.471.47a3.363,3.363,0,0,0-.459,4.185l0,.007a30.348,30.348,0,0,0,8.154,8.152ZM9.347,7.105a3.363,3.363,0,0,1,3.363,3.363M9.347,4.3a6.166,6.166,0,0,1,6.166,6.166M9.347,1.5a8.969,8.969,0,0,1,8.969,8.969" fill="none" stroke="#fff" stroke-linecap="round" stroke-linejoin="round" stroke-width="1.5"/>
  </g>
</svg>
