<svg xmlns="http://www.w3.org/2000/svg" width="9.1" height="5.257" viewBox="0 0 9.1 5.257">
  <g id="Arrow_Blue_Default_Fw" data-name="Arrow – Blue Default / Fw" transform="translate(8.746 0.354) rotate(90)">
    <path id="Line" d="M8.393,0,4.2,4.2,0,0" transform="translate(0 8.393) rotate(-90)" fill="none" stroke="#fff" stroke-miterlimit="10" stroke-width="1"/>
  </g>
</svg>
