<svg xmlns="http://www.w3.org/2000/svg" width="29.275" height="28.285" viewBox="0 0 29.275 28.285">
  <g id="streamline-arrow-right--arrows-diagrams--48x48" transform="translate(1 1.414)">
    <path id="Path_198" data-name="Path 198" d="M1.5,15.728H28.775M16.046,28.456,28.775,15.728,16.046,3" transform="translate(-1.5 -3)" fill="none" stroke="#d8232a" stroke-linecap="round" stroke-linejoin="round" stroke-width="2"/>
  </g>
</svg>
