<svg id="mk" xmlns="http://www.w3.org/2000/svg" width="15.417" height="11.563" viewBox="0 0 15.417 11.563">
  <path id="Path_307" data-name="Path 307" d="M0,0H15.417V11.563H0Z" fill="#d20000"/>
  <ellipse id="Ellipse_9" data-name="Ellipse 9" cx="1.652" cy="1.65" rx="1.652" ry="1.65" transform="translate(5.721 4.554) rotate(-13.286)" fill="#ffe600"/>
  <g id="Group_1641" data-name="Group 1641">
    <path id="Path_308" data-name="Path 308" d="M375.423,4.543,381.481,0h-2.312L375.1,4.2A2.05,2.05,0,0,1,375.423,4.543Z" transform="translate(-366.064)" fill="#ffe600"/>
    <path id="Path_309" data-name="Path 309" d="M280.964,325.014a1.985,1.985,0,0,1-.238-.014L280,328.734h1.927L281.2,325C281.123,325.01,281.043,325.014,280.964,325.014Z" transform="translate(-273.255 -317.171)" fill="#ffe600"/>
    <path id="Path_310" data-name="Path 310" d="M280.964,3.719a1.98,1.98,0,0,1,.238.014L281.927,0H280l.725,3.731C280.8,3.724,280.884,3.719,280.964,3.719Z" transform="translate(-273.255)" fill="#ffe600"/>
    <path id="Path_311" data-name="Path 311" d="M404.722,193.156a2.125,2.125,0,0,1-.022.306l5.668.85V192l-5.668.85A2.126,2.126,0,0,1,404.722,193.156Z" transform="translate(-394.951 -187.375)" fill="#ffe600"/>
    <path id="Path_312" data-name="Path 312" d="M375.1,291.74l4.069,4.2h2.313l-6.058-4.543A2.049,2.049,0,0,1,375.1,291.74Z" transform="translate(-366.064 -284.381)" fill="#ffe600"/>
    <path id="Path_313" data-name="Path 313" d="M6.058,291.4,0,295.943H2.313l4.069-4.2A2.05,2.05,0,0,1,6.058,291.4Z" transform="translate(0 -284.381)" fill="#ffe600"/>
    <path id="Path_314" data-name="Path 314" d="M6.381,4.2,2.313,0H0L6.058,4.543A2.051,2.051,0,0,1,6.381,4.2Z" fill="#ffe600"/>
    <path id="Path_315" data-name="Path 315" d="M5.646,193.156a2.127,2.127,0,0,1,.022-.306L0,192v2.313l5.668-.85A2.127,2.127,0,0,1,5.646,193.156Z" transform="translate(0 -187.375)" fill="#ffe600"/>
  </g>
</svg>
