{
    "web": {
        "client_id": "549758361683-lv94k98a68ac6953dc0tvn7bkp3qrkdn.apps.googleusercontent.com",
        "project_id": "seismic-fx-266114",
        "auth_uri": "https://accounts.google.com/o/oauth2/auth",
        "token_uri": "https://oauth2.googleapis.com/token",
        "auth_provider_x509_cert_url": "https://www.googleapis.com/oauth2/v1/certs",
        "client_secret": "YG2jpl495C9N6Na9vh5-IQyS"
    }
}