Division,WeightClassKg,Place,Name,Team,BodyweightKg,Best3SquatKg,Best3BenchKg,Best3DeadliftKg,TotalKg,Equipment,Event,Sex
Boys,51.71,1,Jesse Jarmillo,Smithville,49.9,129.27,72.57,129.27,331.12,Single-ply,SBD,M
Boys,55.79,1,Vinnie Maldanado,Smithville,55.79,127.01,90.72,156.49,374.21,Single-ply,SBD,M
Boys,55.79,2,Jordan Glueck,Columbus,55.34,117.93,72.57,140.61,331.12,Single-ply,SBD,M
Boys,55.79,3,Ryan Rodriguez,Cuero,55.34,113.4,74.84,113.4,301.64,Single-ply,SBD,M
Boys,55.79,4,Edward Estrada,Gonzales,54.88,113.4,70.31,113.4,297.1,Single-ply,SBD,M
Boys,55.79,5,Robert Grey,Cuero,53.98,90.72,74.84,113.4,278.96,Single-ply,SBD,M
Boys,55.79,6,Dillan Drabek,Schulenburg,54.88,102.06,56.7,111.13,269.89,Single-ply,SBD,M
Boys,55.79,7,Jordan Pesl,Schulenburg,55.79,88.45,45.36,99.79,233.6,Single-ply,SBD,M
Boys,55.79,8,Ivan Velazquez,Schulenburg,55.79,49.9,36.29,72.57,158.76,Single-ply,SBD,M
Boys,59.87,1,Ubaldo Guzman,Weimar,59.42,158.76,102.06,181.44,442.25,Single-ply,SBD,M
Boys,59.87,2,Gabe Casares,Gonzales,59.42,145.15,83.91,149.69,378.75,Single-ply,SBD,M
Boys,59.87,3,Garrett Rios,Columbus,57.15,113.4,99.79,127.01,340.19,Single-ply,SBD,M
Boys,59.87,4,Jorge Sanchez,Weimar,59.87,104.33,77.11,140.61,322.05,Single-ply,SBD,M
Boys,59.87,5,Jesus Lara,Columbus,58.06,97.52,70.31,108.86,276.69,Single-ply,SBD,M
Boys,67.13,1,Kaleb Walker,Columbus,67.13,185.97,108.86,192.78,487.61,Single-ply,SBD,M
Boys,67.13,2,Thomas Moreno,Weimar,62.6,165.56,90.72,176.9,433.18,Single-ply,SBD,M
Boys,67.13,3,Dalton Manning,Schulenburg,67.13,131.54,108.86,142.88,383.29,Single-ply,SBD,M
Boys,67.13,4,Zeke Zamudio,Columbus,64.86,117.93,81.65,136.08,335.66,Single-ply,SBD,M
Boys,67.13,5,Skylar Shimek,La Grange,63.05,122.47,77.11,127.01,326.59,Single-ply,SBD,M
Boys,67.13,6,Micah David,Cuero,67.13,124.74,63.5,136.08,324.32,Single-ply,SBD,M
Boys,67.13,7,Ryan Jaster,La Grange,66.22,113.4,74.84,127.01,315.25,Single-ply,SBD,M
Boys,67.13,8,Dillon Davis #2,La Grange,63.5,97.52,56.7,113.4,267.62,Single-ply,SBD,M
Boys,67.13,DQ,Dylan Harryman,Cuero,65.32,113.4,,,,Single-ply,SBD,M
Boys,74.84,1,Jordan Benford,Columbus,73.03,170.1,111.13,188.24,469.47,Single-ply,SBD,M
Boys,74.84,2,Daniel Rivera,Gonzales,73.48,190.51,83.91,188.24,462.66,Single-ply,SBD,M
Boys,74.84,3,Tyler Cardenas,Schulenburg,74.84,151.95,113.4,165.56,430.91,Single-ply,SBD,M
Boys,74.84,4,Cohl Stremmell,Yorktown,74.39,147.42,108.86,151.95,408.23,Single-ply,SBD,M
Boys,74.84,5,DJ Gonzales,Gonzales,71.67,163.29,81.65,156.49,401.43,Single-ply,SBD,M
Boys,74.84,6,Alejandro Hernandez,Gonzales,68.04,136.08,92.99,161.03,390.09,Single-ply,SBD,M
Boys,74.84,7,Brandon Brewer,Cuero,74.39,145.15,86.18,147.42,378.75,Single-ply,SBD,M
Boys,74.84,8,Jonathan Fore,Columbus,72.12,142.88,88.45,142.88,374.21,Single-ply,SBD,M
Boys,74.84,9,Keith Jaines,Smithville,73.94,136.08,88.45,138.35,362.87,Single-ply,SBD,M
Boys,74.84,10,Layne Balfanz,Cuero,73.48,124.74,88.45,142.88,356.07,Single-ply,SBD,M
Boys,74.84,11,Ricky Reeder,Yorktown,68.04,115.67,81.65,154.22,351.53,Single-ply,SBD,M
Boys,74.84,12,Jonathan Galindo,Cuero,68.04,117.93,65.77,140.61,324.32,Single-ply,SBD,M
Boys,74.84,13,Martin Rosales,Weimar,70.76,106.59,72.57,142.88,322.05,Single-ply,SBD,M
Boys,82.1,1,D'Vonte Daniels,La Grange,81.65,226.8,158.76,192.78,578.33,Single-ply,SBD,M
Boys,82.1,2,Hunter Noack,Gonzales,79.83,195.04,108.86,213.19,517.1,Single-ply,SBD,M
Boys,82.1,3,Tanner Heffner,Schulenburg,78.93,181.44,120.2,185.97,487.61,Single-ply,SBD,M
Boys,82.1,4,Adrian Molina,Gonzales,80.29,174.63,106.59,181.44,462.66,Single-ply,SBD,M
Boys,82.1,5,Andrew Syrinek,Schulenburg,82.1,161.03,117.93,163.29,442.25,Single-ply,SBD,M
Boys,82.1,6,Brandon Lincoln,Smithville,76.66,147.42,102.06,161.03,410.5,Single-ply,SBD,M
Boys,82.1,7,Ty Winkler,Schulenburg,79.38,147.42,90.72,158.76,396.89,Single-ply,SBD,M
Boys,82.1,8,Jeremy Mowdy,Smithville,76.66,145.15,92.99,156.49,394.63,Single-ply,SBD,M
Boys,82.1,9,Lane Striebe,Yorktown,79.83,165.56,79.38,147.42,392.36,Single-ply,SBD,M
Boys,82.1,10,Bill Rodriquez,Cuero,76.2,145.15,77.11,149.69,371.95,Single-ply,SBD,M
Boys,82.1,11,Tel Holland,Cuero,77.56,113.4,77.11,127.01,317.51,Single-ply,SBD,M
Boys,82.1,DQ,Cedric Bradshaw,La Grange,78.93,151.95,102.06,,,Single-ply,SBD,M
Boys,89.81,1,Landon Lock,Gonzales,87.77,249.48,127.01,247.21,623.69,Single-ply,SBD,M
Boys,89.81,2,Derek Franke,Yorktown,83.01,170.1,102.06,183.7,455.86,Single-ply,SBD,M
Boys,89.81,3,Sky Sgovio,La Grange,87.54,165.56,124.74,158.76,449.06,Single-ply,SBD,M
Boys,89.81,4,Brandon Wavra,Columbus,86.18,158.76,115.67,163.29,437.72,Single-ply,SBD,M
Boys,89.81,5,Jonathan Lara,Schulenburg,89.36,163.29,102.06,172.37,437.72,Single-ply,SBD,M
Boys,89.81,6,Tyler Sedlacek,Columbus,89.81,127.01,102.06,115.67,344.73,Single-ply,SBD,M
Boys,89.81,7,David Hayward,Columbus,89.36,142.88,81.65,115.67,340.19,Single-ply,SBD,M
Boys,89.81,8,Ross Bludau,Schulenburg,86.64,102.06,70.31,120.2,292.57,Single-ply,SBD,M
Boys,89.81,DQ,Derrick Watson,La Grange,89.81,210.92,,,,Single-ply,SBD,M
Boys,99.79,1,Korry Huddleston,Yorktown,92.53,226.8,127.01,190.51,544.31,Single-ply,SBD,M
Boys,99.79,2,Jason Dunning,Schulenburg,95.71,174.63,111.13,183.7,469.47,Single-ply,SBD,M
Boys,99.79,3,Charles Hardin,La Grange,96.16,172.37,97.52,174.63,444.52,Single-ply,SBD,M
Boys,99.79,4,Coy Condel,Gonzales,96.62,170.1,86.18,183.7,439.98,Single-ply,SBD,M
Boys,99.79,5,Jesse Ramirez,Gonzales,95.25,163.29,92.99,163.29,419.57,Single-ply,SBD,M
Boys,99.79,6,Kegan Bledsoe,Smithville,96.16,174.63,88.45,154.22,417.3,Single-ply,SBD,M
Boys,109.77,1,Tristan Wendt,Schulenburg,105.23,199.58,127.01,188.24,514.83,Single-ply,SBD,M
Boys,109.77,2,Lupe Cabrera,Gonzales,108.86,181.44,124.74,181.44,487.61,Single-ply,SBD,M
Boys,109.77,3,Kyle Bludau,Schulenburg,102.97,165.56,106.59,185.97,458.13,Single-ply,SBD,M
Boys,109.77,4,Justin Lavedan,Columbus,108.41,163.29,86.18,154.22,403.7,Single-ply,SBD,M
Boys,109.77,DQ,Brice Helmcamp,Smithville,109.32,204.12,115.67,,,Single-ply,SBD,M
Boys,124.74,1,Chad Childs,La Grange,118.39,226.8,145.15,181.44,553.38,Single-ply,SBD,M
Boys,124.74,2,Robert Kitchen,La Grange,124.74,195.04,127.01,142.88,464.93,Single-ply,SBD,M
Boys,124.74,3,Daniel Velasquez,La Grange,123.38,176.9,102.06,179.17,458.13,Single-ply,SBD,M
Boys,124.74,4,Chris Sliger,Yorktown,113.4,170.1,106.59,179.17,455.86,Single-ply,SBD,M
Boys,124.74,5,Luke Stevenson,Cuero,120.66,181.44,115.67,156.49,453.59,Single-ply,SBD,M
Boys,124.74,6,Dalton Nowotny,Gonzales,115.67,156.49,83.91,142.88,383.29,Single-ply,SBD,M
Boys,124.74,7,Austin Shed,Smithville,124.28,117.93,106.59,117.93,342.46,Single-ply,SBD,M
Boys,124.74,8,Kyle Klett,Cuero,114.31,124.74,88.45,124.74,337.93,Single-ply,SBD,M
Boys,124.74+,1,Cody Jurek,Gonzales,128.37,181.44,117.93,206.38,505.76,Single-ply,SBD,M
Boys,124.74+,2,Jacob Cuellar,Cuero,140.61,208.65,124.74,172.37,505.76,Single-ply,SBD,M
