Place,WeightClassKg,Sex,Division,Name,BirthYear,BodyweightKg,Country,Best3SquatKg,Best3BenchKg,Best3DeadliftKg,TotalKg,Bench4Kg,Event,Equipment
1,44,F,Open,Raija Koskinen-Jurkko,1963,43.9,Finland,167.5,75,162.5,405,,SBD,Single-ply
2,44,F,Open,Wei-Ling Chen,1982,43.6,Taiwan,152.5,65,165,382.5,,SBD,Single-ply
3,44,F,Open,Bénédicte LePanse,1978,43.6,France,120,67.5,130,317.5,,SBD,Single-ply
4,44,F,Open,Marion Friedrich,1965,43.6,Germany,115,77.5,117.5,310,,SBD,Single-ply
5,44,F,Open,Eva Svjanteková,1973,44,Slovakia,100,95.5,92.5,287.5,,SBD,Single-ply
6,44,F,Open,Ernie Dickey,1984,44,USA,100,60,125,285,,SBD,Single-ply
1,48,F,Open,Kuan-Ting Chen,1977,47.5,Taiwan,172.5,87.5,160,420,,SBD,Single-ply
2,48,F,Open,Natalya Shapovalova,1983,47.6,Russia,172.54,87.5,160,420,,SBD,Single-ply
3,48,F,Open,Jennifer Maile,1984,47.9,USA,150,95,167.5,412.5,,SBD,Single-ply
4,48,F,Open,Sabine Guillaume,1963,47.1,France,130,67.5,155,352.5,,SBD,Single-ply
5,48,F,Open,Heather Hampson,1966,47.7,UK,130,70,147.5,347.5,,SBD,Single-ply
6,48,F,Open,Mart Kleszczynska,1979,47.5,Poland,130,75,132.5,337.5,,SBD,Single-ply
7,48,F,Open,Vanessa Serrano-Martin,1976,47,France,132.5,70,130,332.5,,SBD,Single-ply
8,48,F,Open,Ines Tronke,1979,46.8,Germany,117.5,62.5,122.5,302.5,,SBD,Single-ply
9,48,F,Open,Mary Macken,1961,47.2,Australia,110,52.5,137.5,300,,SBD,Single-ply
10,48,F,Open,Aneta Rutka,1982,45.5,Poland,120,52.5,120,292.5,,SBD,Single-ply
DQ,48,F,Open,Yi-Ju Chou,1980,47.7,Taiwan,135,,,,,SBD,Single-ply
1,52,F,Open,Svetlana Nikolaenko,1981,51.7,Russia,195,117.5,185,497.5,,SBD,Single-ply
2,52,F,Open,Natalia Eltsova,1978,51.8,Russia,180,97.5,162.5,440,,SBD,Single-ply
3,52,F,Open,Suzanne Hartwig-Gary,1968,51.3,USA,162.5,97.5,167.5,427.5,,SBD,Single-ply
4,52,F,Open,Mervi Sirkiä,1972,52,Finland,152.5,90,172.5,415,,SBD,Single-ply
5,52,F,Open,Stephani Cornette,1975,51,France,165,90,150,405,,SBD,Single-ply
6,52,F,Open,Tetyan Primenchuk,1972,51.2,Ukraine,150,87.5,157.5,395,,SBD,Single-ply
7,52,F,Open,Teresa Sawyer,1963,51.4,UK,130,82.5,152.5,365,,SBD,Single-ply
8,52,F,Open,Deborah Groves,1971,51.5,Australia,117.5,75,132.5,325,,SBD,Single-ply
9,52,F,Open,Mandakini Mahanta,1978,49.9,India,105,60,135,300,,SBD,Single-ply
DQ,52,F,Open,Mervi Anita Rantamäki,1974,51.6,Finland,,,,,,SBD,Single-ply
1,56,F,Open,Inna Filimonova #1,1976,55.8,Russia,213,105,182.5,500,,SBD,Single-ply
2,56,F,Open,Pirjo Savola,1968,55.7,Finland,187.5,87.5,200,475,,SBD,Single-ply
3,56,F,Open,Michelle Amsden,1979,55.5,USA,165,100,180,445,,SBD,Single-ply
4,56,F,Open,Laura Locatelli,1957,55.7,Italy,162.5,82.5,190,435,,SBD,Single-ply
5,56,F,Open,Virpi Kehänen,1979,55.9,Finland,172.5,80,175,427.5,,SBD,Single-ply
6,56,F,Open,Antoinette Kemper,1965,55.7,Germany,152.5,80,160,392.5,,SBD,Single-ply
7,56,F,Open,Jeannette Gevers,1962,55.9,Australia,150,72.5,145,367.5,,SBD,Single-ply
8,56,F,Open,Dana Moosová,1983,55.4,Czechia,130,70,140,340,,SBD,Single-ply
9,56,F,Open,Tania Green,1971,55.3,New Zealand,107.5,82.5,122.5,312.5,,SBD,Single-ply
DQ,56,F,Open,Magdolna Petróczki,1968,55.2,Hungary,,,,,,SBD,Single-ply
1,60,F,Open,Valentina Nelyubova,1966,58.9,Russia,197.5,142.5,185,525,,SBD,Single-ply
2,60,F,Open,Lesya Guminska,1980,59.7,Ukraine,207.5,110,195,512.5,,SBD,Single-ply
3,60,F,Open,Svitlan Poplavska,1966,59.8,Ukraine,192.5,110,190,492.5,,SBD,Single-ply
4,60,F,Open,Eeva Nikander,1967,59.7,Finland,170,125,187.5,482.5,,SBD,Single-ply
5,60,F,Open,Dana Matejova,1975,59.9,Slovakia,200,110,172.5,482.5,,SBD,Single-ply
6,60,F,Open,Birgit Fischer,1963,58.4,Germany,175,90,202.5,467.5,,SBD,Single-ply
7,60,F,Open,Aigul Gaifulina,1979,59.4,Kazakhstan,175,97.5,195,467.5,,SBD,Single-ply
8,60,F,Open,Aly Keizer,1951,60,Netherlands,147.5,82.5,167.5,397.5,,SBD,Single-ply
9,60,F,Open,Nagarit Szekelyne,1974,57.7,Hungary,140,92.5,160,392.5,,SBD,Single-ply
10,60,F,Open,Romy Schreiber,1979,59.7,Germany,140,62.5,150,352.5,,SBD,Single-ply
DQ,60,F,Open,Mandeep Kaur,,59.9,India,,,,,,SBD,Single-ply
1,67.5,F,Open,Marina Kudinova,1977,63.4,Russia,240,137.5,217.5,595,,SBD,Single-ply
2,67.5,F,Open,Valida Iskandarova,1974,63.7,Kazakhstan,200,117.5,207.5,525,,SBD,Single-ply
3,67.5,F,Open,Inger Blikra,1961,67.1,Norway,200,110,212.5,522.5,,SBD,Single-ply
4,67.5,F,Open,Päivi Haapoja,1965,66.9,Finland,200,92.5,202.5,495,,SBD,Single-ply
5,67.5,F,Open,G. Rajrajeshwari,1975,65.3,India,182.5,120,185,487.5,,SBD,Single-ply
6,67.5,F,Open,Kara Bohigian-Smith,1975,67.3,USA,167.5,107.5,195,470,,SBD,Single-ply
7,67.5,F,Open,Marian Gibson #1,1964,65.1,UK,160,110,185,455,,SBD,Single-ply
8,67.5,F,Open,Michaela Näfe,1974,63.9,Germany,142.5,92.5,195,430,,SBD,Single-ply
9,67.5,F,Open,Anke Wendt,1978,63.9,Germany,167.5,80,175,422.5,,SBD,Single-ply
10,67.5,F,Open,Maria Pia Moscianese,1963,66.7,Italy,150,80,185,415,,SBD,Single-ply
11,67.5,F,Open,Anna Dittler,1946,64.9,Hungary,170,82.5,160,412.5,,SBD,Single-ply
12,67.5,F,Open,Mary Giffin,1972,66.9,Australia,150,85,170,405,,SBD,Single-ply
13,67.5,F,Open,Kirsten Borgaard,1960,65.5,Denmark,140,82.5,172.5,395,,SBD,Single-ply
14,67.5,F,Open,Manisha Shukla,1978,64,India,105,35,110,250,,SBD,Single-ply
1,75,F,Open,Svetlana Dedyulya,1975,74.5,Russia,242.5,165,210,617.5,,SBD,Single-ply
2,75,F,Open,Larysa Ivanova,1975,74.7,Ukraine,235,125,215,575,,SBD,Single-ply
3,75,F,Open,Tamara Bahriy,1974,74,Ukraine,212.5,137.5,215,565,,SBD,Single-ply
4,75,F,Open,Anne Sigrid Stiklestad,1975,74.8,Norway,230,110,200,540,,SBD,Single-ply
5,75,F,Open,Priscilla Ribic,1972,72.3,USA,195,117.5,217.5,530,,SBD,Single-ply
6,75,F,Open,Tati Kudryavtseva,1982,72.8,Kazakhstan,195,140,195,530,,SBD,Single-ply
7,75,F,Open,Cécile Jamin,1966,68.8,France,195,100,205,500,,SBD,Single-ply
8,75,F,Open,Monika Parra,1970,70.7,Spain,182.5,105,190,477.5,,SBD,Single-ply
9,75,F,Open,Eva-Maria Gall,1970,71.7,Germany,160,112.5,197.5,470,,SBD,Single-ply
10,75,F,Open,Joke van der Meulen,1951,68.8,Netherlands,162.5,85,170,417.5,,SBD,Single-ply
11,75,F,Open,Susanne Cleve,1964,71.3,Germany,145,90,180,415,,SBD,Single-ply
1,82.5,F,Open,Tatyana Puzanova,1974,81.9,Russia,240,150,235,625,155.5,SBD,Single-ply
2,82.5,F,Open,Viktoria Posmitna,1966,81.8,Ukraine,245,135,222.5,602.5,,SBD,Single-ply
3,82.5,F,Open,Iryna Yavorska,1981,81.3,Ukraine,220,135,222.5,577.5,,SBD,Single-ply
4,82.5,F,Open,Chiu-Hua Hsieh,1980,79.7,Taiwan,215,135,200,550,,SBD,Single-ply
5,82.5,F,Open,Monica Porter,1967,79.5,UK,200,105,220,525,,SBD,Single-ply
6,82.5,F,Open,Sannah Mogensen,1968,82.3,Denmark,170,100,195,465,,SBD,Single-ply
1,90,F,Open,Irina Lugovaya,1974,89,Russia,245,165,225,635,,SBD,Single-ply
2,90,F,Open,Inna Orobets,1971,89.1,Ukraine,227.5,132.5,210,570,,SBD,Single-ply
3,90,F,Open,Leslie Look,1970,85.9,USA,230,110,222.5,562.5,,SBD,Single-ply
4,90,F,Open,Natalia Polichuk,1978,85.7,Ukraine,225,135,200,560,,SBD,Single-ply
5,90,F,Open,Ielja Strik,1973,83.3,Netherlands,210,130,195,535,,SBD,Single-ply
6,90,F,Open,Jessica Wattkins,1980,88.1,USA,215,115,205,535,,SBD,Single-ply
7,90,F,Open,Jackie Buckley-Gray,1967,88.6,New Zealand,190,110,210,510,,SBD,Single-ply
8,90,F,Open,Anna Śliwińska,1982,82.6,Poland,200,120,187.5,507.5,,SBD,Single-ply
9,90,F,Open,Chia-Hui Tsai,1981,83.5,Taiwan,205,117.5,185,507.5,,SBD,Single-ply
10,90,F,Open,Katariina Nokua,1973,89.5,Finland,190,100,187.5,477.5,,SBD,Single-ply
11,90,F,Open,Brenda van der Meulen,1978,89.7,Netherlands,182.5,117.5,175,475,,SBD,Single-ply
12,90,F,Open,Jennifer Keane,1977,84.5,UK,185,95,185,465,,SBD,Single-ply
13,90,F,Open,Monika Trum,1975,83.4,Germany,170,105,160,435,,SBD,Single-ply
14,90,F,Open,Katarin Kardosova,1976,87.4,Slovakia,150,100,160,410,,SBD,Single-ply
15,90,F,Open,Bhanumati Mendon,1957,89.1,India,130,52.5,140,322.5,,SBD,Single-ply
1,90+,F,Open,Galina Karpova,1968,113,Russia,285,160,225,670,,SBD,Single-ply
2,90+,F,Open,Chen-Yeh Chao,1971,113.3,Taiwan,265,170,220,655,,SBD,Single-ply
3,90+,F,Open,Liz Willett,1972,144.5,USA,267.5,165,195,627.5,,SBD,Single-ply
4,90+,F,Open,Vicky Hembree,1961,97.4,USA,227.5,150,215,592.5,,SBD,Single-ply
5,90+,F,Open,Ganna Ganenko,1975,104.5,Ukraine,235,160,190,585,,SBD,Single-ply
6,90+,F,Open,Joanne Schaefer,1967,99.9,Netherlands,220,135,202.5,557.5,,SBD,Single-ply
7,90+,F,Open,Suzanne Last,1970,118.5,UK,200,112.5,202.5,515,,SBD,Single-ply
8,90+,F,Open,Wilna Monte,1968,92.3,Netherlands,165,105,190,460,,SBD,Single-ply
9,90+,F,Open,Sampa Guha,1967,91.2,India,180,100,160,440,,SBD,Single-ply
