Name,WeightClassKg,Division,Sex,Age,BodyweightKg,AgeRange,Squat1Kg,Squat2Kg,Squat3Kg,Squat4Kg,Best3SquatKg,Bench1Kg,Bench2Kg,Bench3Kg,Bench4Kg,Best3BenchKg,Deadlift1Kg,Deadlift2Kg,Deadlift3Kg,Deadlift4Kg,Best3DeadliftKg,TotalKg,Event,Equipment,Place
Elaine Grimwood,44,F_OEM_APF,F,31,,,-130,130,-141,-141,130,62.5,67.5,72.5,,72.5,127.5,137.5,-145,,137.5,340,SBD,Multi-ply,1
Griselle Ufret,44,F_OEM_APF,F,47,,,97.5,105,112.5,,112.5,57.5,62.5,-67.5,,62.5,125,132.5,-142.5,,132.5,307.5,SBD,Multi-ply,2
Nichelle Whitfield,56,F_OEM_APF,F,14,,,-155,160,170,,170,77.5,82.5,-85,,82.5,157.5,-165,-165,,157.5,410,SBD,Multi-ply,1
Nance Avigliano,60,F_OEM_APF,F,45,60,,205,220,230,,230,100,-105,-105,,100,205,210,-215,,210,540,SBD,Multi-ply,1
Amy Weisberger,60,F_OEM_APF,F,37,58.4,,-190,190,205,,205,125,-137.5,-137.5,,125,197.5,-210,-212.5,,197.5,527.5,SBD,Multi-ply,2
Vanessa Ware,60,F_OEM_APF,F,38,58.4,,147.5,162.5,-172.5,,162.5,92.5,100,105,,105,157.5,167.5,182.5,,182.5,450,SBD,Multi-ply,3
Mariah Liggett,67.5,F_OEM_APF,F,43,,,-205,210,-227.5,,210,-125,125,130,,130,185,192.5,197.5,,197.5,537.5,SBD,Multi-ply,1
Nancy Dangerfield,67.5,F_OEM_APF,F,45,,,170,-182.5,187.5,,187.5,87.5,92.5,-97.5,,92.5,211,227.5,-238.5,,227.5,507.5,SBD,Multi-ply,2
Amy Vaughn,67.5,F_OEM_APF,F,21,66.09,,185,197.5,-205,,197.5,95,102.5,105,110,105,160,175,-182.5,182.5,175,477.5,SBD,Multi-ply,3
Julie Scanlon,75,F_OEM_APF,F,26,68.83,,205,217.5,227.5,,227.5,137.5,150,-160,,150,205,-217.5,-217.5,,205,582.5,SBD,Multi-ply,1
Joyce Tacktill,75,F_OEM_APF,F,47,,,170,177.5,185,,185,117.5,125,-130,,125,170,177.5,-185,,177.5,487.5,SBD,Multi-ply,2
Kimberly Pfeiffer-Packer,75,F_OEM_APF,F,41,,,165,177.5,-185,,177.5,70,75,77.5,,77.5,140,155,162.5,,162.5,417.5,SBD,Multi-ply,3
Krista Ford,82.5,F_OEM_APF,F,35,,,202.5,207.5,245,,245,62.5,85,102.5,,102.5,202.5,227.5,245,,245,592.5,SBD,Multi-ply,1
Becca Swanson,90,F_OEM_APF,F,28,,,265,277.5,288,,288,145,152.5,155,,155,260,267.5,-272.5,,267.5,710,SBD,Multi-ply,1
Chris Leverett,60,M_OEM_APF,M,30,,,205,217.5,-222.5,,217.5,-110,115,120,,120,217.5,-230,-230,,217.5,555,SBD,Multi-ply,1
TJ Hoerner,67.5,M_OEM_APF,M,24,65.6,,265,287.5,300,-312.5,300,142.5,-152.5,-152.5,,142.5,242.5,260,-267.5,,260,702.5,SBD,Multi-ply,1
Eric Adolf,67.5,M_OEM_APF,M,23,,,200,-215,215,,215,130,140,-142.5,,140,217.5,-230,-230,,217.5,572.5,SBD,Multi-ply,2
Vincent Centauro,67.5,M_OEM_APF,M,23,66.5,,170,182.5,200,,200,115,127.5,137.5,,137.5,192.5,-215,-217.5,,192.5,530,SBD,Multi-ply,3
Angelo Berardinelli,75,M_OEM_APF,M,36,,,-327.5,345,352.5,,352.5,182.5,197.5,-205,,197.5,272.5,-287.5,-287.5,,272.5,822.5,SBD,Multi-ply,1
Ron Palmer,82.5,M_OEM_APF,M,29,,,310,-327.5,337.5,,337.5,200,212.5,-220,,212.5,295,312.5,-320,,312.5,862.5,SBD,Multi-ply,1
Joe Daugherty,82.5,M_OEM_APF,M,31,,,307.5,327.5,340,,340,212.5,-227.5,-227.5,,212.5,285,-305,305,,305,857.5,SBD,Multi-ply,2
Tom Lavelle,82.5,M_OEM_APF,M,35,,,275,305,307.5,,307.5,192.5,202.5,215,,215,237.5,250,260,,260,782.5,SBD,Multi-ply,3
Brian Strickland,82.5,M_OEM_APF,M,32,,,265,282.5,-295,,282.5,182.5,190,-192.5,,190,252.5,-272.5,272.5,,272.5,745,SBD,Multi-ply,4
Michael Coe,90,M_OEM_APF,M,31,,,295,320,-327.5,,320,195,205,-220,,205,250,262.5,-275,,262.5,787.5,SBD,Multi-ply,1
Lester Maslow,90,M_OEM_APF,M,43,,,290,-320,-320,,290,175,-187.5,-197.5,,175,265,285,-307.5,,285,750,SBD,Multi-ply,2
Paul Lauffer,90,M_OEM_APF,M,27,,,-227.5,-227.5,227.5,,227.5,-195,-195,195,,195,227.5,-255,-255,,227.5,650,SBD,Multi-ply,3
John Wardell,90,M_OEM_APF,M,,,,340,365,382.5,-403,382.5,-235,-235,-242.5,,,,,,,,,SBD,Multi-ply,DQ
Travis Mash,100,M_OEM_APF,M,29,,,367.5,385,400,,400,230,-242.5,-242.5,,230,327.5,337.5,-342.5,,337.5,967.5,SBD,Multi-ply,1
Kenny Patterson,100,M_OEM_APF,M,29,,,347.5,370,-377.5,,370,283.5,-300,305,,305,272.5,-287.5,-295,,272.5,947.5,SBD,Multi-ply,2
Paul Urchick,100,M_OEM_APF,M,,,,380,-410,-417.5,,380,230,240,247.5,,247.5,317.5,-335,-335,,317.5,945,SBD,Multi-ply,3
Keith Ferrara,100,M_OEM_APF,M,30,,,355,,,,355,,-220,220,,220,320,,,,320,895,SBD,Multi-ply,4
Rick Lawrence,100,M_OEM_APF,M,37,,,295,322.5,327.5,,327.5,242.5,257.5,-263.5,,257.5,-250,250,-260,,250,835,SBD,Multi-ply,5
Stan DuPlessis,100,M_OEM_APF,M,,,16-17,300,-332.5,332.5,340,332.5,150,172.5,-177.5,,172.5,250,270,281.5,,281.5,786.5,SBD,Multi-ply,6
Jose Garcia,110,M_OEM_APF,M,25,,,365,-392.5,392.5,,392.5,235,242.5,250,,250,310,325,332.5,,332.5,975,SBD,Multi-ply,1
Brian Weston,110,M_OEM_APF,M,33,,,365,385,400,,400,237.5,-245,245,,245,297.5,320,327.5,,327.5,972.5,SBD,Multi-ply,2
Clay Castile,110,M_OEM_APF,M,32,,,335,-360,360,,360,215,227.5,235,,235,292.5,312.5,-320,,312.5,907.5,SBD,Multi-ply,3
Zdenek Voprada,110,M_OEM_APF,M,27,,,320,337.5,352.5,,352.5,205,212.5,222.5,,222.5,310,320,-325,,320,895,SBD,Multi-ply,4
Jim Gorrell,110,M_OEM_APF,M,30,,,352.5,-372.5,372.5,,372.5,200,210,220,,220,290,300,-320,,300,892.5,SBD,Multi-ply,5
Kevin Thomas,110,M_OEM_APF,M,33,,,-327.5,327.5,-350,,327.5,222.5,-237.5,240,,240,295,312.5,-317.5,,312.5,880,SBD,Multi-ply,6
Joe Avigliano,110,M_OEM_APF,M,42,105.8,,342.5,350,365,,365,142.5,-182.5,-200,,142.5,272.5,282.5,-292.5,,282.5,790,SBD,Multi-ply,7
Chris Mason #1,110,M_OEM_APF,M,30,,,-362.5,-385,-385,,,,,,,,,,,,,,SBD,Multi-ply,DQ
Joe Ladnier,125,M_OEM_APF,M,38,118.5,,365,-375,385,,385,277.5,292.5,300,,300,320,-330,-330,,320,1005,SBD,Multi-ply,1
Mike Lanier #1,125,M_OEM_APF,M,30,122.47,,340,365,,,365,217.5,-242.5,242.5,,242.5,315,327.5,,,327.5,935,SBD,Multi-ply,2
Christian Taylor,125,M_OEM_APF,M,29,123.69,,305,320,327.5,,327.5,280,287.5,-297.5,,287.5,267.5,290,302.5,,302.5,917.5,SBD,Multi-ply,3
Zach Passman,125,M_OEM_APF,M,,122.7,,327.5,340,350,,350,-227.5,227.5,245,,245,295,312,-320,,312,907,SBD,Multi-ply,4
Zach Hudak,125,M_OEM_APF,M,22,120.61,,-355,355,-370,,355,212.5,-227.5,227.5,,227.5,-317.5,317.5,320,,320,902.5,SBD,Multi-ply,5
Greg Jurkowski,125,M_OEM_APF,M,38,,,317.5,342.5,347.5,,347.5,192.5,207.5,212.5,,212.5,312.5,325,330,,330,890,SBD,Multi-ply,6
Noel Levario,125,M_OEM_APF,M,28,,,367.5,395,-410,,395,-242.5,-245,-260,,,,,,,,,SBD,Multi-ply,DQ
Mark Swank,125,M_OEM_APF,M,34,,,312.5,330,337.5,,337.5,-237.5,-237.5,-237.5,,,,,,,,,SBD,Multi-ply,DQ
Steve Goggins,125,M_OEM_APF,M,38,,,-432.5,-432.5,-461,,,,,,,,,,,,,,SBD,Multi-ply,DQ
Oan Basson,140,M_OEM_APF,M,24,,,-377.5,390,410,,410,255,265,282.5,,282.5,207.5,297.5,307.5,,307.5,1000,SBD,Multi-ply,1
Billy Mimnaugh,140,M_OEM_APF,M,28,,,-375,385,-410,,385,245,262.5,-272.5,,262.5,327.5,352.5,-365,,352.5,1000,SBD,Multi-ply,2
Jon Grove,140,M_OEM_APF,M,,,,305,410,,,410,200,252.5,260,,260,330,-365,-365,,330,1000,SBD,Multi-ply,3
Michael Olmo,140,M_OEM_APF,M,27,130.63,,-387.5,-412.5,412.5,,412.5,232.5,242.5,-250,,242.5,200,-320,320,,320,975,SBD,Multi-ply,4
Adam Howell #1,140,M_OEM_APF,M,25,138.98,,350,-377.5,-387.5,,350,250,-272.5,-275,,250,-282.5,282.5,297.5,,297.5,897.5,SBD,Multi-ply,5
Jay Rhyne,140,M_OEM_APF,M,29,131.18,,375,-405,,,375,250,265,-272.5,,265,,,,,,,SBD,Multi-ply,DQ
Aaron Ross,140,M_OEM_APF,M,25,,,-372.5,-372.5,,,,,,,,,,,,,,,SBD,Multi-ply,DQ
Aaron Lawrence,140,M_OEM_APF,M,32,,,342.5,352.5,,,352.5,-242.5,-242.5,-242.5,,,,,,,,,SBD,Multi-ply,DQ
Garry Frank #1,140+,M_OEM_APF,M,,164.6,,427.5,-460,460,,460,302.5,327.5,-337.5,,327.5,385,410,-420,,410,1197.5,SBD,Multi-ply,1
Matthew Smith #4,140+,M_OEM_APF,M,28,156.9,,385,422.5,435,,435,277.5,302.5,-320,,302.5,337.5,355,-372.5,,355,1092.5,SBD,Multi-ply,2
Craig Gallo,140+,M_OEM_APF,M,30,146.55,,422.5,447.5,462.5,,462.5,215,252.5,-262.5,,252.5,297.5,320,347.5,,347.5,1062.5,SBD,Multi-ply,3
Lee Barry,140+,M_OEM_APF,M,26,144.65,,365,392.5,400,,400,282.5,-295,295,,295,352.5,365,-377.5,,365,1060,SBD,Multi-ply,4
David Nettles,140+,M_OEM_APF,M,33,151.64,,410,-432.5,432.5,,432.5,240,255,265,,265,-340,340,347.5,,347.5,1045,SBD,Multi-ply,5
Brent Mikesell,140+,M_OEM_APF,M,35,150.41,,305,410,,,410,200,252.5,260,,260,330,-365,-365,,330,1000,SBD,Multi-ply,6
Kieran Kidder,140+,M_OEM_APF,M,,,,-410,417.5,-455,,417.5,242.5,-272.5,-272.5,,242.5,287.5,312.5,,,312.5,972.5,SBD,Multi-ply,7
Edward Russ,140+,M_OEM_APF,M,34,161.48,,387.5,417.5,440,,440,240,-255,255,,255,250,272.5,-305,,272.5,967.5,SBD,Multi-ply,8
Tom Skiver,140+,M_OEM_APF,M,35,150.41,,-410,-410,-410,,,,,,,,,,,,,,SBD,Multi-ply,DQ
Angelo Berardinelli,75,M_LWT_WPO,M,36,,,-327.5,345,352.5,,352.5,182.5,197.5,-205,,197.5,272.5,-287.5,-287.5,,272.5,822.5,SBD,Multi-ply,1
TJ Hoerner,75,M_LWT_WPO,M,24,65.6,,265,287.5,300,,300,142.5,-152.5,-152.5,,142.5,242.5,260,-267.5,,260,702.5,SBD,Multi-ply,2
Chris Leverett,75,M_LWT_WPO,M,30,60,,205,217.5,-222.5,,217.5,-110,115,120,,120,217.5,-230,-230,,217.5,555,SBD,Multi-ply,5
Dan Petrillo,75,M_LWT_WPO,M,22,,,-245,245,260,,260,170,182.5,-187.5,,182.5,-252.5,252.5,-285,,252.5,695,SBD,Multi-ply,3
Eric Adolf,75,M_LWT_WPO,M,23,67.5,,200,-215,215,,215,130,140,-142.5,,140,217.5,-230,-230,,217.5,572.5,SBD,Multi-ply,4
Travis Mash,100,M_MWT_WPO,M,29,,,367.5,385,400,,400,230,-242.5,-242.5,,230,327.5,337.5,-342.5,,337.5,967.5,SBD,Multi-ply,1
Kenny Patterson,100,M_MWT_WPO,M,29,,,347.5,370,-377.5,,370,283.5,-300,305,,305,272.5,-287.5,-295,,272.5,947.5,SBD,Multi-ply,2
Paul Urchick,100,M_MWT_WPO,M,,,,380,-410,-417.5,,380,230,240,247.5,,247.5,317.5,-335,-335,,317.5,945,SBD,Multi-ply,3
Brian Strickland,100,M_MWT_WPO,M,32,82.5,,265,282.5,-295,,282.5,182.5,190,-192.5,,190,252.5,-272.5,272.5,,272.5,745,SBD,Multi-ply,6
Rick Lawrence,100,M_MWT_WPO,M,37,,,295,322.5,327.5,,327.5,242.5,257.5,-263.5,,257.5,-250,250,-260,,250,835,SBD,Multi-ply,4
Michael Coe,100,M_MWT_WPO,M,31,90,,295,320,-327.5,,320,195,205,-220,,205,250,262.5,-275,,262.5,787.5,SBD,Multi-ply,5
Garry Frank #1,100+,M_HWT_WPO,M,,164.6,,427.5,-460,460,,460,302.5,327.5,-337.5,,327.5,385,410,-420,,410,1197.5,SBD,Multi-ply,1
Matthew Smith #4,100+,M_HWT_WPO,M,28,156.9,,305,422.5,435,,435,277.5,302.5,-320,,302.5,337.5,355,-372.5,,355,1092.5,SBD,Multi-ply,2
Craig Gallo,100+,M_HWT_WPO,M,30,146.55,,422.5,447.5,462.5,,462.5,215,252.5,-262.5,,252.5,297.5,320,347.5,,347.5,1062.5,SBD,Multi-ply,3
Joe Ladnier,100+,M_HWT_WPO,M,38,118.5,,365,-375,385,,385,277.5,292.5,300,,300,320,-330,-330,,320,1005,SBD,Multi-ply,6
David Nettles,100+,M_HWT_WPO,M,33,151.64,,410,-432.5,432.5,,432.5,240,255,265,,265,-340,340,347.5,,347.5,1045,SBD,Multi-ply,4
Brian Weston,100+,M_HWT_WPO,M,33,110,,365,385,400,,400,237.5,-245,245,,245,297.5,320,327.5,,327.5,972.5,SBD,Multi-ply,11
Donnie Thompson #1,100+,M_HWT_WPO,M,,160.57,,410,-442.5,,,410,282.5,-302.5,-302.5,,282.5,337.5,-367.5,,,337.5,1030,SBD,Multi-ply,5
Oan Basson,100+,M_HWT_WPO,M,24,140,,-377.5,390,410,,410,255,265,282.5,,282.5,207.5,297.5,307.5,,307.5,1000,SBD,Multi-ply,7
Billy Mimnaugh,100+,M_HWT_WPO,M,28,140,,-375,385,-410,,385,245,262.5,-272.5,,262.5,327.5,352.5,-365,,352.5,1000,SBD,Multi-ply,8
Brent Mikesell,100+,M_HWT_WPO,M,35,150.41,,305,410,,,410,200,252.5,260,,260,330,-365,-365,,330,1000,SBD,Multi-ply,10
Jon Grove,100+,M_HWT_WPO,M,,140,,305,410,,,410,200,252.5,260,,260,330,-365,-365,,330,1000,SBD,Multi-ply,9
Marc Bartley,100+,M_HWT_WPO,M,,,,-375,375,,,375,250,-272.5,-272.5,,250,295,-320,,,295,920,SBD,Multi-ply,13
Edward Russ,100+,M_HWT_WPO,M,34,161.48,,387.5,417.5,440,,440,240,-255,255,,255,250,272.5,-305,,272.5,967.5,SBD,Multi-ply,12
Christian Taylor,100+,M_HWT_WPO,M,29,123.69,,305,320,327.5,,327.5,280,287.5,-297.5,,287.5,267.5,290,302.5,,302.5,917.5,SBD,Multi-ply,14
Kevin Thomas,100+,M_HWT_WPO,M,33,110,,-327.5,327.5,-350,,327.5,222.5,-237.5,240,,240,295,312.5,-317.5,,312.5,880,SBD,Multi-ply,16
Adam Howell #1,100+,M_HWT_WPO,M,25,138.98,,350,-377.5,-387.5,,350,250,-272.5,-275,,250,-282.5,282.5,297.5,,297.5,897.5,SBD,Multi-ply,15
Joe Avigliano,100+,M_HWT_WPO,M,42,105.8,,342.5,350,365,,365,142.5,-182.5,-200,,142.5,272.5,282.5,-292.5,,282.5,790,SBD,Multi-ply,17
Chris Mason #1,100+,M_HWT_WPO,M,30,110,,-362.5,-385,-385,,,,,,,,,,,,,,SBD,Multi-ply,DQ
Steve Goggins,100+,M_HWT_WPO,M,38,125,,-432.5,-432.5,-461,,,,,,,,,,,,,,SBD,Multi-ply,DQ
Noel Levario,100+,M_HWT_WPO,M,28,125,,367.5,395,-410,,395,-242.5,-245,-260,,,,,,,,,SBD,Multi-ply,DQ
