Division,WeightClassKg,Place,Name,Team,BodyweightKg,Best3SquatKg,Best3BenchKg,Best3DeadliftKg,TotalKg,Equipment,Event,Sex
Boys,51.71,1,Jason Ayers,Lampasas,51.17,145.15,79.38,163.29,387.82,Single-ply,SBD,M
Boys,51.71,2,Jonathan Flores,Lampasas,51.17,127.01,83.91,156.49,367.41,Single-ply,SBD,M
Boys,55.79,3,Daniel Herrera,Navasota,51.89,120.2,86.18,127.01,333.39,Single-ply,SBD,M
Boys,51.71,4,Diego Rivera,Mexia,48.81,136.08,63.5,127.01,326.59,Single-ply,SBD,M
Boys,51.71,5,Bailey Dennis,Alvarado,51.62,129.27,65.77,120.2,315.25,Single-ply,SBD,M
Boys,51.71,6,Cesar Montano,Stephenville,50.8,117.93,72.57,113.4,303.91,Single-ply,SBD,M
Boys,55.79,7,Alex Schaefer,Venus,51.8,115.67,63.5,120.2,299.37,Single-ply,SBD,M
Boys,51.71,DQ,Oakley Bruder,Smithville,51.71,106.59,,,,Single-ply,SBD,M
Boys,55.79,DQ,Philip Sharp,Robinson,51.89,,,,,Single-ply,SBD,M
Boys,51.71,DQ,Wrenn Bagley,Salado,51.71,,,,,Single-ply,SBD,M
Boys,59.87,1,Oscar Perez,Venus,55.88,192.78,97.52,176.9,467.2,Single-ply,SBD,M
Boys,55.79,2,Isaiah Mesa,Taylor,55.52,149.69,106.59,154.22,410.5,Single-ply,SBD,M
Boys,59.87,3,Marlwin Perez,Brownwood,55.88,158.76,83.91,151.95,394.63,Single-ply,SBD,M
Boys,59.87,4,Dakota Cavazos,Lampasas,55.97,136.08,83.91,138.35,358.34,Single-ply,SBD,M
Boys,59.87,5,Josh Burkhalter,Caldwell,55.88,147.42,65.77,142.88,356.07,Single-ply,SBD,M
Boys,55.79,6,Juan Sanchez,Mexia,54.88,124.74,72.57,138.35,335.66,Single-ply,SBD,M
Boys,55.79,7,Alec Bailey,Mexia,55.25,127.01,61.23,136.08,324.32,Single-ply,SBD,M
Boys,55.79,DQ,Tye'Rus Jones,Brownwood,55.16,,,,,Single-ply,SBD,M
Boys,55.79,DQ,Josh Vandygrift,Godley,55.79,,,,,Single-ply,SBD,M
Boys,55.79,DQ,Ricardo Dela Rosa,Waco La Vega,55.79,,,,,Single-ply,SBD,M
Boys,59.87,1,Jorge Perez,Venus,58.79,210.92,88.45,181.44,480.81,Single-ply,SBD,M
Boys,67.13,2,Michael Bartlett,Robinson,60.06,201.85,97.52,181.44,480.81,Single-ply,SBD,M
Boys,59.87,3,Dalton Dewveall,Llano,58.97,163.29,90.72,174.63,428.64,Single-ply,SBD,M
Boys,67.13,4,Joseph Herrera,Navasota,60.1,163.29,90.72,167.83,421.84,Single-ply,SBD,M
Boys,67.13,5,Hunter Berry,Sealy,60.1,172.37,79.38,165.56,417.3,Single-ply,SBD,M
Boys,59.87,6,Anthony Montes,Lampasas,58.24,147.42,92.99,158.76,399.16,Single-ply,SBD,M
Boys,59.87,7,Fernando Maldonado,Smithville,59.24,145.15,90.72,163.29,399.16,Single-ply,SBD,M
Boys,59.87,8,Keith Ray,Stephenville,59.15,163.29,72.57,136.08,371.95,Single-ply,SBD,M
Boys,59.87,9,Mason Matthews,Gatesville,57.7,145.15,70.31,154.22,369.68,Single-ply,SBD,M
Boys,59.87,10,Javier Sauceda,China Spring,58.79,113.4,81.65,154.22,349.27,Single-ply,SBD,M
Boys,67.13,1,Chris Hernandez,Venus,65.86,251.74,124.74,217.72,594.21,Single-ply,SBD,M
Boys,74.84,2,Manuel Rodriguez #4,Robinson,67.31,238.14,102.06,244.94,585.13,Single-ply,SBD,M
Boys,74.84,3,Noah Steptoe,Navasota,67.36,217.72,113.4,213.19,544.31,Single-ply,SBD,M
Boys,67.13,4,Christian Rodriques,Llano,65.77,222.26,113.4,181.44,517.1,Single-ply,SBD,M
Boys,67.13,5,Lorenzo Sanchez,Taylor,62.69,185.97,106.59,217.72,510.29,Single-ply,SBD,M
Boys,67.13,6,Cory Sauer,Robinson,66,192.78,127.01,185.97,505.76,Single-ply,SBD,M
Boys,67.13,7,Chance Alvarez,Gatesville,63.41,172.37,106.59,188.24,467.2,Single-ply,SBD,M
Boys,67.13,DQ,Jt Marek,Bellville,65.86,,,,,Single-ply,SBD,M
Boys,74.84,DQ,Decovan Echols,Mexia,67.31,,,,,Single-ply,SBD,M
Boys,67.13,DQ,Jessie Pena,Waco La Vega,67.13,,,,,Single-ply,SBD,M
Boys,74.84,1,Woogie Powell,Navasota,72.85,226.8,140.61,226.8,594.21,Single-ply,SBD,M
Boys,82.1,2,Daniel Hernandez,Taylor,75.02,240.4,120.2,226.8,587.4,Single-ply,SBD,M
Boys,74.84,3,John Botello,Lorena,71.76,199.58,99.79,215.46,514.83,Single-ply,SBD,M
Boys,74.84,4,Kaden Trice,Salado,70.31,206.38,104.33,197.31,508.02,Single-ply,SBD,M
Boys,74.84,5,Chris Blaschke,Smithville,74.75,188.24,122.47,197.31,508.02,Single-ply,SBD,M
Boys,74.84,6,Coby Chambliss,Salado,70.85,197.31,106.59,185.97,489.88,Single-ply,SBD,M
Boys,74.84,7,Emmanuel Silva,Venus,71.67,197.31,95.25,190.51,483.08,Single-ply,SBD,M
Boys,74.84,8,Tyler Stairs,Salado,74.84,181.44,102.06,181.44,464.93,Single-ply,SBD,M
Boys,74.84,DQ,Darius Dorsey,Mexia,74.57,,,,,Single-ply,SBD,M
Boys,74.84,DQ,Trevor Penny,Llano,71.21,195.04,,,,Single-ply,SBD,M
Boys,82.1,1,Everado Araujo,Taylor,80.38,260.82,151.95,244.94,657.71,Single-ply,SBD,M
Boys,82.1,2,Juan Villa,Robinson,79.88,233.6,142.88,217.72,594.21,Single-ply,SBD,M
Boys,82.1,3,Jordan Thompson,Robinson,78.24,213.19,136.08,222.26,571.53,Single-ply,SBD,M
Boys,82.1,4,Van Shamblin,Liberty Hill,78.93,240.4,127.01,204.12,571.53,Single-ply,SBD,M
Boys,82.1,5,Jaric Crider,Bellville,77.56,199.58,120.2,208.65,528.44,Single-ply,SBD,M
Boys,82.1,6,Jace Hankins,Lampasas,81.01,206.38,120.2,199.58,526.17,Single-ply,SBD,M
Boys,82.1,7,Drake Hall,Burnet,79.38,190.51,122.47,181.44,494.42,Single-ply,SBD,M
Boys,82.1,8,Larry Reid,Robinson,80.92,161.03,113.4,185.97,460.4,Single-ply,SBD,M
Boys,82.1,DQ,Alberto Carrillo,Mexia,80.38,,,,,Single-ply,SBD,M
Boys,82.1,DQ,Leonard Abke,Navasota,79.65,222.26,,,,Single-ply,SBD,M
Boys,82.1,DQ,Tanner Vrabel,Liberty Hill,82.1,,,,,Single-ply,SBD,M
Boys,89.81,1,Austin Cude,Navasota,89.72,267.62,172.37,240.4,680.39,Single-ply,SBD,M
Boys,89.81,2,Ricky Thompson,Robinson,88.54,249.48,127.01,258.55,635.03,Single-ply,SBD,M
Boys,89.81,3,Esteban Nunez,Caldwell,89.27,258.55,122.47,254.01,635.03,Single-ply,SBD,M
Boys,89.81,4,Chris Hatch,Taylor,86.09,229.06,163.29,213.19,605.55,Single-ply,SBD,M
Boys,89.81,5,Armando Nunez,Venus,87.18,244.94,131.54,229.06,605.55,Single-ply,SBD,M
Boys,89.81,6,Jared McHazlett,Burnet,88.18,226.8,136.08,226.8,589.67,Single-ply,SBD,M
Boys,89.81,7,David Ramirez,Navasota,88.9,240.4,133.81,195.04,569.26,Single-ply,SBD,M
Boys,89.81,8,Lio Garcia,Stephenville,89.18,201.85,138.35,226.8,566.99,Single-ply,SBD,M
Boys,89.81,9,Ragan Wood,Stephenville,88.27,238.14,131.54,195.04,564.72,Single-ply,SBD,M
Boys,89.81,DQ,Koltan Hampton,China Spring,85.55,,,,,Single-ply,SBD,M
Boys,99.79,1,Taylor Hull,China Spring,97.07,278.96,151.95,231.33,662.24,Single-ply,SBD,M
Boys,99.79,2,Marquez Byrd,Navasota,97.79,249.48,131.54,276.69,657.71,Single-ply,SBD,M
Boys,99.79,3,Manuel Murillo,Venus,98.43,263.08,167.83,226.8,657.71,Single-ply,SBD,M
Boys,99.79,4,Sam Jackson,Gatesville,96.8,238.14,136.08,229.06,603.28,Single-ply,SBD,M
Boys,99.79,5,Guadalupe Silva,Venus,93.89,226.8,129.27,217.72,573.79,Single-ply,SBD,M
Boys,99.79,6,Adam Prado,Lampasas,98.34,224.53,138.35,192.78,555.65,Single-ply,SBD,M
Boys,99.79,7,Jacob Dorton,Robinson,93.89,204.12,113.4,215.46,532.97,Single-ply,SBD,M
Boys,99.79,8,Diego Gutierrez,Robinson,99.79,201.85,140.61,174.63,517.1,Single-ply,SBD,M
Boys,99.79,DQ,Dakota Corbut,Liberty Hill,93.62,,,,,Single-ply,SBD,M
Boys,99.79,DQ,Cooper Haigood,Lorena,95.62,,,,,Single-ply,SBD,M
Boys,109.77,1,Quavious Gamble,Mexia,106.59,306.17,158.76,258.55,723.48,Single-ply,SBD,M
Boys,109.77,2,Paul Dominguez,Taylor,108.68,290.3,192.78,219.99,703.07,Single-ply,SBD,M
Boys,109.77,3,Diamond Cardona,Godley,105.69,272.16,142.88,249.48,664.51,Single-ply,SBD,M
Boys,109.77,4,Lex Leibfried,Bellville,104.33,240.4,158.76,222.26,621.42,Single-ply,SBD,M
Boys,109.77,5,Jacob Martin,Stephenville,106.05,256.28,136.08,222.26,614.62,Single-ply,SBD,M
Boys,109.77,6,Shawn Goldstein,Giddings,104.05,251.74,154.22,206.38,612.35,Single-ply,SBD,M
Boys,109.77,7,Cal Bauer,Navasota,105.78,219.99,158.76,226.8,605.55,Single-ply,SBD,M
Boys,109.77,8,Brandon Taylor,Gatesville,104.24,249.48,117.93,226.8,594.21,Single-ply,SBD,M
Boys,109.77,9,Jose Reyes,Mexia,107.59,231.33,133.81,226.8,591.94,Single-ply,SBD,M
Boys,109.77,10,Ryan Lewis,Brownwood,106.23,231.33,129.27,215.46,576.06,Single-ply,SBD,M
Boys,124.74,1,Byron Bryant,Waco La Vega,121.47,308.44,167.83,265.35,741.62,Single-ply,SBD,M
Boys,124.74,2,Gustavo Bonilla,Robinson,124.19,317.51,163.29,256.28,737.09,Single-ply,SBD,M
Boys,124.74,3,Jordan Rivera,Waco La Vega,117.84,265.35,183.7,254.01,703.07,Single-ply,SBD,M
Boys,124.74,4,Max Driscoll,Godley,124.47,265.35,188.24,215.46,669.05,Single-ply,SBD,M
Boys,124.74,5,Roberto Requena,Caldwell,119.2,256.28,156.49,247.21,659.98,Single-ply,SBD,M
Boys,124.74,6,Austin Northcutt,Stephenville,114.94,231.33,154.22,247.21,632.76,Single-ply,SBD,M
Boys,124.74,7,Bailey Adair,Gatesville,114.94,274.42,142.88,199.58,616.89,Single-ply,SBD,M
Boys,124.74,8,Colton Robinett,Groesbeck,116.57,240.4,140.61,222.26,603.28,Single-ply,SBD,M
Boys,124.74,9,Lane Michna,Lorena,114.85,244.94,129.27,226.8,601.01,Single-ply,SBD,M
Boys,124.74,10,Chris Bullington,Gatesville,117.75,260.82,136.08,201.85,598.74,Single-ply,SBD,M
Boys,124.74+,1,Marques Robinson,Waco Connally,148.6,317.51,165.56,242.67,725.75,Single-ply,SBD,M
Boys,124.74+,2,Dustin Blankemeyer,Bellville,161.84,283.5,192.78,249.48,725.75,Single-ply,SBD,M
Boys,124.74+,3,Jordan Westbrook,Gatesville,128.37,285.76,158.76,242.67,687.19,Single-ply,SBD,M
Boys,124.74+,4,Bryce Johnson #1,Alvarado,145.06,272.16,181.44,229.06,682.66,Single-ply,SBD,M
Boys,124.74+,5,Logan Nuss,Alvarado,140.43,251.74,172.37,208.65,632.76,Single-ply,SBD,M
Boys,124.74+,6,Chiddy Nwaeze,Waco Connally,135.44,249.48,156.49,206.38,612.35,Single-ply,SBD,M
Boys,124.74+,7,Noah Stebens,China Spring,130.45,238.14,154.22,213.19,605.55,Single-ply,SBD,M
Boys,124.74+,8,Tanner Smith,Robinson,133.13,233.6,138.35,222.26,594.21,Single-ply,SBD,M
Boys,124.74+,DQ,Corey Ross,Navasota,129.55,272.16,,,,Single-ply,SBD,M
Boys,124.74+,DQ,Jake Dibble,Lampasas,152.13,,,,,Single-ply,SBD,M
