Place,Name,CyrillicName,BirthYear,BodyweightKg,Best3SquatKg,Best3BenchKg,Best3DeadliftKg,TotalKg,WeightClassKg,Event,Equipment,Division,Sex,BirthDate
1,Mariya Zabelina,Мария Забелина,1997,46.9,115,67.5,147.5,330,47,SBD,Raw,Open,F,
2,Marina Kotelnikova,Марина Котельникова,1991,47,105,87.5,125,317.5,47,SBD,Raw,Open,F,
3,Kristina Moskaleva,Кристина Москалева,1990,46.7,105,67.5,137.5,310,47,SBD,Raw,Open,F,
4,Alisa Zhilkina,Алиса Жилкина,1995,46.55,105,70,132.5,307.5,47,SBD,Raw,Open,F,
5,Evgeniya Maksimova,Евгения Максимова,1995,47,112.5,60,130,302.5,47,SBD,Raw,Open,F,
6,Irina Ivanova,Ирина Иванова,1996,46.95,95,67.5,125,287.5,47,SBD,Raw,Open,F,
7,Olga Pavlova,Ольга Павлова,1987,44.9,75,60,110,245,47,SBD,Raw,Open,F,
8,Ekaterina Sheluchenko,Екатерина Шелученко,1996,46.55,95,52.5,95,242.5,47,SBD,Raw,Open,F,
DQ,Alyona Snezhina,Алёна Снежина,1987,45.95,-75,,,,47,SBD,Raw,Open,F,
1,Olga Golubeva,Ольга Голубева,1970,51.75,135,92.5,165,392.5,52,SBD,Raw,Open,F,
2,Valentina Vermenyuk,Валентина Верменюк,1986,52,132.5,90,140,362.5,52,SBD,Raw,Open,F,
3,Anna Komlaeva,Анна Комлаева,1979,51.8,122.5,82.5,152.5,357.5,52,SBD,Raw,Open,F,
4,Marina Gayduchenok,Марина Гайдученок,1984,51.7,110,77.5,160,347.5,52,SBD,Raw,Open,F,
5,Samira Karaeva,Самира Караева,1996,51.65,122.5,77.5,145,345,52,SBD,Raw,Open,F,
6,Olga Sizikova,Ольга Сизикова,1993,51,100,77.5,125,302.5,52,SBD,Raw,Open,F,
7,Anastasiya Tumakova,Анастасия Тумакова,1993,50.95,105,82.5,105,292.5,52,SBD,Raw,Open,F,
8,Alena Meretskaya,Алена Мерецкая,1983,51.4,100,65,120,285,52,SBD,Raw,Open,F,
9,Viktoriya Mikhaleva,Виктория Михалева,1984,51.65,107.5,50,115,272.5,52,SBD,Raw,Open,F,
10,Yuliya Yambaeva,Юлия Ямбаева,1985,51.85,102.5,50,117.5,270,52,SBD,Raw,Open,F,
11,Meerimay Sydygalieva,Мээримай Сыдыгалиева,1991,50.65,90,47.5,120,257.5,52,SBD,Raw,Open,F,
1,Inna Filimonova #1,Инна Филимонова,1976,56.5,174.5,77.5,175,427,57,SBD,Raw,Open,F,
2,Irina Poletaeva,Ирина Полетаева,1982,56.7,135,107.5,160,402.5,57,SBD,Raw,Open,F,
3,Elena Ponomareva,Елена Пономарева,1990,56.8,140,85,167.5,392.5,57,SBD,Raw,Open,F,
4,Ekaterina Nazarova,Екатерина Назарова,2000,56.65,137.5,90,150,377.5,57,SBD,Raw,Open,F,
5,Kseniya Almasova,Ксения Алмасова,1992,56.55,135,75,145,355,57,SBD,Raw,Open,F,
6,Anna Lisina,Анна Лисина,1989,56.8,130,77.5,145,352.5,57,SBD,Raw,Open,F,
7,Kseniya Lebedeva,Ксения Лебедева,1982,54.2,122.5,72.5,142.5,337.5,57,SBD,Raw,Open,F,
8,Anna Goryacheva,Анна Горячева,1988,56.9,102.5,62.5,125,290,57,SBD,Raw,Open,F,
9,Darya Nosova,Дарья Носова,1987,56.05,82.5,42.5,100,225,57,SBD,Raw,Open,F,
1,Anastasiya Sheveleva,Анастасия Шевелева,1989,63,140,115,167.5,422.5,63,SBD,Raw,Open,F,
2,Maria Dubenskaya,Мария Дубенская,1988,62.5,145,110,160,415,63,SBD,Raw,Open,F,
3,Yuliya Vavilova,Юлия Вавилова,1979,60.35,152.5,87.5,162.5,402.5,63,SBD,Raw,Open,F,
4,Kseniya Mokhova,Ксения Мохова,1986,62.25,137.5,85,170,392.5,63,SBD,Raw,Open,F,
5,Ekaterina Prokopova,Екатерина Прокопова,1994,61.75,142.5,97.5,145,385,63,SBD,Raw,Open,F,
6,Svetlana Okhapkina,Светлана Охапкина,1977,62.6,137.5,75,172.5,385,63,SBD,Raw,Open,F,
7,Anna Shtefan,Анна Штефан,1991,60.75,115,80,147.5,342.5,63,SBD,Raw,Open,F,
8,Tatyana Nikolaeva,Татьяна Николаева,1982,62.95,115,70,135,320,63,SBD,Raw,Open,F,
9,Galina Dzham,Галина Джам,1993,61.45,95,62.5,115,272.5,63,SBD,Raw,Open,F,
DQ,Ekaterina Efimova,Екатерина Ефимова,1982,62.6,150,95,,,63,SBD,Raw,Open,F,
DQ,Tatyana Yunusova,Татьяна Юнусова,1999,,,,,,63,SBD,Raw,Open,F,
1,Angelina Elovikova,Ангелина Еловикова,1993,72,195,110,225,530,72,SBD,Raw,Open,F,
2,Yuliya Zaytseva,Юлия Зайцева,1987,71.75,147.5,105,185,437.5,72,SBD,Raw,Open,F,
3,Zinaida Ursaki,Зинаида Урсаки,1988,70.25,180,85,160,425,72,SBD,Raw,Open,F,
4,Mariya Lebedeva,Мария Лебедева,1996,71.85,145,85,155,385,72,SBD,Raw,Open,F,
5,Valentina Apretova,Валентина Апретова,1989,67.25,132.5,80,162.5,375,72,SBD,Raw,Open,F,
6,Lyubov Vanyukhina,Любовь Ванюхина,1991,71,135,80,160,375,72,SBD,Raw,Open,F,
7,Lyudmila Meller,Людмила Меллер,1981,72,120,70,135,325,72,SBD,Raw,Open,F,
8,Ekaterina Kochina,Екатерина Кочина,1990,71.35,120,90,100,310,72,SBD,Raw,Open,F,
9,Darya Gordienko,Дарья Гордиенко,1988,71.6,102.5,57.5,127.5,287.5,72,SBD,Raw,Open,F,
1,Anna Teslina,Анна Теслина,1999,82.15,200,95,207.5,502.5,84,SBD,Raw,Open,F,
2,Lyudmila Protchenko,Людмила Протченко,1986,84,180,147.5,140,467.5,84,SBD,Raw,Open,F,
3,Ekaterina Polikarpova,Екатерина Поликарпова,1986,83.2,170,125,160,455,84,SBD,Raw,Open,F,
4,Irina Ivacheva,Ирина Ивачева,1969,80.75,150,100,190,440,84,SBD,Raw,Open,F,
5,Anna Dyomina,Анна Дёмина,1996,82.95,160,95,180,435,84,SBD,Raw,Open,F,
6,Oksana Semenukha,Оксана Семенуха,1995,83.95,155,100,165,420,84,SBD,Raw,Open,F,
7,Alina Kuzminova,Алина Кузьминова,1991,83.6,135,75,155,365,84,SBD,Raw,Open,F,
1,Daria Efimtseva,Дарья Ефимцева,2000,128.65,240,135,200,575,84+,SBD,Raw,Open,F,
2,Evgeniya Yudakova,Евгения Юдакова,1983,94.1,170,100,200,470,84+,SBD,Raw,Open,F,
3,Irina Demasova,Ирина Демасова,1982,92.3,150,122.5,165,437.5,84+,SBD,Raw,Open,F,
4,Alla Pugovkina,Алла Пуговкина,1975,97.7,147.5,105,167.5,420,84+,SBD,Raw,Open,F,
5,Aleksandra Radzhabova,Александра Раджабова,1996,101,165,85,170,420,84+,SBD,Raw,Open,F,
6,Svetlana Ordinartseva,Светлана Ординарцева,1976,93.4,130,67.5,120,317.5,84+,SBD,Raw,Open,F,
1,Sergey Fedosienko,Сергей Федосиенко,1982,59,228,167.5,275,670.5,59,SBD,Raw,Open,M,1982-07-31
2,Ilya Marichev,Илья Маричев,2001,58.9,202.5,127.5,260,590,59,SBD,Raw,Open,M,
3,Ilshat Makhmurov,Ильшат Махмуров,1985,59,170,120,227.5,517.5,59,SBD,Raw,Open,M,
1,Sergey Gladkikh,Сергей Гладких,1989,66,255.5,152.5,260,668,66,SBD,Raw,Open,M,1989-03-03
2,Alexander Kolbin,Александр Колбин,1987,65.75,230,155,250,635,66,SBD,Raw,Open,M,
3,Yuriy Groshnikov,Юрий Грошников,1984,66,215,132.5,265,612.5,66,SBD,Raw,Open,M,
4,Sergey Skochek,Сергей Скочек,1983,65.9,200,170,235,605,66,SBD,Raw,Open,M,
5,Andrey Shvankov,Андрей Шваньков,1986,65.7,195,140,215,550,66,SBD,Raw,Open,M,
6,Artyom Nekrasov,Артём Некрасов,1993,65.5,185,117.5,235,537.5,66,SBD,Raw,Open,M,
7,Pavel Nosov,Павел Носов,1994,65.6,167.5,140,192.5,500,66,SBD,Raw,Open,M,
8,Aleksey Petukhov,Алексей Петухов,1988,65.65,177.5,117.5,200,495,66,SBD,Raw,Open,M,
9,Rasul Agamagomedov,Расул Агамагомедов,1990,65.8,170,110,200,480,66,SBD,Raw,Open,M,
10,Mikhail Ogloblin,Михаил Оглоблин,1996,65.2,170,112.5,190,472.5,66,SBD,Raw,Open,M,
11,Denis Nesterenko,Денис Нестеренко,1995,65.35,180,102.5,175,457.5,66,SBD,Raw,Open,M,
1,Konstantin Dunin,Константин Дунин,1996,73.95,250,167.5,295,712.5,74,SBD,Raw,Open,M,
2,Anatolii Goriachok,Анатолий Горячок,1979,73.85,250,150,298,698,74,SBD,Raw,Open,M,
3,Sergey Negara,Сергей Негара,1978,73.9,237.5,160,285,682.5,74,SBD,Raw,Open,M,
4,Andrey Kostenko,Андрей Костенко,1988,73.7,250,155,275,680,74,SBD,Raw,Open,M,
5,Denis Cheburashkin,Денис Чебурашкин,1994,73.85,215,152.5,252.5,620,74,SBD,Raw,Open,M,
6,Alexey Bakhirev,Алексей Бахирев,1981,73.9,215,152.5,247.5,615,74,SBD,Raw,Open,M,
7,Konstantin Volkov,Константин Волков,1992,73.3,220,122.5,232.5,575,74,SBD,Raw,Open,M,
8,Evgeniy Koptev,Евгений Коптев,1996,72.55,182.5,122.5,255,560,74,SBD,Raw,Open,M,
9,Ivan Trunov,Иван Трунов,1996,73.2,200,135,225,560,74,SBD,Raw,Open,M,
10,Aleksandr Mokhin,Александр Мохин,1993,73.5,190,142.5,227.5,560,74,SBD,Raw,Open,M,
11,Dmitriy Fedoseev,Дмитрий Федосеев,1976,73.5,187.5,125,220,532.5,74,SBD,Raw,Open,M,
12,Ilya Chuk,Илья Чук,1995,73.85,190,135,200,525,74,SBD,Raw,Open,M,
13,Kirill Bozheskov,Кирилл Божесков,1990,73.4,172.5,125,220,517.5,74,SBD,Raw,Open,M,
14,Denis Zemtsovskiy,Денис Земцовский,1991,73.8,165,120,175,460,74,SBD,Raw,Open,M,
1,Tural Gasanov,Турал Гасанов,1991,81.95,285,185,295,765,83,SBD,Raw,Open,M,
2,Pavel Kashin,Павел Кашин,1990,82.55,260,195,285,740,83,SBD,Raw,Open,M,
3,Ivan Davydov,Иван Давыдов,1989,83,257.5,170,295,722.5,83,SBD,Raw,Open,M,
4,Aleksey Korchagin,Алексей Корчагин,1978,82.65,240,190,275,705,83,SBD,Raw,Open,M,
5,Evgeniy Gaybura,Евгений Гайбура,1995,82.85,265,185,255,705,83,SBD,Raw,Open,M,
6,Aleksandr Gromov,Александр Громов,1981,82.45,265,185,240,690,83,SBD,Raw,Open,M,
7,Andrey Laykhinen,Андрей Лайхинен,1983,83,222.5,185,257.5,665,83,SBD,Raw,Open,M,
8,Aleksey Egorov,Алексей Егоров,1992,82.1,245,170,245,660,83,SBD,Raw,Open,M,
9,Anton Golubenko,Антон Голубенко,1994,82.75,232.5,155,270,657.5,83,SBD,Raw,Open,M,
10,Vladislav Krivonosov,Владислав Кривоносов,1987,81.35,230,155,270,655,83,SBD,Raw,Open,M,
11,Pyotr Akimkin,Пётр Акимкин,1994,80.5,230,162.5,250,642.5,83,SBD,Raw,Open,M,
12,Ilya Mishin,Илья Мишин,1995,82.2,222.5,150,270,642.5,83,SBD,Raw,Open,M,
13,Ilya Simakov,Илья Симаков,1983,83,220,170,250,640,83,SBD,Raw,Open,M,
14,Roman Bychkov,Роман Бычков,1985,82.6,230,147.5,252.5,630,83,SBD,Raw,Open,M,
15,Vitaliy Sosnin,Виталий Соснин,1993,82.5,237.5,142.5,245,625,83,SBD,Raw,Open,M,
16,Mikhail Vusovich,Михаил Вусович,1988,79.65,215,167.5,240,622.5,83,SBD,Raw,Open,M,
17,Andrey Matveev,Андрей Матвеев,1992,82.6,225,137.5,247.5,610,83,SBD,Raw,Open,M,
18,Stanislav Melnikov,Станислав Мельников,1990,83,220,150,235,605,83,SBD,Raw,Open,M,
19,Sergey Novikov,Сергей Новиков,1982,82.7,215,135,240,590,83,SBD,Raw,Open,M,
20,Denis Larionov,Денис Ларионов,1982,82.4,215,155,215,585,83,SBD,Raw,Open,M,
21,Denis Vdovichenko,Денис Вдовиченко,1987,82.55,190,155,230,575,83,SBD,Raw,Open,M,
22,Anton Potekhin,Антон Потехин,1995,82.85,190,142.5,210,542.5,83,SBD,Raw,Open,M,
23,Maksim Kutovoy,Максим Кутовой,1989,81.1,192.5,152.5,195,540,83,SBD,Raw,Open,M,
24,Yuriy Polishchuk,Юрий Полищук,1976,82.6,185,130,207.5,522.5,83,SBD,Raw,Open,M,
25,Dmitriy Yagonson,Дмитрий Ягонсон,1984,83,180,120,210,510,83,SBD,Raw,Open,M,
DQ,Semyon Golovachuk,Семён Головачук,1991,82.8,260,197.5,-270,,83,SBD,Raw,Open,M,
DQ,Artem Ryabov,Артем Рябов,1985,82.9,220,-155,,,83,SBD,Raw,Open,M,
DQ,Mikhail Bulba,Михаил Бульба,1982,82.9,200,-145,,,83,SBD,Raw,Open,M,
DQ,Rinat Suleymenov,Ринат Сулейменов,1994,82,-250,,,,83,SBD,Raw,Open,M,
1,Dmitry Inzarkin,Дмитрий Инзаркин,1987,91.1,282.5,215.5,325,823,93,SBD,Raw,Open,M,
2,Umar Atabiev,Умар Атабиев,1983,91.1,305,197.5,297.5,800,93,SBD,Raw,Open,M,
3,Sergey Lupin,Сергей Лупин,1991,93,292.5,197.5,300,790,93,SBD,Raw,Open,M,
4,Vladimir Karaman,Владимир Караман,1981,90.75,290,190,300,780,93,SBD,Raw,Open,M,
5,Nikolay Bazanov,Николай Базанов,1981,92.65,282.5,187.5,307.5,777.5,93,SBD,Raw,Open,M,
6,Aleksandr Rodionov,Александр Родионов,1988,92.8,265,192.5,300,757.5,93,SBD,Raw,Open,M,
7,Vladimir Usynin,Владимир Усынин,1994,92.85,280,192.5,285,757.5,93,SBD,Raw,Open,M,
8,Evgeniy Simon,Евгений Симон,1983,92.15,257.5,162.5,287.5,707.5,93,SBD,Raw,Open,M,
9,Dmitriy Maleev,Дмитрий Малеев,1990,91.5,250,180,275,705,93,SBD,Raw,Open,M,
10,Sergey Borovinskiy,Сергей Боровинский,1989,93,255,192.5,250,697.5,93,SBD,Raw,Open,M,
11,Anatoliy Gudin,Анатолий Гудин,1990,92.25,235,197.5,260,692.5,93,SBD,Raw,Open,M,
12,Sergey Kondakov,Сергей Кондаков,1984,92.7,242.5,155,280,677.5,93,SBD,Raw,Open,M,
13,Anton Mashirov,Антон Маширов,1984,91.35,240,162.5,272.5,675,93,SBD,Raw,Open,M,
14,Aleksandr Zatula,Александр Затула,1985,92.1,245,165,250,660,93,SBD,Raw,Open,M,
15,Ramiz Musaev,Рамиз Мусаев,1991,92.25,245,152.5,242.5,640,93,SBD,Raw,Open,M,
DQ,Aleksey Zinurov,Алексей Зинуров,1988,89.55,-280,,,,93,SBD,Raw,Open,M,
DQ,Maksim Demidov,Максим Демидов,1995,94,,,,,105,SBD,Raw,Open,M,
DQ,Nikolay Evseev,Николай Евсеев,1987,,,,,,93,SBD,Raw,Open,M,
1,Levon Tavakalov,Левон Тавакалов,1988,105,310,225,337.5,872.5,105,SBD,Raw,Open,M,
2,Timur Fedotov,Тимур Федотов,1990,104.9,305,217.5,340,862.5,105,SBD,Raw,Open,M,
3,Ernst Gross,Эрнст Гросс,1987,104.95,325,202.5,305,832.5,105,SBD,Raw,Open,M,
4,Andrey Vazhov,Андрей Важов,1990,102.75,295,217.5,300,812.5,105,SBD,Raw,Open,M,
5,Vladislav Aksennikov,Владислав Аксенников,1997,104.95,290,210,300,800,105,SBD,Raw,Open,M,
6,Aleksandr Kadzaev,Александр Кадзаев,1990,104.9,270,172.5,315,757.5,105,SBD,Raw,Open,M,
7,Igor Paramonov,Игорь Парамонов,1983,104.25,290,180,285,755,105,SBD,Raw,Open,M,
8,Denis Smelkov,Денис Смелков,1978,102.05,250,182.5,282.5,715,105,SBD,Raw,Open,M,
9,Vitaliy Shiryaev,Виталий Ширяев,1994,103.1,240,167.5,307.5,715,105,SBD,Raw,Open,M,
10,Dmitriy Pchelkin,Дмитрий Пчелкин,1985,104.7,250,172.5,287.5,710,105,SBD,Raw,Open,M,
11,Stanislav Ivanov,Станислав Иванов,1984,104.45,247.5,175,255,677.5,105,SBD,Raw,Open,M,
12,Aleksandr Skripnichenko,Александр Скрипниченко,1981,103.1,232.5,162.5,250,645,105,SBD,Raw,Open,M,
13,Kirill Nefedov,Кирилл Нефедов,1993,98.15,227.5,165,240,632.5,105,SBD,Raw,Open,M,
14,Artem Chekalkin,Артем Чекалкин,1991,99.8,180,135,200,515,105,SBD,Raw,Open,M,
DQ,Aleksey Drachuk,Алексей Драчук,1986,,,,,,105,SBD,Raw,Open,M,
DQ,Mikhail Gnatyuk,Михаил Гнатюк,1975,,,,,,105,SBD,Raw,Open,M,
1,Konstantin Musaev,Константин Мусаев,1997,119.7,300,220,362.5,882.5,120,SBD,Raw,Open,M,
2,Konstantin Khalyavkin,Константин Халявкин,1979,119.45,320,210,350,880,120,SBD,Raw,Open,M,
3,Maksim Beznosov,Максим Безносов,1991,119.1,325,202.5,332.5,860,120,SBD,Raw,Open,M,
4,Daniil Ermolaev,Даниил Ермолаев,1997,119.05,340,192.5,300,832.5,120,SBD,Raw,Open,M,
5,Konstantin Chekasin,Константин Чекасин,1992,112.35,300,210,315,825,120,SBD,Raw,Open,M,
6,Igor Valikovskiy,Игорь Валиковский,1993,119.2,300,172.5,322.5,795,120,SBD,Raw,Open,M,
7,Sergey Alfimov,Сергей Алфимов,1984,118.15,265,195,280,740,120,SBD,Raw,Open,M,
8,Vyacheslav Tolmasov,Вячеслав Толмасов,1987,112.7,260,200,275,735,120,SBD,Raw,Open,M,
9,Viktor Popov,Виктор Попов,1987,109.85,252.5,165,295,712.5,120,SBD,Raw,Open,M,
10,Yaroslav Dikun,Ярослав Дикун,1995,113.55,257.5,175,280,712.5,120,SBD,Raw,Open,M,
11,Sergey Vologdin,Сергей Вологдин,1991,116.7,255,190,267.5,712.5,120,SBD,Raw,Open,M,
12,Ivan Guryanov,Иван Гурьянов,1986,113.95,260,190,255,705,120,SBD,Raw,Open,M,
13,Mikhail Bilko,Михаил Билько,1981,106.7,230,175,255,660,120,SBD,Raw,Open,M,
14,Mikhail Kuvshinov,Михаил Кувшинов,1989,118.65,235,157.5,255,647.5,120,SBD,Raw,Open,M,
15,Andrey Morozov,Андрей Морозов,1993,119.45,252.5,137.5,245,635,120,SBD,Raw,Open,M,
1,Andrey Konovalov #1,Андрей Коновалов,1986,163.85,370,227.5,342.5,940,120+,SBD,Raw,Open,M,
2,Anton Kibirev,Антон Кибирев,1982,141.4,340,215,345,900,120+,SBD,Raw,Open,M,
3,Vladimir Verdiyanu,Владимир Вердияну,1984,170.7,325,235,302.5,862.5,120+,SBD,Raw,Open,M,
4,Vladimir Timoshik,Владимир Тимошик,1993,153.15,330,200,320,850,120+,SBD,Raw,Open,M,
5,Egor Rezepov,Егор Резепов,1995,159.3,310,190,340,840,120+,SBD,Raw,Open,M,
6,Vladimir Astratov,Владимир Астратов,1986,168.85,315,182.5,335,832.5,120+,SBD,Raw,Open,M,
7,Andrey Ushakov,Андрей Ушаков,1980,138.75,265,195,315,775,120+,SBD,Raw,Open,M,
8,Dmitriy Titerin,Дмитрий Титерин,1996,142.55,290,185,300,775,120+,SBD,Raw,Open,M,
9,Nikolay Shanin,Николай Шанин,1989,122.4,265,205,270,740,120+,SBD,Raw,Open,M,
