Division,WeightClassKg,Place,Name,Team,BodyweightKg,Best3SquatKg,Best3BenchKg,Best3DeadliftKg,TotalKg,Equipment,Event,Sex
Boys,51.71,1,Josue Leon,Sulphur Springs,49.99,158.76,74.84,174.63,408.23,Single-ply,SBD,M
Boys,51.71,2,Miguel Hernandez,Emory Rains,50.17,133.81,65.77,131.54,331.12,Single-ply,SBD,M
Boys,51.71,3,Matthew Solomon,Texarkana Liberty-Eylau,51.71,124.74,61.23,106.59,292.57,Single-ply,SBD,M
Boys,55.79,4,Makenzie Davis,Texarkana Liberty-Eylau,51.94,120.2,52.16,102.06,274.42,Single-ply,SBD,M
Boys,55.79,5,Nathan Duck,Sunnyvale,51.8,95.25,52.16,99.79,247.21,Single-ply,SBD,M
Boys,51.71,6,Tyler Chandler,Crandall,50.89,90.72,34.02,113.4,238.14,Single-ply,SBD,M
Boys,51.71,7,Justin Dowdy,Wills Point,44.45,86.18,52.16,97.52,235.87,Single-ply,SBD,M
Boys,51.71,8,Rey Rodriguez,North Forney,51.62,88.45,43.09,92.99,224.53,Single-ply,SBD,M
Boys,51.71,9,Colby Cowan,Forney,51.07,83.91,34.02,99.79,217.72,Single-ply,SBD,M
Boys,51.71,10,Cody Brown,Lindale,40.82,83.91,34.02,79.38,197.31,Single-ply,SBD,M
Boys,51.71,DQ,Anton Sanders,Lindale,46.45,77.11,,88.45,,Single-ply,SBD,M
Boys,51.71,DQ,Brett Butler,Mabank,50.35,142.88,,,,Single-ply,SBD,M
Boys,51.71,DQ,Ja'Vonta Mitchell,Greenville,46.63,113.4,,,,Single-ply,SBD,M
Boys,51.71,DQ,Jake Adel,Greenville,51.17,102.06,,83.91,,Single-ply,SBD,M
Boys,55.79,1,Jage Smith,Kaufman,55.52,156.49,74.84,179.17,410.5,Single-ply,SBD,M
Boys,55.79,2,Daniel Hernandez,Royse City,55.25,151.95,79.38,165.56,396.89,Single-ply,SBD,M
Boys,55.79,3,Ralph Bustos,Kaufman,55.34,129.27,79.38,136.08,344.73,Single-ply,SBD,M
Boys,55.79,4,Luis Gomez,Sulphur Springs,55.79,124.74,79.38,136.08,340.19,Single-ply,SBD,M
Boys,55.79,5,Jesse Ortiz,Sulphur Springs,54.16,124.74,65.77,142.88,333.39,Single-ply,SBD,M
Boys,55.79,6,Gage Giglio,Lindale,55.34,124.74,68.04,140.61,333.39,Single-ply,SBD,M
Boys,55.79,7,Tyler Watson,Crandall,54.43,104.33,74.84,136.08,315.25,Single-ply,SBD,M
Boys,55.79,8,Ryan Shahan,Plano John Paul II,55.34,113.4,65.77,117.93,297.1,Single-ply,SBD,M
Boys,59.87,9,Andrew Legrand,Texarkana Texas,55.97,102.06,65.77,117.93,285.76,Single-ply,SBD,M
Boys,55.79,10,Jack Jones,Cumby,54.43,97.52,65.77,104.33,267.62,Single-ply,SBD,M
Boys,55.79,11,Cody Smith,Crandall,55.52,81.65,68.04,113.4,263.08,Single-ply,SBD,M
Boys,55.79,12,Evan Norlie,Sunnyvale,54.25,68.04,52.16,108.86,229.06,Single-ply,SBD,M
Boys,55.79,DQ,Cj Sewell,Scurry-Rosser,55.43,117.93,,,,Single-ply,SBD,M
Boys,59.87,1,Tj Howard,Texarkana Liberty-Eylau,59.42,176.9,104.33,181.44,462.66,Single-ply,SBD,M
Boys,59.87,2,Jory Heath,Bishop Lynch,59.69,154.22,99.79,181.44,435.45,Single-ply,SBD,M
Boys,59.87,3,Kentrun Pemberton,Texarkana Liberty-Eylau,59.15,170.1,97.52,165.56,433.18,Single-ply,SBD,M
Boys,59.87,4,Samuel Hammons,Sulphur Springs,59.33,149.69,83.91,151.95,385.55,Single-ply,SBD,M
Boys,59.87,5,Juan Mendez,Emory Rains,59.6,133.81,79.38,170.1,383.29,Single-ply,SBD,M
Boys,59.87,6,Tyler Davis,Kaufman,57.61,131.54,65.77,138.35,335.66,Single-ply,SBD,M
Boys,59.87,7,Colt Conway,Mabank,58.51,142.88,65.77,120.2,328.85,Single-ply,SBD,M
Boys,59.87,8,Ruben Lopez,Lindale,57.79,124.74,63.5,138.35,326.59,Single-ply,SBD,M
Boys,59.87,9,Rafael Sandoval,Plano John Paul II,56.43,113.4,81.65,124.74,319.78,Single-ply,SBD,M
Boys,59.87,10,Tyler Walker,Red Oak,58.51,113.4,65.77,138.35,317.51,Single-ply,SBD,M
Boys,59.87,11,Weston McCluskey,Quinlan Ford,59.87,120.2,70.31,120.2,310.71,Single-ply,SBD,M
Boys,59.87,12,Brenden Ashley,Sunnyvale,57.24,104.33,65.77,131.54,301.64,Single-ply,SBD,M
Boys,67.13,13,Kerrick Edwards,Royse City,60.06,102.06,68.04,122.47,292.57,Single-ply,SBD,M
Boys,59.87,DQ,Austin Vandiver,Royse City,58.51,90.72,,,,Single-ply,SBD,M
Boys,59.87,DQ,Cameron Yates,Scurry-Rosser,59.15,127.01,,,,Single-ply,SBD,M
Boys,59.87,DQ,Morgan Breaux,Emory Rains,57.88,,,,,Single-ply,SBD,M
Boys,59.87,DQ,Ta'Montre Mitchell,Greenville,57.33,142.88,,,,Single-ply,SBD,M
Boys,67.13,1,Jt Delay,Mabank,66.77,183.7,129.27,161.03,474,Single-ply,SBD,M
Boys,67.13,2,Alex Ramsey,Royse City,65.77,181.44,104.33,181.44,467.2,Single-ply,SBD,M
Boys,67.13,3,Alfred Champion,Greenville,62.69,183.7,92.99,176.9,453.59,Single-ply,SBD,M
Boys,67.13,4,Jeremy Armstrong,Rockwall-Heath,63.32,176.9,92.99,181.44,451.32,Single-ply,SBD,M
Boys,67.13,5,Rod Howard,Texarkana Liberty-Eylau,63.14,176.9,92.99,179.17,449.06,Single-ply,SBD,M
Boys,67.13,6,Kevonte Collier,South Garland,60.78,165.56,113.4,167.83,446.79,Single-ply,SBD,M
Boys,67.13,7,Jesse Hudson #1,Emory Rains,65.59,172.37,81.65,179.17,433.18,Single-ply,SBD,M
Boys,67.13,8,Anthony Offord,Crandall,65.86,142.88,86.18,188.24,417.3,Single-ply,SBD,M
Boys,67.13,9,Hakeem Regis,North Forney,63.55,145.15,102.06,163.29,410.5,Single-ply,SBD,M
Boys,67.13,10,Brain Lacy,South Garland,62.05,142.88,106.59,147.42,396.89,Single-ply,SBD,M
Boys,67.13,11,Abass Fofanah,Red Oak,66.77,147.42,95.25,136.08,378.75,Single-ply,SBD,M
Boys,74.84,12,Jacob Mitchell,Greenville,67.31,147.42,92.99,138.35,378.75,Single-ply,SBD,M
Boys,67.13,13,Michael Barnes,Red Oak,64.95,124.74,90.72,158.76,374.21,Single-ply,SBD,M
Boys,67.13,14,Trevor Bell,Sunnyvale,64.14,161.03,72.57,136.08,369.68,Single-ply,SBD,M
Boys,67.13,15,Taylor Gonzales,Crandall,64.05,122.47,90.72,149.69,362.87,Single-ply,SBD,M
Boys,67.13,16,Wesley McCravy,Greenville,62.46,124.74,90.72,145.15,360.61,Single-ply,SBD,M
Boys,67.13,17,Thomas Aguilar,Emory Rains,65.41,136.08,70.31,151.95,358.34,Single-ply,SBD,M
Boys,67.13,18,James West,Quinlan Ford,65.5,120.2,88.45,136.08,344.73,Single-ply,SBD,M
Boys,67.13,19,Hayden Hollon,Cumby,65.14,122.47,65.77,149.69,337.93,Single-ply,SBD,M
Boys,67.13,20,Holden Godwin,Emory Rains,65.77,136.08,63.5,124.74,324.32,Single-ply,SBD,M
Boys,67.13,21,Denton Bridges,Terrell,62.69,111.13,79.38,111.13,301.64,Single-ply,SBD,M
Boys,67.13,22,Daniel Kresnik,North Forney,63.5,102.06,70.31,129.27,301.64,Single-ply,SBD,M
Boys,67.13,23,Grant Garvin,Wills Point,65.5,113.4,65.77,111.13,290.3,Single-ply,SBD,M
Boys,67.13,24,Charles Willman,Quinlan Ford,66.32,104.33,65.77,117.93,288.03,Single-ply,SBD,M
Boys,67.13,25,Preston Morris,North Forney,60.78,97.52,61.23,97.52,256.28,Single-ply,SBD,M
Boys,67.13,DQ,Felix Brito,Royse City,64.23,158.76,79.38,,,Single-ply,SBD,M
Boys,74.84,1,Austin Martin #3,Greenville,73.57,226.8,138.35,215.46,580.6,Single-ply,SBD,M
Boys,74.84,2,Johnathon Carlisle,Sulphur Springs,69.22,204.12,122.47,208.65,535.24,Single-ply,SBD,M
Boys,82.1,3,Jason Haley,Texarkana Liberty-Eylau,75.02,226.8,97.52,199.58,523.9,Single-ply,SBD,M
Boys,74.84,4,De'Shun Brewer,Texarkana Liberty-Eylau,70.03,158.76,120.2,204.12,483.08,Single-ply,SBD,M
Boys,74.84,5,Richard Tilley,Crandall,74.84,172.37,83.91,217.72,474,Single-ply,SBD,M
Boys,74.84,6,James Seekford,Lindale,71.67,185.97,104.33,176.9,467.2,Single-ply,SBD,M
Boys,82.1,7,Trent Bailey,Mabank,74.93,165.56,120.2,179.17,464.93,Single-ply,SBD,M
Boys,74.84,8,James Wright #1,Wills Point,71.21,183.7,95.25,170.1,449.06,Single-ply,SBD,M
Boys,74.84,9,Abdul Khalaf,Sunnyvale,70.08,170.1,104.33,167.83,442.25,Single-ply,SBD,M
Boys,74.84,10,Camilo Torres,Bishop Lynch,73.48,167.83,97.52,176.9,442.25,Single-ply,SBD,M
Boys,74.84,11,Arquel Rainwater,South Garland,74.57,174.63,102.06,165.56,442.25,Single-ply,SBD,M
Boys,74.84,12,Alex Krakosky,Bishop Lynch,74.03,176.9,86.18,176.9,439.98,Single-ply,SBD,M
Boys,74.84,13,Xavier Battee,Kaufman,70.31,158.76,90.72,185.97,435.45,Single-ply,SBD,M
Boys,74.84,14,Dakota Meurer,Lindale,70.76,158.76,92.99,176.9,428.64,Single-ply,SBD,M
Boys,74.84,15,Christian Byers,Bishop Lynch,70.4,158.76,83.91,181.44,424.11,Single-ply,SBD,M
Boys,74.84,16,Brian Bugg,Red Oak,74.39,154.22,92.99,161.03,408.23,Single-ply,SBD,M
Boys,74.84,17,Collin Hester,Lindale,74.84,145.15,81.65,174.63,401.43,Single-ply,SBD,M
Boys,74.84,18,Frank Cortez,Kaufman,68.04,147.42,77.11,172.37,396.89,Single-ply,SBD,M
Boys,74.84,19,Steven Letlow,Kaufman,71.12,147.42,81.65,167.83,396.89,Single-ply,SBD,M
Boys,74.84,20,Jacob Holley,Kaufman,68.04,140.61,99.79,142.88,383.29,Single-ply,SBD,M
Boys,74.84,21,Zack Watkins,Forney,69.58,136.08,81.65,165.56,383.29,Single-ply,SBD,M
Boys,74.84,22,Diamond Williams,Terrell,71.76,124.74,97.52,158.76,381.02,Single-ply,SBD,M
Boys,74.84,23,Robert Clinard,North Forney,74.12,140.61,92.99,138.35,371.95,Single-ply,SBD,M
Boys,74.84,24,Jeremiah Irons,Lindale,72.91,140.61,70.31,149.69,360.61,Single-ply,SBD,M
Boys,74.84,25,Troy Hoover,Forney,70.08,136.08,72.57,147.42,356.07,Single-ply,SBD,M
Boys,74.84,26,Jake Guercia,Forney,72.48,136.08,65.77,140.61,342.46,Single-ply,SBD,M
Boys,74.84,27,Fajon Mitchell,Terrell,68.49,131.54,72.57,124.74,328.85,Single-ply,SBD,M
Boys,74.84,28,Noah Mendez,North Forney,74.39,106.59,83.91,120.2,310.71,Single-ply,SBD,M
Boys,82.1,29,Cameron Leath,Wills Point,75.02,108.86,65.77,124.74,299.37,Single-ply,SBD,M
Boys,74.84,30,John Evans,Cumby,69.49,104.33,65.77,102.06,272.16,Single-ply,SBD,M
Boys,74.84,DQ,Grannon Brown,Emory Rains,74.62,,,,,Single-ply,SBD,M
Boys,74.84,DQ,Bacardi Clark,Forney,74.39,195.04,,,,Single-ply,SBD,M
Boys,74.84,DQ,Tayelor Doty,Greenville,73.03,181.44,,,,Single-ply,SBD,M
Boys,74.84,DQ,Dillan Delair,Mabank,71.85,142.88,,,,Single-ply,SBD,M
Boys,74.84,DQ,Larry Murphy,Texarkana Texas,72.01,,,,,Single-ply,SBD,M
Boys,74.84,DQ,Tj Graham,Scurry-Rosser,73.07,127.01,95.25,,,Single-ply,SBD,M
Boys,74.84,DQ,Derell Wilson,South Garland,73.84,,,,,Single-ply,SBD,M
Boys,74.84,DQ,Garrett Yates,Scurry-Rosser,70.13,122.47,,,,Single-ply,SBD,M
Boys,82.1,1,Travis Turner,Texarkana Texas,81.92,251.74,136.08,215.46,603.28,Single-ply,SBD,M
Boys,82.1,2,Trent Tucker,Texarkana Liberty-Eylau,80.97,217.72,136.08,208.65,562.45,Single-ply,SBD,M
Boys,82.1,3,Kevin Barron,Rockwall-Heath,80.92,229.06,122.47,208.65,560.19,Single-ply,SBD,M
Boys,82.1,4,Adam Galaz,Lindale,80.01,215.46,115.67,204.12,535.24,Single-ply,SBD,M
Boys,89.81,5,Marcos Garza,Mabank,82.28,206.38,124.74,195.04,526.17,Single-ply,SBD,M
Boys,82.1,6,Jon Hines,Emory Rains,76.66,215.46,104.33,204.12,523.9,Single-ply,SBD,M
Boys,82.1,7,Trey Acy,Lindale,80.29,204.12,115.67,204.12,523.9,Single-ply,SBD,M
Boys,82.1,8,Thomas Tilford,Scurry-Rosser,79.92,204.12,120.2,195.04,519.36,Single-ply,SBD,M
Boys,82.1,9,Nate Banks,Crandall,80.51,188.24,104.33,190.51,483.08,Single-ply,SBD,M
Boys,82.1,10,Trevor White,Greenville,80.69,190.51,117.93,174.63,483.08,Single-ply,SBD,M
Boys,82.1,11,Maxwell Noriega,Greenville,78.97,190.51,102.06,185.97,478.54,Single-ply,SBD,M
Boys,82.1,12,Clayton Lane,Mabank,78.47,185.97,113.4,170.1,469.47,Single-ply,SBD,M
Boys,82.1,13,Michael Jones,Emory Rains,77.93,158.76,92.99,215.46,467.2,Single-ply,SBD,M
Boys,89.81,14,Joel Dunn,Royse City,82.19,204.12,108.86,154.22,467.2,Single-ply,SBD,M
Boys,82.1,15,Thomas Paolucci,Texarkana Texas,77.11,174.63,108.86,179.17,462.66,Single-ply,SBD,M
Boys,82.1,16,Elijah Huntley,Royse City,81.83,172.37,111.13,167.83,451.32,Single-ply,SBD,M
Boys,82.1,17,Corbrin Burton,South Garland,78.83,156.49,115.67,172.37,444.52,Single-ply,SBD,M
Boys,82.1,18,Grant Russell,Emory Rains,79.38,145.15,102.06,197.31,444.52,Single-ply,SBD,M
Boys,82.1,19,Clay Wilkerson,Rockwall-Heath,78.56,158.76,102.06,181.44,442.25,Single-ply,SBD,M
Boys,82.1,20,Austin Cooper,Greenville,82.01,165.56,97.52,172.37,435.45,Single-ply,SBD,M
Boys,82.1,21,Dylan Schneider,Mabank,75.66,142.88,113.4,170.1,426.38,Single-ply,SBD,M
Boys,82.1,22,Dalton Hoelscher,Bishop Lynch,80.65,190.51,79.38,154.22,424.11,Single-ply,SBD,M
Boys,89.81,23,Dylan Stooksberry,South Garland,82.33,163.29,113.4,147.42,424.11,Single-ply,SBD,M
Boys,82.1,24,Jack Peabody,Plano John Paul II,78.74,147.42,104.33,170.1,421.84,Single-ply,SBD,M
Boys,82.1,25,Lance Kane,Lindale,78.02,161.03,88.45,170.1,419.57,Single-ply,SBD,M
Boys,82.1,26,Cody Anderson,Cumby,78.93,167.83,77.11,174.63,419.57,Single-ply,SBD,M
Boys,82.1,27,Santiago Dominguez,Mabank,80.74,142.88,102.06,165.56,410.5,Single-ply,SBD,M
Boys,82.1,28,Jacob Willige,Texarkana Texas,75.75,142.88,113.4,142.88,399.16,Single-ply,SBD,M
Boys,82.1,29,Bryce Evilsizer,Quinlan Ford,81.83,154.22,70.31,170.1,394.63,Single-ply,SBD,M
Boys,82.1,30,Hayden Tijerina,Kaufman,81.47,142.88,88.45,158.76,390.09,Single-ply,SBD,M
Boys,82.1,31,Christian Darter,Emory Rains,77.84,142.88,83.91,156.49,383.29,Single-ply,SBD,M
Boys,82.1,32,Tanner McMillan,Royse City,76.57,115.67,86.18,136.08,337.93,Single-ply,SBD,M
Boys,82.1,DQ,Odessa Sanchez,Emory Rains,79.65,,,,,Single-ply,SBD,M
Boys,82.1,DQ,Nick Schneider,Rockwall-Heath,79.83,136.08,,,,Single-ply,SBD,M
Boys,89.81,1,D'Vonta Walker,Rockwall-Heath,89.81,251.74,133.81,235.87,621.42,Single-ply,SBD,M
Boys,89.81,2,Kederrick Holmes,Texarkana Liberty-Eylau,87.18,222.26,136.08,213.19,571.53,Single-ply,SBD,M
Boys,89.81,3,Trey Adair,Sulphur Springs,83.46,217.72,136.08,195.04,548.85,Single-ply,SBD,M
Boys,99.79,4,Andrew Chirwa,Texarkana Texas,90.04,215.46,124.74,174.63,514.83,Single-ply,SBD,M
Boys,89.81,5,Dakota Mathers,South Garland,88.54,192.78,124.74,190.51,508.02,Single-ply,SBD,M
Boys,89.81,6,Samuell Rushing,Royse City,86.18,185.97,129.27,190.51,505.76,Single-ply,SBD,M
Boys,89.81,7,Luis Alvarez,Crandall,85.37,176.9,124.74,188.24,489.88,Single-ply,SBD,M
Boys,89.81,8,Jared Loftis,Royse City,88,185.97,106.59,197.31,489.88,Single-ply,SBD,M
Boys,89.81,9,Preston Powell,Forney,85,172.37,115.67,192.78,480.81,Single-ply,SBD,M
Boys,89.81,10,Miguel Sepulveda,North Forney,84.91,165.56,120.2,183.7,469.47,Single-ply,SBD,M
Boys,89.81,11,Will Morgan,Wills Point,85.46,183.7,111.13,174.63,469.47,Single-ply,SBD,M
Boys,99.79,12,Cipriano Gonzales,Greenville,89.9,170.1,124.74,170.1,464.93,Single-ply,SBD,M
Boys,89.81,13,Juan de la Cruz,Kaufman,89.54,172.37,102.06,185.97,460.4,Single-ply,SBD,M
Boys,99.79,14,Braylon Champion,Greenville,89.9,167.83,104.33,185.97,458.13,Single-ply,SBD,M
Boys,89.81,15,Christopher Richardson,North Forney,89.54,167.83,106.59,181.44,455.86,Single-ply,SBD,M
Boys,89.81,16,Fabi Molina,Lindale,87.09,170.1,95.25,181.44,446.79,Single-ply,SBD,M
Boys,89.81,17,Ryan Gregory,Quinlan Ford,89.63,170.1,99.79,176.9,446.79,Single-ply,SBD,M
Boys,89.81,18,Jaron Anthony,Texarkana Liberty-Eylau,83.37,181.44,99.79,163.29,444.52,Single-ply,SBD,M
Boys,89.81,19,Santiago Flores,Forney,84.37,156.49,108.86,163.29,428.64,Single-ply,SBD,M
Boys,89.81,20,Nathan Lewis,Wills Point,89.81,183.7,97.52,145.15,426.38,Single-ply,SBD,M
Boys,89.81,21,Warren Brightmon,Red Oak,84.19,158.76,106.59,158.76,424.11,Single-ply,SBD,M
Boys,89.81,22,Parker Wood,Rockwall-Heath,82.83,158.76,92.99,170.1,421.84,Single-ply,SBD,M
Boys,99.79,23,Garrett Westphal,Rockwall-Heath,89.9,158.76,111.13,151.95,421.84,Single-ply,SBD,M
Boys,89.81,24,John Day,Scurry-Rosser,83.1,167.83,95.25,149.69,412.77,Single-ply,SBD,M
Boys,99.79,25,Trent Haynes,Red Oak,89.9,156.49,92.99,163.29,412.77,Single-ply,SBD,M
Boys,89.81,26,Connor Barnett,Red Oak,83.73,142.88,95.25,158.76,396.89,Single-ply,SBD,M
Boys,89.81,27,Beau Hughes,North Forney,86.27,142.88,79.38,165.56,387.82,Single-ply,SBD,M
Boys,89.81,28,Matt Barock,Scurry-Rosser,89.81,140.61,83.91,154.22,378.75,Single-ply,SBD,M
Boys,89.81,29,Riley Hyslop,Plano John Paul II,85.73,111.13,83.91,181.44,376.48,Single-ply,SBD,M
Boys,89.81,30,Quadarrion George,North Forney,86.36,115.67,83.91,136.08,335.66,Single-ply,SBD,M
Boys,89.81,31,Dillon Wieland,Terrell,87.82,113.4,83.91,111.13,308.44,Single-ply,SBD,M
Boys,99.79,1,Casey Sergent,Quinlan Ford,98.52,290.3,149.69,272.16,712.14,Single-ply,SBD,M
Boys,99.79,2,Giresse Forchu,North Forney,90.81,235.87,154.22,238.14,628.23,Single-ply,SBD,M
Boys,99.79,3,Terry Jackson,North Forney,97.98,233.6,151.95,224.53,610.08,Single-ply,SBD,M
Boys,99.79,4,Morocco Arnold,Texarkana Liberty-Eylau,97.07,226.8,138.35,229.06,594.21,Single-ply,SBD,M
Boys,99.79,5,Devon Burris,Crandall,95.3,204.12,147.42,217.72,569.26,Single-ply,SBD,M
Boys,99.79,6,Taylor Lollis,Texarkana Liberty-Eylau,90.45,204.12,145.15,217.72,566.99,Single-ply,SBD,M
Boys,99.79,7,Christian Stewart,Forney,97.43,204.12,140.61,222.26,566.99,Single-ply,SBD,M
Boys,99.79,8,Bryce Hale,Quinlan Ford,97.98,226.8,111.13,190.51,528.44,Single-ply,SBD,M
Boys,99.79,9,William Wayne,Texarkana Liberty-Eylau,97.07,199.58,117.93,204.12,521.63,Single-ply,SBD,M
Boys,99.79,10,Andrew Hughes,Royse City,99.79,197.31,136.08,176.9,510.29,Single-ply,SBD,M
Boys,99.79,11,Brandon Moris,Scurry-Rosser,92.8,204.12,113.4,190.51,508.02,Single-ply,SBD,M
Boys,99.79,12,Thomas Johnson,Royse City,93.44,197.31,124.74,181.44,503.49,Single-ply,SBD,M
Boys,99.79,13,Cameron Davis,Bishop Lynch,98.97,199.58,106.59,192.78,498.95,Single-ply,SBD,M
Boys,99.79,14,Leo Delgado,South Garland,97.75,199.58,115.67,181.44,496.68,Single-ply,SBD,M
Boys,99.79,15,Jared King,Red Oak,94.71,188.24,108.86,183.7,480.81,Single-ply,SBD,M
Boys,99.79,16,Jordan Maraggia,Mabank,99.79,204.12,92.99,183.7,480.81,Single-ply,SBD,M
Boys,99.79,17,Ray Davis,Rockwall-Heath,91.9,183.7,108.86,183.7,476.27,Single-ply,SBD,M
Boys,99.79,18,Jaylen Rutherford,Texarkana Texas,91.26,188.24,113.4,165.56,467.2,Single-ply,SBD,M
Boys,109.77,19,Ethan Florence,Lindale,99.97,176.9,108.86,174.63,460.4,Single-ply,SBD,M
Boys,99.79,20,Chance Hamilton,Greenville,92.71,172.37,111.13,172.37,455.86,Single-ply,SBD,M
Boys,99.79,21,John Molina,Bishop Lynch,95.44,204.12,97.52,154.22,455.86,Single-ply,SBD,M
Boys,99.79,22,Cody Kuykendall,Mabank,98.97,181.44,131.54,142.88,455.86,Single-ply,SBD,M
Boys,99.79,23,Jairius Haynes,Red Oak,98.7,172.37,117.93,163.29,453.59,Single-ply,SBD,M
Boys,99.79,24,Jonathan Dunson,Kaufman,90.26,181.44,99.79,163.29,444.52,Single-ply,SBD,M
Boys,99.79,25,Garrett Smith,Kaufman,92.71,158.76,113.4,172.37,444.52,Single-ply,SBD,M
Boys,99.79,26,Josh Yarbrough,Lindale,95.62,172.37,99.79,172.37,444.52,Single-ply,SBD,M
Boys,99.79,27,Devin Boswell,Wills Point,91.99,158.76,90.72,176.9,426.38,Single-ply,SBD,M
Boys,99.79,28,Cody Rowland,Wills Point,99.7,167.83,95.25,161.03,424.11,Single-ply,SBD,M
Boys,99.79,29,Daniel Knod,Mabank,93.98,136.08,97.52,181.44,415.04,Single-ply,SBD,M
Boys,99.79,30,Collin Martian,Mabank,99.7,174.63,111.13,124.74,410.5,Single-ply,SBD,M
Boys,99.79,31,Michael Sheveland,Sunnyvale,98.43,158.76,86.18,161.03,405.97,Single-ply,SBD,M
Boys,99.79,32,Isiah Alvarez,Lindale,99.16,158.76,90.72,154.22,403.7,Single-ply,SBD,M
Boys,99.79,33,Jordan VanOver,Mabank,99.25,158.76,97.52,147.42,403.7,Single-ply,SBD,M
Boys,99.79,34,Michael Hafner #3,Red Oak,94.44,149.69,88.45,158.76,396.89,Single-ply,SBD,M
Boys,99.79,35,Josh Figuora,Sunnyvale,95.07,136.08,88.45,172.37,396.89,Single-ply,SBD,M
Boys,99.79,DQ,Jeffery Dodd,Quinlan Ford,94.8,181.44,83.91,,,Single-ply,SBD,M
Boys,99.79,DQ,Landon Wright,Lindale,97.86,174.63,,,,Single-ply,SBD,M
Boys,109.77,1,Damion Foster,Royse City,109.32,278.96,158.76,254.01,691.73,Single-ply,SBD,M
Boys,109.77,2,Thomas Marek,Red Oak,109.59,233.6,145.15,219.99,598.74,Single-ply,SBD,M
Boys,109.77,3,Anthony Ringenberg,Cumby,103.78,235.87,129.27,213.19,578.33,Single-ply,SBD,M
Boys,109.77,4,Dakotta Cooksy,Quinlan Ford,101.38,240.4,117.93,213.19,571.53,Single-ply,SBD,M
Boys,109.77,5,Stetson Farrell,Lindale,105.41,219.99,142.88,192.78,555.65,Single-ply,SBD,M
Boys,109.77,6,Justin Oleson,South Garland,108.41,217.72,120.2,188.24,526.17,Single-ply,SBD,M
Boys,109.77,7,Brandon Saens,Red Oak,104.78,199.58,120.2,197.31,517.1,Single-ply,SBD,M
Boys,109.77,8,Zach Applewhite,Lindale,106.14,197.31,136.08,183.7,517.1,Single-ply,SBD,M
Boys,109.77,9,Justin Miller,Wills Point,102.97,195.04,108.86,167.83,471.74,Single-ply,SBD,M
Boys,109.77,10,Charles Smith,Greenville,107.59,151.95,111.13,172.37,435.45,Single-ply,SBD,M
Boys,109.77,11,Dallas Millhansen,Quinlan Ford,100.79,174.63,97.52,158.76,430.91,Single-ply,SBD,M
Boys,109.77,12,Austin Buch,Plano John Paul II,106.05,136.08,111.13,183.7,430.91,Single-ply,SBD,M
Boys,109.77,13,Adan Lagunas,North Forney,105.78,167.83,79.38,181.44,428.64,Single-ply,SBD,M
Boys,109.77,14,Ralph Mendiola,Plano John Paul II,106.32,183.7,83.91,161.03,428.64,Single-ply,SBD,M
Boys,109.77,15,Zach Spurgin,Greenville,105.23,163.29,108.86,147.42,419.57,Single-ply,SBD,M
Boys,109.77,16,Yoojn Park,Bishop Lynch,109.59,158.76,88.45,172.37,419.57,Single-ply,SBD,M
Boys,109.77,17,Mohammed Al-Rousan,Sunnyvale,101.33,161.03,108.86,147.42,417.3,Single-ply,SBD,M
Boys,109.77,18,Thomas O'Toole-Halverson,Plano John Paul II,100.38,142.88,79.38,145.15,367.41,Single-ply,SBD,M
Boys,109.77,DQ,Darrien McQueen,Royse City,103.99,181.44,102.06,,,Single-ply,SBD,M
Boys,109.77,DQ,Casey Bishop,Forney,109.04,,72.57,,,Single-ply,SBD,M
Boys,124.74,1,Ethan Dobbs,Rockwall-Heath,121.47,231.33,147.42,233.6,612.35,Single-ply,SBD,M
Boys,124.74,2,Chris Paul,Texarkana Liberty-Eylau,117.93,222.26,158.76,210.92,591.94,Single-ply,SBD,M
Boys,124.74,3,Evan Higbee,Rockwall-Heath,113.85,233.6,129.27,226.8,589.67,Single-ply,SBD,M
Boys,124.74,4,Casey Hargrove,Emory Rains,116.66,215.46,131.54,226.8,573.79,Single-ply,SBD,M
Boys,124.74,5,Jorge Rodriguez,Greenville,120.2,226.8,142.88,183.7,553.38,Single-ply,SBD,M
Boys,124.74,6,David Allen,Quinlan Ford,110.68,217.72,111.13,222.26,551.11,Single-ply,SBD,M
Boys,124.74,7,Hayden Hart,Texarkana Liberty-Eylau,115.67,215.46,145.15,190.51,551.11,Single-ply,SBD,M
Boys,124.74+,8,Justin Tennison,Crandall,124.92,204.12,138.35,197.31,539.77,Single-ply,SBD,M
Boys,124.74,9,Nick Savala,Bishop Lynch,117.66,226.8,106.59,181.44,514.83,Single-ply,SBD,M
Boys,124.74,10,Tj Talashek,Sunnyvale,123.1,226.8,61.23,215.46,503.49,Single-ply,SBD,M
Boys,124.74,11,Chase Reagin,Rockwall-Heath,123.29,181.44,106.59,213.19,501.22,Single-ply,SBD,M
Boys,124.74,12,Dj Williams,Lindale,112.13,190.51,108.86,195.04,494.42,Single-ply,SBD,M
Boys,124.74,13,Alex Ellis,Texarkana Texas,114.58,206.38,102.06,183.7,492.15,Single-ply,SBD,M
Boys,124.74,14,Terrence Walker,North Forney,115.3,192.78,111.13,181.44,485.34,Single-ply,SBD,M
Boys,124.74,15,Jemarcus Watson,Texarkana Texas,120.66,183.7,117.93,181.44,483.08,Single-ply,SBD,M
Boys,124.74,16,Jess Jenkins,Sulphur Springs,122.47,174.63,113.4,181.44,469.47,Single-ply,SBD,M
Boys,124.74,17,Austin Walker #5,Wills Point,123.1,195.04,83.91,190.51,469.47,Single-ply,SBD,M
Boys,124.74,18,Glen Goode,Cumby,117.39,172.37,117.93,165.56,455.86,Single-ply,SBD,M
Boys,124.74,19,Jose Escadra,Bishop Lynch,116.03,185.97,102.06,163.29,451.32,Single-ply,SBD,M
Boys,124.74,20,John Brown,Wills Point,120.02,165.56,102.06,181.44,449.06,Single-ply,SBD,M
Boys,124.74,21,Hunter Brogdon,North Forney,124.74,167.83,97.52,181.44,446.79,Single-ply,SBD,M
Boys,124.74,22,Mitchell Wheat,Greenville,113.13,170.1,102.06,170.1,442.25,Single-ply,SBD,M
Boys,124.74,23,Dane Wieland,Terrell,116.12,154.22,124.74,142.88,421.84,Single-ply,SBD,M
Boys,124.74,24,Austin Sealy,Forney,111.95,151.95,77.11,163.29,392.36,Single-ply,SBD,M
Boys,124.74,25,Vaughan Thompson,Wills Point,111.49,149.69,102.06,138.35,390.09,Single-ply,SBD,M
Boys,124.74,DQ,Jared Hughes,Plano John Paul II,114.94,183.7,,,,Single-ply,SBD,M
Boys,124.74,DQ,Mustaffa Rahah,Sunnyvale,116.17,,,,,Single-ply,SBD,M
Boys,124.74+,1,Jonathan Northcutt,Emory Rains,132.45,278.96,183.7,263.08,725.75,Single-ply,SBD,M
Boys,124.74+,2,Chris Ramos,Forney,128.73,240.4,174.63,240.4,655.44,Single-ply,SBD,M
Boys,124.74+,3,Sean Langley,South Garland,136.8,285.76,149.69,204.12,639.57,Single-ply,SBD,M
Boys,124.74+,4,Johnathan Hunt,Texarkana Texas,135.81,249.48,145.15,219.99,614.62,Single-ply,SBD,M
Boys,124.74+,5,Michael Stiles,Lindale,126.1,226.8,136.08,235.87,598.74,Single-ply,SBD,M
Boys,124.74+,6,Tyler Heard,Scurry-Rosser,143.97,240.4,149.69,199.58,589.67,Single-ply,SBD,M
Boys,124.74+,7,Mike Reed,Texarkana Texas,133.36,229.06,124.74,226.8,580.6,Single-ply,SBD,M
Boys,124.74+,8,Hunter Strebeck,Mabank,135.35,229.06,151.95,199.58,580.6,Single-ply,SBD,M
Boys,124.74+,9,Zelarious Taylor,South Garland,131.81,226.8,163.29,188.24,578.33,Single-ply,SBD,M
Boys,124.74+,10,Marquan Edmond,Texarkana Liberty-Eylau,166.81,226.8,158.76,190.51,576.06,Single-ply,SBD,M
Boys,124.74+,11,Andre McKissack,Crandall,134.26,197.31,124.74,226.8,548.85,Single-ply,SBD,M
Boys,124.74+,12,Antonio Romo,Lindale,143.97,222.26,113.4,210.92,546.58,Single-ply,SBD,M
Boys,124.74+,13,Marquise Champion,Greenville,157.08,208.65,124.74,195.04,528.44,Single-ply,SBD,M
Boys,124.74+,14,Justin Pinson,Mabank,146.24,208.65,90.72,181.44,480.81,Single-ply,SBD,M
Boys,124.74+,15,Ethan Gott,Lindale,146.78,192.78,92.99,183.7,469.47,Single-ply,SBD,M
