Division,WeightClassKg,Place,Name,Team,BodyweightKg,Best3SquatKg,Best3BenchKg,Best3DeadliftKg,TotalKg,Equipment,Event,Sex
Boys,51.71,1,Brian Pafford,Godley,49.62,129.27,65.77,113.4,308.44,Single-ply,SBD,M
Boys,51.71,2,Lewis Jacob,Stephenville,48.99,113.4,56.7,117.93,288.03,Single-ply,SBD,M
Boys,51.71,3,Daniel Pafford,Godley,51.44,108.86,52.16,113.4,274.42,Single-ply,SBD,M
Boys,51.71,4,Antonio Ponce,Glen Rose,47.08,104.33,45.36,117.93,267.62,Single-ply,SBD,M
Boys,51.71,5,Wyatt Ivey,Lometa,43.18,63.5,36.29,92.99,192.78,Single-ply,SBD,M
Boys,59.87,1,Marcos Mendoza,Salado,55.88,158.76,99.79,170.1,428.64,Single-ply,SBD,M
Boys,55.79,2,Jonathan Taylor,Lingleville,54.98,124.74,63.5,149.69,337.93,Single-ply,SBD,M
Boys,59.87,3,Chris Ramirez,Lampasas,55.97,115.67,63.5,131.54,310.71,Single-ply,SBD,M
Boys,59.87,4,Chris Kimbell,Cleburne,56.02,127.01,65.77,113.4,306.17,Single-ply,SBD,M
Boys,55.79,5,Jeremy Neagle,Stephenville,54.43,77.11,52.16,106.59,235.87,Single-ply,SBD,M
Boys,59.87,DQ,Joe Reyes,Brady,55.88,86.18,,,,Single-ply,SBD,M
Boys,67.13,1,Jose Morantes,Dublin,60.06,156.49,102.06,192.78,451.32,Single-ply,SBD,M
Boys,67.13,2,Dakota Murray,Brady,60.06,181.44,72.57,192.78,446.79,Single-ply,SBD,M
Boys,59.87,3,Isaiah Lombrana,Brady,56.79,172.37,97.52,165.56,435.45,Single-ply,SBD,M
Boys,59.87,4,Conner Barrett,Llano,58.6,158.76,86.18,158.76,403.7,Single-ply,SBD,M
Boys,67.13,5,Oscar Chacon,Llano,59.96,124.74,77.11,154.22,356.07,Single-ply,SBD,M
Boys,59.87,6,Cole Allen,Dublin,58.79,111.13,65.77,136.08,312.98,Single-ply,SBD,M
Boys,59.87,7,Dakotah Martinez,Stephenville,58.97,106.59,68.04,138.35,312.98,Single-ply,SBD,M
Boys,59.87,8,Rowdy Carlson,Brady,58.24,86.18,56.7,106.59,249.48,Single-ply,SBD,M
Boys,59.87,DQ,Carlin Linnaberry,Glen Rose,59.42,136.08,,,,Single-ply,SBD,M
Boys,59.87,DQ,Kevin Black,Stephenville,58.97,104.33,,,,Single-ply,SBD,M
Boys,67.13,DQ,Justus Alaniz,Lometa,59.96,129.27,,,,Single-ply,SBD,M
Boys,74.84,1,Zeph Valdez,Brady,67.22,185.97,120.2,188.24,494.42,Single-ply,SBD,M
Boys,67.13,2,Jeremy Fuentes,Cleburne,66.5,163.29,95.25,167.83,426.38,Single-ply,SBD,M
Boys,67.13,3,Melvin Flores,Lampasas,61.14,151.95,83.91,172.37,408.23,Single-ply,SBD,M
Boys,67.13,4,Jesse Luker,Comanche,66.04,147.42,92.99,158.76,399.16,Single-ply,SBD,M
Boys,67.13,5,Taylor Luce,Godley,64.5,161.03,88.45,145.15,394.63,Single-ply,SBD,M
Boys,74.84,6,Trevor Crawford,Glen Rose,67.31,142.88,88.45,154.22,385.55,Single-ply,SBD,M
Boys,67.13,7,Josh Gellespie,Stephenville,67.13,156.49,81.65,145.15,383.29,Single-ply,SBD,M
Boys,67.13,8,Marco Munoz,Lampasas,65.5,133.81,83.91,163.29,381.02,Single-ply,SBD,M
Boys,67.13,9,Alex Jackson,Cross Plains,66.77,147.42,92.99,140.61,381.02,Single-ply,SBD,M
Boys,67.13,10,Nathan Smith #9,Glen Rose,65.59,140.61,81.65,154.22,376.48,Single-ply,SBD,M
Boys,67.13,11,Jeffrey Gage,Keller Timber Creek,66.86,124.74,90.72,156.49,371.95,Single-ply,SBD,M
Boys,67.13,12,Chad Heitman,Godley,60.87,136.08,77.11,136.08,349.27,Single-ply,SBD,M
Boys,67.13,13,Colton Miller,Glen Rose,66.5,127.01,72.57,145.15,344.73,Single-ply,SBD,M
Boys,67.13,14,Angel Amezcua,Glen Rose,64.23,122.47,83.91,127.01,333.39,Single-ply,SBD,M
Boys,67.13,DQ,Walker Shelton,Tolar,60.42,170.1,86.18,,,Single-ply,SBD,M
Boys,67.13,DQ,Drew Patterson,Stephenville,67.13,106.59,,,,Single-ply,SBD,M
Boys,67.13,DQ,Adrian Zackery,Lampasas,65.14,,,,,Single-ply,SBD,M
Boys,74.84,DQ,Tyler Perkins,Comanche,67.36,,,,,Single-ply,SBD,M
Boys,67.13,DQ,Andy Pozos,Brady,65.5,106.59,,,,Single-ply,SBD,M
Boys,74.84,1,Alex Scallion,Castleberry,72.67,210.92,113.4,181.44,505.76,Single-ply,SBD,M
Boys,74.84,2,Ian Valdez,Glen Rose,67.95,188.24,99.79,181.44,469.47,Single-ply,SBD,M
Boys,74.84,3,Dylan White,Stephenville,73.94,165.56,120.2,183.7,469.47,Single-ply,SBD,M
Boys,74.84,4,Fidel Perez,Dublin,73.21,167.83,106.59,163.29,437.72,Single-ply,SBD,M
Boys,74.84,5,Josh Beasley,Glen Rose,71.4,172.37,86.18,172.37,430.91,Single-ply,SBD,M
Boys,82.1,6,Addison Hunter,Lingleville,75.02,145.15,95.25,181.44,421.84,Single-ply,SBD,M
Boys,74.84,7,Jcob Leal,Lingleville,74.66,163.29,86.18,167.83,417.3,Single-ply,SBD,M
Boys,74.84,8,Joseph Calderon,Keller Timber Creek,72.12,165.56,92.99,154.22,412.77,Single-ply,SBD,M
Boys,74.84,9,Aron Anaya,Comanche,74.66,142.88,102.06,167.83,412.77,Single-ply,SBD,M
Boys,74.84,10,Abel Ledesma,Comanche,69.58,151.95,90.72,156.49,399.16,Single-ply,SBD,M
Boys,74.84,11,Kristian Martinez,Millsap,69.4,142.88,99.79,145.15,387.82,Single-ply,SBD,M
Boys,74.84,12,Travis Hickman,Comanche,69.94,147.42,83.91,151.95,383.29,Single-ply,SBD,M
Boys,74.84,13,Hayden Swearingin,Glen Rose,67.86,138.35,95.25,142.88,376.48,Single-ply,SBD,M
Boys,74.84,14,Allen Breaux,Santo,71.67,142.88,70.31,142.88,356.07,Single-ply,SBD,M
Boys,74.84,15,Jarron Sandoval,Brady,73.3,127.01,70.31,158.76,356.07,Single-ply,SBD,M
Boys,82.1,1,Salvador Marquez,Comanche,81.65,213.19,122.47,210.92,546.58,Single-ply,SBD,M
Boys,82.1,2,Saul Lopez,Comanche,80.1,206.38,117.93,208.65,532.97,Single-ply,SBD,M
Boys,89.81,3,Cole Barrett,Llano,82.19,206.38,122.47,185.97,514.83,Single-ply,SBD,M
Boys,82.1,4,Vontrell Grant,Cleburne,77.47,172.37,108.86,208.65,489.88,Single-ply,SBD,M
Boys,82.1,5,Cody Jandreau,Lampasas,81.1,181.44,129.27,172.37,483.08,Single-ply,SBD,M
Boys,82.1,6,Levi Cuevas,Cleburne,81.92,195.04,104.33,163.29,462.66,Single-ply,SBD,M
Boys,82.1,7,Damian Hatcher,Dublin,79.92,154.22,115.67,161.03,430.91,Single-ply,SBD,M
Boys,82.1,8,Dakota Bomar,Cross Plains,77.2,142.88,92.99,192.78,428.64,Single-ply,SBD,M
Boys,82.1,9,Lane Walker,Comanche,79.2,151.95,86.18,156.49,394.63,Single-ply,SBD,M
Boys,89.81,10,Izmiel Torres,Dublin,82.19,136.08,90.72,151.95,378.75,Single-ply,SBD,M
Boys,82.1,11,Dylan Esquivel,Godley,81.01,136.08,81.65,154.22,371.95,Single-ply,SBD,M
Boys,82.1,12,Isaiah Regeon,Brady,80.2,131.54,65.77,127.01,324.32,Single-ply,SBD,M
Boys,89.81,1,Zach Haler,Cleburne,84.19,210.92,142.88,217.72,571.53,Single-ply,SBD,M
Boys,99.79,2,Justin Maldonado,Lampasas,89.99,226.8,117.93,204.12,548.85,Single-ply,SBD,M
Boys,89.81,3,Ben Mungia,Glen Rose,82.83,215.46,124.74,206.38,546.58,Single-ply,SBD,M
Boys,89.81,4,Zayne Gumler,Tolar,88.27,213.19,99.79,219.99,532.97,Single-ply,SBD,M
Boys,89.81,5,Andrew Maldonado,Castleberry,89.27,204.12,122.47,199.58,526.17,Single-ply,SBD,M
Boys,89.81,6,Rudy Rodriguez,Dublin,86.36,188.24,111.13,201.85,501.22,Single-ply,SBD,M
Boys,89.81,7,Steven McKinney,Lampasas,89.72,181.44,122.47,195.04,498.95,Single-ply,SBD,M
Boys,89.81,8,Tory Endtricht,Cleburne,88.9,170.1,124.74,190.51,485.34,Single-ply,SBD,M
Boys,89.81,9,Tyler Bridges,Salado,85,172.37,90.72,172.37,435.45,Single-ply,SBD,M
Boys,89.81,10,Chance Benedict,Comanche,87.91,158.76,92.99,170.1,421.84,Single-ply,SBD,M
Boys,89.81,11,Adam Prado,Lampasas,88.72,158.76,102.06,142.88,403.7,Single-ply,SBD,M
Boys,89.81,12,Cj Camarrillo,Brady,87,149.69,97.52,131.54,378.75,Single-ply,SBD,M
Boys,89.81,13,Ian Horton,Stephenville,83.91,113.4,74.84,149.69,337.93,Single-ply,SBD,M
Boys,89.81,DQ,Jacoby Miller-Salem,Stephenville,89.81,156.49,106.59,,,Single-ply,SBD,M
Boys,89.81,DQ,Noah Perez,Stephenville,87.09,95.25,,,,Single-ply,SBD,M
Boys,99.79,DQ,Josh Fleming,Keller Timber Creek,89.9,,,,,Single-ply,SBD,M
Boys,89.81,DQ,Luke Bowling,Santo,85.73,204.12,,,,Single-ply,SBD,M
Boys,89.81,DQ,Ryan Baugh,Stephenville,86.18,,,,,Single-ply,SBD,M
Boys,89.81,DQ,Gunner Reed,Stephenville,83.91,,,,,Single-ply,SBD,M
Boys,99.79,DQ,Tim Delatorre,De Leon,89.99,208.65,,,,Single-ply,SBD,M
Boys,89.81,DQ,Chris Luna,Castleberry,89.63,188.24,111.13,,,Single-ply,SBD,M
Boys,99.79,1,Joel Elizondo,Comanche,96.16,256.28,151.95,222.26,630.49,Single-ply,SBD,M
Boys,99.79,2,Secody Howard,Lampasas,97.25,226.8,122.47,244.94,594.21,Single-ply,SBD,M
Boys,99.79,3,Justin Oestreich,Llano,96.07,213.19,131.54,244.94,589.67,Single-ply,SBD,M
Boys,99.79,4,Sheldon Libey,Cross Plains,91.53,226.8,147.42,210.92,585.13,Single-ply,SBD,M
Boys,99.79,5,Heath Nicholson,Glen Rose,96.62,208.65,90.72,217.72,517.1,Single-ply,SBD,M
Boys,99.79,6,Donald Ricketson,Llano,99.79,197.31,129.27,190.51,517.1,Single-ply,SBD,M
Boys,99.79,7,Josh Valles,Lampasas,95.8,204.12,122.47,185.97,512.56,Single-ply,SBD,M
Boys,99.79,8,Ace Navarrete,Glen Rose,93.08,219.99,104.33,181.44,505.76,Single-ply,SBD,M
Boys,99.79,9,Martin Vazquez,Lingleville,94.17,174.63,99.79,188.24,462.66,Single-ply,SBD,M
Boys,99.79,10,Dawson Matheny,Glen Rose,97.07,170.1,108.86,170.1,449.06,Single-ply,SBD,M
Boys,99.79,11,Dylan Driver,Stephenville,99.79,167.83,102.06,165.56,435.45,Single-ply,SBD,M
Boys,99.79,12,Ambrosio Rodriguez,Dublin,91.72,165.56,86.18,179.17,430.91,Single-ply,SBD,M
Boys,99.79,13,Mitchell Coker,Millsap,98.07,172.37,106.59,151.95,430.91,Single-ply,SBD,M
Boys,99.79,14,Tyler Talbott,Salado,91.72,163.29,95.25,163.29,421.84,Single-ply,SBD,M
Boys,99.79,15,Jacob Martin,Stephenville,92.99,154.22,92.99,154.22,401.43,Single-ply,SBD,M
Boys,99.79,16,Jacob Pobble,Salado,96.43,142.88,74.84,147.42,365.14,Single-ply,SBD,M
Boys,99.79,17,Peyton Womac,Salado,97.16,145.15,86.18,131.54,362.87,Single-ply,SBD,M
Boys,99.79,18,Rj Darch,Glen Rose,95.25,113.4,63.5,136.08,312.98,Single-ply,SBD,M
Boys,109.77,1,James Thornburg,Cleburne,107.5,226.8,142.88,197.31,566.99,Single-ply,SBD,M
Boys,109.77,2,Andy Gamez,Lampasas,107.59,226.8,117.93,213.19,557.92,Single-ply,SBD,M
Boys,109.77,3,David Cockrell,Lampasas,106.96,206.38,142.88,195.04,544.31,Single-ply,SBD,M
Boys,109.77,4,Tyler Ferguson,Stephenville,109.32,204.12,131.54,204.12,539.77,Single-ply,SBD,M
Boys,109.77,5,Adrian Martinez #5,Lampasas,103.06,181.44,122.47,222.26,526.17,Single-ply,SBD,M
Boys,109.77,6,Marshall Wirtz,Comanche,104.69,181.44,106.59,176.9,464.93,Single-ply,SBD,M
Boys,109.77,7,Chris Delatorre,De Leon,101.06,181.44,95.25,174.63,451.32,Single-ply,SBD,M
Boys,109.77,8,Max Driscoll,Godley,105.78,163.29,113.4,170.1,446.79,Single-ply,SBD,M
Boys,109.77,9,Cameron Reynolds,Stephenville,108.86,158.76,102.06,161.03,421.84,Single-ply,SBD,M
Boys,109.77,10,Alex Rodriguez,Dublin,108.41,149.69,111.13,154.22,415.04,Single-ply,SBD,M
Boys,109.77,11,Justin Wade,Stephenville,102.06,131.54,74.84,192.78,399.16,Single-ply,SBD,M
Boys,109.77,DQ,Max Jones #2,Stephenville,102.97,181.44,97.52,,,Single-ply,SBD,M
Boys,109.77,DQ,Jordan Dugan,Godley,105.51,,,,,Single-ply,SBD,M
Boys,109.77,DQ,Jordan Boggs,Brady,109.13,,,,,Single-ply,SBD,M
Boys,124.74,1,Damon Hinrichs,Millsap,116.85,290.3,217.72,231.33,739.36,Single-ply,SBD,M
Boys,124.74,2,Mason White,Keller Timber Creek,124.74,283.5,181.44,238.14,703.07,Single-ply,SBD,M
Boys,124.74,3,Brandon Lane,Tolar,114.94,249.48,158.76,249.48,657.71,Single-ply,SBD,M
Boys,124.74,4,Diamond Cardona,Godley,110.5,181.44,108.86,199.58,489.88,Single-ply,SBD,M
Boys,124.74,DQ,Jake Terry,Lampasas,110.68,219.99,,,,Single-ply,SBD,M
Boys,124.74+,1,Zac Perez,Glen Rose,127.01,322.05,181.44,240.4,743.89,Single-ply,SBD,M
Boys,124.74+,2,Michael Williams,Dublin,132.72,226.8,161.03,226.8,614.62,Single-ply,SBD,M
Boys,124.74+,3,Eduardo Cassio,Cleburne,135.44,272.16,145.15,181.44,598.74,Single-ply,SBD,M
Boys,124.74+,4,Jordan Kilcrease,Stephenville,131.54,238.14,151.95,188.24,578.33,Single-ply,SBD,M
Boys,124.74+,5,Dylan Hamilton,Godley,137.35,235.87,145.15,195.04,576.06,Single-ply,SBD,M
Boys,124.74+,6,Bryan Manley,Stephenville,127.01,226.8,131.54,206.38,564.72,Single-ply,SBD,M
Boys,124.74+,7,Jake Dibble,Lampasas,134.72,215.46,117.93,204.12,537.51,Single-ply,SBD,M
Boys,124.74+,8,Julio Martinez,Castleberry,125.01,204.12,120.2,183.7,508.02,Single-ply,SBD,M
Boys,124.74+,DQ,Jacob Jimmerson,Salado,129.91,,,,,Single-ply,SBD,M
