Sex,Division,WeightClassKg,Name,BodyweightKg,Bench1Kg,Bench2Kg,Bench3Kg,Best3BenchKg,TotalKg,Place,Event,Equipment
M,Open,66,A. Garau,64.9,-130,-140,-140,,,DQ,B,Single-ply
M,Master I,83,Alessandro Silvas,80.9,-170,-170,-170,,,DQ,B,Single-ply
M,Open,83,Alessandro Urru,80.1,-85,87.5,-90,87.5,87.5,6,B,Raw
M,Open,93,Alessio Marazzini,91.8,-165,-165,,,,DQ,B,Single-ply
M,Open,74,Andrea Garavaglia,71.1,135,-140,142.5,142.5,142.5,4,B,Single-ply
M,Open,66,Andrea Marrosu,64.8,-105,-110,110,110,110,3,B,Single-ply
M,Open,93,Andrea Mirabelli,92.8,-170,-170,-177.5,,,DQ,B,Single-ply
M,Sub-Junior,74,Andrea Pes,73.1,-127.5,127.5,130,130,130,2,B,Raw
M,Open,105,Andrea Pipere,99.7,127.5,132.5,140,140,140,4,B,Raw
M,Master II,105,Antonello Casu,100.6,115,125,-132.5,125,125,1,B,Raw
M,Master I,93,Antonello Verachi,89.9,185,200,-210,200,200,1,B,Single-ply
M,Junior,83,Antonio Contenta,82.7,177.5,-185,-186.5,177.5,177.5,2,B,Single-ply
M,Open,66,Antonio Garau,64.8,110,112.5,-120,112.5,112.5,7,B,Raw
M,Open,59,Antonio Pischedda,56.8,60,67.5,72.5,72.5,72.5,2,B,Raw
M,Master I,105,Claudio D'Ovidio,104.7,240,247.5,-250,247.5,247.5,1,B,Single-ply
M,Open,120+,Claudio Randazzo,138.5,220,-227.5,232.5,232.5,232.5,1,B,Single-ply
M,Open,74,Danilo Madeddu,73.7,150,152.5,-170,152.5,152.5,2,B,Single-ply
M,Sub-Junior,83,Davide Piemonte,79.2,-80,85,95,95,95,1,B,Raw
M,Open,66,F. Nenci,66,130,135,140,140,140,1,B,Single-ply
M,Open,74,Federico Nenci,66.3,127.5,132.5,-135,132.5,132.5,4,B,Raw
M,Sub-Junior,83,Francesco Cosseddu,76.5,125,152.5,-160,152.5,152.5,1,B,Single-ply
M,Junior,93,G. Manca,84.8,137.5,147.5,155,155,155,1,B,Raw
M,Open,83,Gavino Carta,81.5,120,-125,125,125,125,5,B,Raw
M,Open,83,Gennaro Liguori,79.6,185,-190,190,190,190,1,B,Single-ply
M,Open,74,Giangavino Peppi,67.7,120,125,130,130,130,6,B,Raw
M,Master I,93,Gianstefano Fara,86.7,130,140,-145,140,140,1,B,Raw
M,Master II,66,Giovanni D'Alessandro,63.8,137.5,142.5,-145,142.5,142.5,1,B,Single-ply
M,Junior,93,Giovanni Erba,86.9,155,160,-170,160,160,2,B,Single-ply
M,Open,83,Giovanni Maria Corrias,77,125,130,132.5,132.5,132.5,1,B,Raw
M,Open,74,Giovannino Pinna,74,130,137.5,-142.5,137.5,137.5,3,B,Raw
M,Junior,120,Giuseppe La Sala,106.6,155,160,-180,160,160,1,B,Single-ply
M,Junior,93,Giuseppe Manca,84.5,160,167.5,-175,167.5,167.5,1,B,Single-ply
M,Open,120,Giuseppe Zangari,110.3,-195,-195,195,195,195,2,B,Single-ply
M,Open,74,Joaquin Lopez,72.1,125,-130,130,130,130,6,B,Single-ply
M,Junior,74,Lorenzo Giorgi,73.1,125,-130,-130,125,125,1,B,Single-ply
M,Open,83,Luca Borsani,77.8,125,130,-135,130,130,3,B,Raw
M,Junior,74,Luca Veneriano,67.3,110,-115,115,115,115,2,B,Raw
M,Master II,93,Luciano Bertoletti,85.3,115,125,135,135,135,1,B,Raw
M,Open,59,Luigi Usai,57.1,75,80,85,85,85,1,B,Raw
M,Open,83,M. Carcano,74.9,132.5,137.5,-142.5,137.5,137.5,3,B,Single-ply
M,Open,105,Manuel Accorra,104.5,130,137.5,145,145,145,3,B,Raw
M,Sub-Junior,74,Manuel Marongiu,74,140,147.5,150,150,150,1,B,Raw
M,Open,105,Marco Bianchi,96.8,155,160,170,170,170,2,B,Single-ply
M,Open,93,Marco Lambardi,90.2,150,-157.5,-162.5,150,150,1,B,Raw
M,Open,74,Marco Mura,68.9,80,90,-100,90,90,8,B,Raw
M,Open,74,Marco Spizzo,72,130,135,140,140,140,5,B,Single-ply
M,Open,83,Massimiliano Buccioni,81.5,170,-175,-175,170,170,2,B,Single-ply
M,Open,83,Massimo Giacomelli,81.4,120,125,-130,125,125,4,B,Raw
M,Open,120,Mattia Di Martino,118.2,200,205,-212.5,205,205,1,B,Single-ply
M,Open,83,Mauro Carcano,74.7,122.5,127.5,130,130,130,2,B,Raw
M,Open,74,Michele Marras,71.5,-130,140,145,145,145,3,B,Single-ply
M,Open,74,Michele Marras,71.1,115,122.5,132.5,132.5,132.5,5,B,Raw
M,Junior,83,Niccolo Degiovanni,76.6,172.5,180,185,185,185,1,B,Single-ply
M,Open,74,Pasquale Gori,72.8,135,140,-142.5,140,140,2,B,Raw
M,Junior,74,Patrick Premazzi,71.3,135,137.5,-140,137.5,137.5,1,B,Raw
M,Open,74,Pierangelo Puddu,72.5,162.5,-170,-175,162.5,162.5,1,B,Single-ply
M,Open,74,Pierluigi Zerbino,72.1,-100,-100,-100,,,DQ,B,Raw
M,Open,66,Riccardo Magi,65.3,125,132.5,137.5,137.5,137.5,2,B,Single-ply
M,Junior,83,Riccardo Murgia,81.9,-110,110,-112.5,110,110,3,B,Single-ply
M,Open,105,Salvatore Vacca,100.9,167.5,175,-180,175,175,2,B,Raw
M,Master III,93,Sandro Rossi,90.2,115,120,125,125,125,1,B,Single-ply
M,Open,105,Silvio Crisafi,93.1,-240,240,247.5,247.5,247.5,1,B,Single-ply
M,Open,74,Silvio Pinna,72.4,135,140,145,145,145,1,B,Raw
M,Junior,83,Simone Carniel,80.8,-105,-105,-105,,,DQ,B,Single-ply
M,Sub-Junior,59,Vincenzo Cerasa,56.2,70,90,-97.5,90,90,1,B,Single-ply
M,Open,105,Zdzislav Galecki,98.1,165,170,177.5,177.5,177.5,1,B,Raw
F,Open,47,Barbara Peti,46.3,70,-72.5,-75,70,70,1,B,Single-ply
F,Open,52,Stefania Saddi,51.2,62.5,67.5,-72.5,67.5,67.5,1,B,Single-ply
F,Master I,52,Bruna Corsi,50.3,52.5,55,-57.5,55,55,1,B,Single-ply
F,Master I,57,Tiziana Troilo,55.9,-77.5,77.5,-85.5,77.5,77.5,1,B,Single-ply
F,Open,57,Manuela Masci,56.5,-70,70,-80,70,70,1,B,Single-ply
F,Junior,63,Tania Tomaselli,60,52.5,-57.5,-57.5,52.5,52.5,1,B,Single-ply
F,Open,72,Lucia Dambra,67.2,95,100,110,110,110,1,B,Single-ply
F,Master II,84,Sara Del Duca,73.8,-95,-95,95,95,95,1,B,Single-ply
F,Master I,84,Maria Pia Moscianese,77.2,70,75,80,80,80,1,B,Single-ply
F,Open,57,Elena Nulvesu,54.8,62.5,67.5,70,70,70,1,B,Raw
F,Open,63,Teresa Loi,61.8,65,70,-75,70,70,1,B,Raw
F,Open,52,Luciana Corda,50.9,42.5,45,-47.5,45,45,1,B,Raw
F,Open,72,Emanuela Perotti,65.3,40,-45,-45,40,40,1,B,Raw
