Name,Age,Division,BodyweightKg,WeightClassKg,Squat1Kg,Squat2Kg,Squat3Kg,Best3SquatKg,Bench1Kg,Bench2Kg,Bench3Kg,Bench4Kg,Best3BenchKg,Deadlift1Kg,Deadlift2Kg,Deadlift3Kg,Best3DeadliftKg,TotalKg,Place,Sex,Event,Equipment,BirthDate
Belinda Ryder,49,F-OR,59.2,60,147.5,157.5,165,165,75,80,85,87.5,85,175,187.5,195,195,445,1,F,SBD,Wraps,
Casey Pawson,24,F-OR,70.9,75,-212.5,212.5,225,225,115,122.5,-127.5,,122.5,195,215,-225,215,562.5,1,F,SBD,Wraps,
Suzie Maude,44,F-OR,108.9,110,247.5,262.5,,262.5,85,90,95,,95,200,210,215,215,572.5,1,F,SBD,Wraps,
Daniel Mahony,17,M-OR,74.2,75,-240,255,265,265,140,-152.5,-152.5,,140,275,-295,-295,275,680,1,M,SBD,Wraps,
Tommy-Lee McGrath,28,M-OR,81.6,82.5,260,-280,-280,260,150,160,-165,,160,300,320,-330,320,740,1,M,SBD,Wraps,
Brock Risdale,29,M-OR,109.8,110,300,315,320,320,185,192.5,200,,200,295,310,-315,310,830,1,M,SBD,Wraps,
Ryan Mayfield,30,M-OR,124.6,125,325,345,-360,345,180,185,-190,,185,320,340,-355,340,870,1,M,SBD,Wraps,
Kaine Shephard,35,M-OR,157.8,140+,345,-375,375,375,180,190,195,,195,275,300,-310,300,870,1,M,SBD,Wraps,1985-01-02
Andrew Laing,30,M-OR,147.5,140+,340,370,385,385,187.5,192.5,-200,,192.5,240,260,-275,260,837.5,2,M,SBD,Wraps,
