<?xml version="1.0" encoding="UTF-8"?>
<!DOCTYPE svg PUBLIC "-//W3C//DTD SVG 1.1//EN" "http://www.w3.org/Graphics/SVG/1.1/DTD/svg11.dtd">
<!-- Creator: CorelDRAW X8 -->
<svg xmlns="http://www.w3.org/2000/svg" xml:space="preserve" width="75.9609mm" height="14.4637mm" version="1.1" style="shape-rendering:geometricPrecision; text-rendering:geometricPrecision; image-rendering:optimizeQuality; fill-rule:evenodd; clip-rule:evenodd"
viewBox="0 0 1328 253"
 xmlns:xlink="http://www.w3.org/1999/xlink">
 <defs>
  <style type="text/css">
   <![CDATA[
    .fil4 {fill:none}
    .fil1 {fill:none;fill-rule:nonzero}
    .fil5 {fill:#005898}
    .fil3 {fill:#009EE8}
    .fil6 {fill:white}
    .fil2 {fill:#005898;fill-rule:nonzero}
    .fil0 {fill:#009EE8;fill-rule:nonzero}
   ]]>
  </style>
     <clipPath id="id0" style="clip-rule:nonzero">
      <path d="M465 12l30 0c7,0 12,0 16,1 5,2 9,4 12,8 4,4 6,8 8,13 2,6 3,12 3,20 0,7 -1,12 -3,17 -2,6 -5,11 -8,15 -3,3 -7,5 -12,6 -4,2 -9,2 -15,2l-31 0 0 -82zm17 14l0 54 12 0c5,0 8,0 10,-1 3,0 5,-1 7,-3 2,-2 3,-4 4,-8 1,-4 2,-9 2,-15 0,-6 -1,-11 -2,-15 -1,-3 -3,-6 -5,-8 -2,-1 -4,-3 -7,-3 -3,-1 -7,-1 -14,-1l-7 0zm66 68l0 -82 35 0c9,0 15,1 19,2 4,2 7,4 10,8 2,4 3,8 3,13 0,6 -2,11 -5,15 -4,4 -9,7 -16,8 3,2 6,4 8,7 3,2 6,7 10,13l10 16 -20 0 -12 -18c-4,-6 -7,-10 -9,-12 -1,-2 -3,-3 -5,-3 -1,-1 -4,-1 -8,-1l-3 0 0 34 -17 0zm17 -47l12 0c8,0 13,-1 15,-1 2,-1 3,-2 4,-4 2,-1 2,-3 2,-6 0,-3 -1,-5 -2,-7 -2,-1 -4,-2 -6,-3 -2,0 -6,0 -12,0l-13 0 0 21zm66 47l0 -82 61 0 0 14 -45 0 0 18 41 0 0 14 -41 0 0 22 46 0 0 14 -62 0zm150 0l-18 0 -7 -19 -33 0 -7 19 -17 0 32 -82 17 0 33 82zm-30 -32l-12 -31 -11 31 23 0zm39 32l0 -82 25 0 14 56 15 -56 25 0 0 82 -15 0 0 -65 -17 65 -16 0 -16 -65 0 65 -15 0zm122 150l0 -17 17 0 0 17 -17 0zm89 -45l-16 3c-1,-3 -2,-5 -4,-7 -2,-2 -5,-3 -8,-3 -4,0 -7,2 -10,5 -2,3 -4,7 -4,14 0,8 2,13 4,16 3,3 6,5 10,5 4,0 6,-1 8,-3 2,-2 4,-5 4,-9l17 3c-2,7 -5,13 -10,17 -5,4 -11,5 -19,5 -10,0 -17,-2 -22,-8 -6,-6 -9,-14 -9,-25 0,-10 3,-18 9,-24 5,-6 12,-9 22,-9 8,0 14,2 18,5 5,4 8,9 10,15zm9 13c0,-6 1,-11 4,-17 3,-5 6,-9 11,-12 6,-2 11,-4 17,-4 10,0 18,3 24,10 6,6 9,14 9,23 0,10 -3,18 -9,24 -6,6 -14,9 -24,9 -5,0 -11,-1 -16,-3 -5,-3 -9,-7 -12,-12 -3,-5 -4,-11 -4,-18zm17 0c0,7 1,11 4,15 3,3 7,5 11,5 5,0 8,-2 11,-5 3,-4 5,-8 5,-15 0,-6 -2,-11 -5,-14 -3,-3 -6,-5 -11,-5 -4,0 -8,2 -11,5 -3,3 -4,8 -4,14zm60 -31l15 0 0 8c6,-6 12,-10 20,-10 4,0 7,1 10,3 3,1 6,4 8,7 2,-3 5,-6 9,-7 3,-2 6,-3 10,-3 5,0 8,1 12,3 3,2 5,5 7,8 1,3 2,7 2,14l0 40 -17 0 0 -36c0,-6 -1,-11 -2,-12 -1,-3 -4,-4 -7,-4 -2,0 -4,1 -7,2 -2,2 -3,4 -4,7 -1,2 -1,7 -1,13l0 30 -17 0 0 -35c0,-6 0,-10 -1,-12 -1,-1 -1,-3 -3,-4 -1,0 -3,-1 -5,-1 -2,0 -5,1 -7,2 -2,2 -3,4 -4,6 -1,3 -1,7 -1,13l0 31 -17 0 0 -63z"/>
     </clipPath>
      <clipPath id="id1">
      </clipPath>
      <clipPath id="id2">
       <path d="M465 12l30 0c7,0 12,0 16,1 5,2 9,4 12,8 4,4 6,8 8,13 2,6 3,12 3,20 0,7 -1,12 -3,17 -2,6 -5,11 -8,15 -3,3 -7,5 -12,6 -4,2 -9,2 -15,2l-31 0 0 -82zm17 14l0 54 12 0c5,0 8,0 10,-1 3,0 5,-1 7,-3 2,-2 3,-4 4,-8 1,-4 2,-9 2,-15 0,-6 -1,-11 -2,-15 -1,-3 -3,-6 -5,-8 -2,-1 -4,-3 -7,-3 -3,-1 -7,-1 -14,-1l-7 0zm66 68l0 -82 35 0c9,0 15,1 19,2 4,2 7,4 10,8 2,4 3,8 3,13 0,6 -2,11 -5,15 -4,4 -9,7 -16,8 3,2 6,4 8,7 3,2 6,7 10,13l10 16 -20 0 -12 -18c-4,-6 -7,-10 -9,-12 -1,-2 -3,-3 -5,-3 -1,-1 -4,-1 -8,-1l-3 0 0 34 -17 0zm17 -47l12 0c8,0 13,-1 15,-1 2,-1 3,-2 4,-4 2,-1 2,-3 2,-6 0,-3 -1,-5 -2,-7 -2,-1 -4,-2 -6,-3 -2,0 -6,0 -12,0l-13 0 0 21zm66 47l0 -82 61 0 0 14 -45 0 0 18 41 0 0 14 -41 0 0 22 46 0 0 14 -62 0zm150 0l-18 0 -7 -19 -33 0 -7 19 -17 0 32 -82 17 0 33 82zm-30 -32l-12 -31 -11 31 23 0zm39 32l0 -82 25 0 14 56 15 -56 25 0 0 82 -15 0 0 -65 -17 65 -16 0 -16 -65 0 65 -15 0zm122 150l0 -17 17 0 0 17 -17 0zm89 -45l-16 3c-1,-3 -2,-5 -4,-7 -2,-2 -5,-3 -8,-3 -4,0 -7,2 -10,5 -2,3 -4,7 -4,14 0,8 2,13 4,16 3,3 6,5 10,5 4,0 6,-1 8,-3 2,-2 4,-5 4,-9l17 3c-2,7 -5,13 -10,17 -5,4 -11,5 -19,5 -10,0 -17,-2 -22,-8 -6,-6 -9,-14 -9,-25 0,-10 3,-18 9,-24 5,-6 12,-9 22,-9 8,0 14,2 18,5 5,4 8,9 10,15zm9 13c0,-6 1,-11 4,-17 3,-5 6,-9 11,-12 6,-2 11,-4 17,-4 10,0 18,3 24,10 6,6 9,14 9,23 0,10 -3,18 -9,24 -6,6 -14,9 -24,9 -5,0 -11,-1 -16,-3 -5,-3 -9,-7 -12,-12 -3,-5 -4,-11 -4,-18zm17 0c0,7 1,11 4,15 3,3 7,5 11,5 5,0 8,-2 11,-5 3,-4 5,-8 5,-15 0,-6 -2,-11 -5,-14 -3,-3 -6,-5 -11,-5 -4,0 -8,2 -11,5 -3,3 -4,8 -4,14zm60 -31l15 0 0 8c6,-6 12,-10 20,-10 4,0 7,1 10,3 3,1 6,4 8,7 2,-3 5,-6 9,-7 3,-2 6,-3 10,-3 5,0 8,1 12,3 3,2 5,5 7,8 1,3 2,7 2,14l0 40 -17 0 0 -36c0,-6 -1,-11 -2,-12 -1,-3 -4,-4 -7,-4 -2,0 -4,1 -7,2 -2,2 -3,4 -4,7 -1,2 -1,7 -1,13l0 30 -17 0 0 -35c0,-6 0,-10 -1,-12 -1,-1 -1,-3 -3,-4 -1,0 -3,-1 -5,-1 -2,0 -5,1 -7,2 -2,2 -3,4 -4,6 -1,3 -1,7 -1,13l0 31 -17 0 0 -63z"/>
      </clipPath>
     <clipPath id="id3" style="clip-rule:nonzero">
      <path d="M942 62l17 5c-3,10 -7,17 -13,22 -6,4 -14,7 -23,7 -12,0 -21,-4 -29,-12 -7,-8 -11,-19 -11,-33 0,-14 4,-26 11,-34 8,-8 18,-12 30,-12 10,0 19,3 26,10 4,3 7,9 9,16l-18 4c-1,-5 -3,-8 -6,-11 -4,-2 -7,-4 -12,-4 -7,0 -12,3 -16,7 -4,5 -6,12 -6,23 0,11 2,19 6,23 4,5 9,7 15,7 5,0 9,-1 13,-4 3,-3 5,-8 7,-14zm32 32l0 -87 37 0c9,0 16,1 20,2 5,2 8,5 11,9 2,4 3,8 3,13 0,7 -2,12 -5,17 -4,4 -10,6 -18,8 4,2 7,4 10,7 2,3 6,7 10,14l10 17 -21 0 -12 -19c-5,-7 -8,-11 -10,-13 -1,-2 -3,-3 -5,-3 -2,-1 -5,-1 -9,-1l-3 0 0 36 -18 0zm18 -50l13 0c8,0 13,-1 16,-1 2,-1 3,-2 4,-4 2,-2 2,-4 2,-7 0,-3 -1,-5 -2,-7 -2,-2 -4,-3 -7,-3 -1,0 -5,0 -13,0l-13 0 0 22zm70 50l0 -87 65 0 0 15 -47 0 0 19 43 0 0 15 -43 0 0 23 48 0 0 15 -66 0zm81 -87l32 0c8,0 13,0 17,1 5,2 9,5 13,9 4,3 6,8 8,14 2,5 3,12 3,20 0,7 -1,14 -3,19 -2,6 -5,11 -9,15 -3,3 -7,6 -12,7 -4,1 -9,2 -16,2l-33 0 0 -87zm18 15l0 57 13 0c5,0 8,0 11,0 2,-1 5,-2 7,-4 2,-2 3,-5 4,-9 1,-3 2,-9 2,-16 0,-6 -1,-11 -2,-15 -1,-4 -3,-6 -5,-8 -2,-3 -5,-4 -8,-5 -2,0 -7,0 -14,0l-8 0zm70 72l0 -87 17 0 0 87 -17 0zm54 0l0 -72 -26 0 0 -15 69 0 0 15 -26 0 0 72 -17 0zm-820 150l0 -87 27 0 16 59 15 -59 26 0 0 87 -16 0 0 -69 -17 69 -17 0 -17 -69 0 69 -17 0zm181 0l-19 0 -8 -20 -35 0 -7 20 -19 0 34 -87 19 0 35 87zm-33 -35l-12 -32 -11 32 23 0zm42 35l0 -87 18 0 0 38 36 -38 23 0 -33 34 35 53 -23 0 -24 -41 -14 15 0 26 -18 0zm88 0l0 -87 65 0 0 14 -47 0 0 20 43 0 0 15 -43 0 0 23 48 0 0 15 -66 0zm81 0l0 -87 37 0c10,0 16,0 21,2 4,2 7,4 10,8 2,4 4,9 4,14 0,7 -2,12 -6,16 -4,5 -10,7 -17,8 3,3 7,5 9,8 3,2 6,7 10,14l11 17 -21 0 -13 -19c-4,-7 -8,-11 -9,-13 -2,-2 -4,-3 -6,-4 -1,0 -4,-1 -8,-1l-4 0 0 37 -18 0zm18 -50l13 0c8,0 14,-1 16,-2 2,0 4,-1 5,-3 1,-2 1,-4 1,-7 0,-3 0,-5 -2,-7 -1,-2 -4,-3 -6,-3 -2,-1 -6,-1 -13,-1l-14 0 0 23z"/>
     </clipPath>
      <clipPath id="id4">
      </clipPath>
      <clipPath id="id5">
       <path d="M942 62l17 5c-3,10 -7,17 -13,22 -6,4 -14,7 -23,7 -12,0 -21,-4 -29,-12 -7,-8 -11,-19 -11,-33 0,-14 4,-26 11,-34 8,-8 18,-12 30,-12 10,0 19,3 26,10 4,3 7,9 9,16l-18 4c-1,-5 -3,-8 -6,-11 -4,-2 -7,-4 -12,-4 -7,0 -12,3 -16,7 -4,5 -6,12 -6,23 0,11 2,19 6,23 4,5 9,7 15,7 5,0 9,-1 13,-4 3,-3 5,-8 7,-14zm32 32l0 -87 37 0c9,0 16,1 20,2 5,2 8,5 11,9 2,4 3,8 3,13 0,7 -2,12 -5,17 -4,4 -10,6 -18,8 4,2 7,4 10,7 2,3 6,7 10,14l10 17 -21 0 -12 -19c-5,-7 -8,-11 -10,-13 -1,-2 -3,-3 -5,-3 -2,-1 -5,-1 -9,-1l-3 0 0 36 -18 0zm18 -50l13 0c8,0 13,-1 16,-1 2,-1 3,-2 4,-4 2,-2 2,-4 2,-7 0,-3 -1,-5 -2,-7 -2,-2 -4,-3 -7,-3 -1,0 -5,0 -13,0l-13 0 0 22zm70 50l0 -87 65 0 0 15 -47 0 0 19 43 0 0 15 -43 0 0 23 48 0 0 15 -66 0zm81 -87l32 0c8,0 13,0 17,1 5,2 9,5 13,9 4,3 6,8 8,14 2,5 3,12 3,20 0,7 -1,14 -3,19 -2,6 -5,11 -9,15 -3,3 -7,6 -12,7 -4,1 -9,2 -16,2l-33 0 0 -87zm18 15l0 57 13 0c5,0 8,0 11,0 2,-1 5,-2 7,-4 2,-2 3,-5 4,-9 1,-3 2,-9 2,-16 0,-6 -1,-11 -2,-15 -1,-4 -3,-6 -5,-8 -2,-3 -5,-4 -8,-5 -2,0 -7,0 -14,0l-8 0zm70 72l0 -87 17 0 0 87 -17 0zm54 0l0 -72 -26 0 0 -15 69 0 0 15 -26 0 0 72 -17 0zm-820 150l0 -87 27 0 16 59 15 -59 26 0 0 87 -16 0 0 -69 -17 69 -17 0 -17 -69 0 69 -17 0zm181 0l-19 0 -8 -20 -35 0 -7 20 -19 0 34 -87 19 0 35 87zm-33 -35l-12 -32 -11 32 23 0zm42 35l0 -87 18 0 0 38 36 -38 23 0 -33 34 35 53 -23 0 -24 -41 -14 15 0 26 -18 0zm88 0l0 -87 65 0 0 14 -47 0 0 20 43 0 0 15 -43 0 0 23 48 0 0 15 -66 0zm81 0l0 -87 37 0c10,0 16,0 21,2 4,2 7,4 10,8 2,4 4,9 4,14 0,7 -2,12 -6,16 -4,5 -10,7 -17,8 3,3 7,5 9,8 3,2 6,7 10,14l11 17 -21 0 -13 -19c-4,-7 -8,-11 -9,-13 -2,-2 -4,-3 -6,-4 -1,0 -4,-1 -8,-1l-4 0 0 37 -18 0zm18 -50l13 0c8,0 14,-1 16,-2 2,0 4,-1 5,-3 1,-2 1,-4 1,-7 0,-3 0,-5 -2,-7 -1,-2 -4,-3 -6,-3 -2,-1 -6,-1 -13,-1l-14 0 0 23z"/>
      </clipPath>
     <clipPath id="id6">
      <path d="M388 226l0 -200c0,-14 -11,-26 -25,-26l-337 0c-14,0 -25,12 -25,26l0 200c0,15 11,27 25,27l337 0c14,0 25,-12 25,-27z"/>
     </clipPath>
      <clipPath id="id7">
      </clipPath>
      <clipPath id="id8">
       <path d="M388 226l0 -200c0,-14 -11,-26 -25,-26l-337 0c-14,0 -25,12 -25,26l0 200c0,15 11,27 25,27l337 0c14,0 25,-12 25,-27z"/>
      </clipPath>
     <clipPath id="id9">
      <path d="M1 227c0,14 12,26 25,26l145 0 32 -32c-3,3 -8,4 -12,4l-12 0 -29 0 -78 0c-13,0 -26,-5 -35,-15 -17,-19 -25,-7 -32,-7l-2 0c-1,0 -2,0 -2,0l0 24z"/>
     </clipPath>
      <clipPath id="id10">
      </clipPath>
      <clipPath id="id11">
       <path d="M1 227c0,14 12,26 25,26l145 0 32 -32c-3,3 -8,4 -12,4l-12 0 -29 0 -78 0c-13,0 -26,-5 -35,-15 -17,-19 -25,-7 -32,-7l-2 0c-1,0 -2,0 -2,0l0 24z"/>
      </clipPath>
     <clipPath id="id12">
      <path d="M0 81l0 128c4,-4 10,-6 17,-6l2 0c6,0 13,3 18,7 9,10 22,15 35,15l78 0 29 0 12 0c11,0 19,-9 19,-19 0,-10 -7,-18 -16,-19 9,-2 16,-10 16,-19 0,-10 -7,-18 -16,-20 9,-1 16,-11 16,-21 0,-9 -6,-17 -15,-19l80 0c11,0 20,-9 20,-19 0,-11 -9,-20 -20,-20l-96 0 -17 0 -6 0c7,-2 12,-9 12,-17 0,-10 -8,-19 -19,-19l-57 0c-7,0 -13,3 -18,7l-37 37c-5,5 -12,7 -19,7l-5 0c-5,0 -9,-1 -13,-3z"/>
     </clipPath>
      <clipPath id="id13">
      </clipPath>
      <clipPath id="id14">
       <path d="M0 81l0 128c4,-4 10,-6 17,-6l2 0c6,0 13,3 18,7 9,10 22,15 35,15l78 0 29 0 12 0c11,0 19,-9 19,-19 0,-10 -7,-18 -16,-19 9,-2 16,-10 16,-19 0,-10 -7,-18 -16,-20 9,-1 16,-11 16,-21 0,-9 -6,-17 -15,-19l80 0c11,0 20,-9 20,-19 0,-11 -9,-20 -20,-20l-96 0 -17 0 -6 0c7,-2 12,-9 12,-17 0,-10 -8,-19 -19,-19l-57 0c-7,0 -13,3 -18,7l-37 37c-5,5 -12,7 -19,7l-5 0c-5,0 -9,-1 -13,-3z"/>
      </clipPath>
     <clipPath id="id15" style="clip-rule:nonzero">
      <path d="M287 104c-3,2 -7,4 -12,4l-80 0c9,2 15,10 15,19 0,10 -7,20 -16,21 9,2 16,10 16,20 0,9 -7,17 -16,19 3,0 5,1 8,3l85 -86z"/>
     </clipPath>
      <clipPath id="id16">
      </clipPath>
      <clipPath id="id17">
       <path d="M287 104c-3,2 -7,4 -12,4l-80 0c9,2 15,10 15,19 0,10 -7,20 -16,21 9,2 16,10 16,20 0,9 -7,17 -16,19 3,0 5,1 8,3l85 -86z"/>
      </clipPath>
 </defs>
 <g id="РЎР_x00bb_РѕР_x2116__x0020_1">
  <metadata id="CorelCorpID_0Corel-Layer"/>
  <g id="_2461150607920">
   <g>
    <path class="fil0" d="M465 12l30 0c7,0 12,0 16,1 5,2 9,4 12,8 4,4 6,8 8,13 2,6 3,12 3,20 0,7 -1,12 -3,17 -2,6 -5,11 -8,15 -3,3 -7,5 -12,6 -4,2 -9,2 -15,2l-31 0 0 -82zm17 14l0 54 12 0c5,0 8,0 10,-1 3,0 5,-1 7,-3 2,-2 3,-4 4,-8 1,-4 2,-9 2,-15 0,-6 -1,-11 -2,-15 -1,-3 -3,-6 -5,-8 -2,-1 -4,-3 -7,-3 -3,-1 -7,-1 -14,-1l-7 0zm66 68l0 -82 35 0c9,0 15,1 19,2 4,2 7,4 10,8 2,4 3,8 3,13 0,6 -2,11 -5,15 -4,4 -9,7 -16,8 3,2 6,4 8,7 3,2 6,7 10,13l10 16 -20 0 -12 -18c-4,-6 -7,-10 -9,-12 -1,-2 -3,-3 -5,-3 -1,-1 -4,-1 -8,-1l-3 0 0 34 -17 0zm17 -47l12 0c8,0 13,-1 15,-1 2,-1 3,-2 4,-4 2,-1 2,-3 2,-6 0,-3 -1,-5 -2,-7 -2,-1 -4,-2 -6,-3 -2,0 -6,0 -12,0l-13 0 0 21zm66 47l0 -82 61 0 0 14 -45 0 0 18 41 0 0 14 -41 0 0 22 46 0 0 14 -62 0zm150 0l-18 0 -7 -19 -33 0 -7 19 -17 0 32 -82 17 0 33 82zm-30 -32l-12 -31 -11 31 23 0zm39 32l0 -82 25 0 14 56 15 -56 25 0 0 82 -15 0 0 -65 -17 65 -16 0 -16 -65 0 65 -15 0zm122 150l0 -17 17 0 0 17 -17 0zm89 -45l-16 3c-1,-3 -2,-5 -4,-7 -2,-2 -5,-3 -8,-3 -4,0 -7,2 -10,5 -2,3 -4,7 -4,14 0,8 2,13 4,16 3,3 6,5 10,5 4,0 6,-1 8,-3 2,-2 4,-5 4,-9l17 3c-2,7 -5,13 -10,17 -5,4 -11,5 -19,5 -10,0 -17,-2 -22,-8 -6,-6 -9,-14 -9,-25 0,-10 3,-18 9,-24 5,-6 12,-9 22,-9 8,0 14,2 18,5 5,4 8,9 10,15zm9 13c0,-6 1,-11 4,-17 3,-5 6,-9 11,-12 6,-2 11,-4 17,-4 10,0 18,3 24,10 6,6 9,14 9,23 0,10 -3,18 -9,24 -6,6 -14,9 -24,9 -5,0 -11,-1 -16,-3 -5,-3 -9,-7 -12,-12 -3,-5 -4,-11 -4,-18zm17 0c0,7 1,11 4,15 3,3 7,5 11,5 5,0 8,-2 11,-5 3,-4 5,-8 5,-15 0,-6 -2,-11 -5,-14 -3,-3 -6,-5 -11,-5 -4,0 -8,2 -11,5 -3,3 -4,8 -4,14zm60 -31l15 0 0 8c6,-6 12,-10 20,-10 4,0 7,1 10,3 3,1 6,4 8,7 2,-3 5,-6 9,-7 3,-2 6,-3 10,-3 5,0 8,1 12,3 3,2 5,5 7,8 1,3 2,7 2,14l0 40 -17 0 0 -36c0,-6 -1,-11 -2,-12 -1,-3 -4,-4 -7,-4 -2,0 -4,1 -7,2 -2,2 -3,4 -4,7 -1,2 -1,7 -1,13l0 30 -17 0 0 -35c0,-6 0,-10 -1,-12 -1,-1 -1,-3 -3,-4 -1,0 -3,-1 -5,-1 -2,0 -5,1 -7,2 -2,2 -3,4 -4,6 -1,3 -1,7 -1,13l0 31 -17 0 0 -63z"/>
    <g style="clip-path:url(#id0)">
     <g>
     </g>
     <g style="clip-path:url(#id1)">
      <image id="shutterstock_278822606.jpg" x="10698" y="-876" width="5433" height="3546" xlink:href="logo_Images\logo_ImgID1.png"/>
     </g>
     <g style="clip-path:url(#id2)">
     </g>
    </g>
    <path class="fil1" d="M465 12l30 0c7,0 12,0 16,1 5,2 9,4 12,8 4,4 6,8 8,13 2,6 3,12 3,20 0,7 -1,12 -3,17 -2,6 -5,11 -8,15 -3,3 -7,5 -12,6 -4,2 -9,2 -15,2l-31 0 0 -82zm17 14l0 54 12 0c5,0 8,0 10,-1 3,0 5,-1 7,-3 2,-2 3,-4 4,-8 1,-4 2,-9 2,-15 0,-6 -1,-11 -2,-15 -1,-3 -3,-6 -5,-8 -2,-1 -4,-3 -7,-3 -3,-1 -7,-1 -14,-1l-7 0zm66 68l0 -82 35 0c9,0 15,1 19,2 4,2 7,4 10,8 2,4 3,8 3,13 0,6 -2,11 -5,15 -4,4 -9,7 -16,8 3,2 6,4 8,7 3,2 6,7 10,13l10 16 -20 0 -12 -18c-4,-6 -7,-10 -9,-12 -1,-2 -3,-3 -5,-3 -1,-1 -4,-1 -8,-1l-3 0 0 34 -17 0zm17 -47l12 0c8,0 13,-1 15,-1 2,-1 3,-2 4,-4 2,-1 2,-3 2,-6 0,-3 -1,-5 -2,-7 -2,-1 -4,-2 -6,-3 -2,0 -6,0 -12,0l-13 0 0 21zm66 47l0 -82 61 0 0 14 -45 0 0 18 41 0 0 14 -41 0 0 22 46 0 0 14 -62 0zm150 0l-18 0 -7 -19 -33 0 -7 19 -17 0 32 -82 17 0 33 82zm-30 -32l-12 -31 -11 31 23 0zm39 32l0 -82 25 0 14 56 15 -56 25 0 0 82 -15 0 0 -65 -17 65 -16 0 -16 -65 0 65 -15 0zm122 150l0 -17 17 0 0 17 -17 0zm89 -45l-16 3c-1,-3 -2,-5 -4,-7 -2,-2 -5,-3 -8,-3 -4,0 -7,2 -10,5 -2,3 -4,7 -4,14 0,8 2,13 4,16 3,3 6,5 10,5 4,0 6,-1 8,-3 2,-2 4,-5 4,-9l17 3c-2,7 -5,13 -10,17 -5,4 -11,5 -19,5 -10,0 -17,-2 -22,-8 -6,-6 -9,-14 -9,-25 0,-10 3,-18 9,-24 5,-6 12,-9 22,-9 8,0 14,2 18,5 5,4 8,9 10,15zm9 13c0,-6 1,-11 4,-17 3,-5 6,-9 11,-12 6,-2 11,-4 17,-4 10,0 18,3 24,10 6,6 9,14 9,23 0,10 -3,18 -9,24 -6,6 -14,9 -24,9 -5,0 -11,-1 -16,-3 -5,-3 -9,-7 -12,-12 -3,-5 -4,-11 -4,-18zm17 0c0,7 1,11 4,15 3,3 7,5 11,5 5,0 8,-2 11,-5 3,-4 5,-8 5,-15 0,-6 -2,-11 -5,-14 -3,-3 -6,-5 -11,-5 -4,0 -8,2 -11,5 -3,3 -4,8 -4,14zm60 -31l15 0 0 8c6,-6 12,-10 20,-10 4,0 7,1 10,3 3,1 6,4 8,7 2,-3 5,-6 9,-7 3,-2 6,-3 10,-3 5,0 8,1 12,3 3,2 5,5 7,8 1,3 2,7 2,14l0 40 -17 0 0 -36c0,-6 -1,-11 -2,-12 -1,-3 -4,-4 -7,-4 -2,0 -4,1 -7,2 -2,2 -3,4 -4,7 -1,2 -1,7 -1,13l0 30 -17 0 0 -35c0,-6 0,-10 -1,-12 -1,-1 -1,-3 -3,-4 -1,0 -3,-1 -5,-1 -2,0 -5,1 -7,2 -2,2 -3,4 -4,6 -1,3 -1,7 -1,13l0 31 -17 0 0 -63z"/>
    <path class="fil2" d="M942 62l17 5c-3,10 -7,17 -13,22 -6,4 -14,7 -23,7 -12,0 -21,-4 -29,-12 -7,-8 -11,-19 -11,-33 0,-14 4,-26 11,-34 8,-8 18,-12 30,-12 10,0 19,3 26,10 4,3 7,9 9,16l-18 4c-1,-5 -3,-8 -6,-11 -4,-2 -7,-4 -12,-4 -7,0 -12,3 -16,7 -4,5 -6,12 -6,23 0,11 2,19 6,23 4,5 9,7 15,7 5,0 9,-1 13,-4 3,-3 5,-8 7,-14zm32 32l0 -87 37 0c9,0 16,1 20,2 5,2 8,5 11,9 2,4 3,8 3,13 0,7 -2,12 -5,17 -4,4 -10,6 -18,8 4,2 7,4 10,7 2,3 6,7 10,14l10 17 -21 0 -12 -19c-5,-7 -8,-11 -10,-13 -1,-2 -3,-3 -5,-3 -2,-1 -5,-1 -9,-1l-3 0 0 36 -18 0zm18 -50l13 0c8,0 13,-1 16,-1 2,-1 3,-2 4,-4 2,-2 2,-4 2,-7 0,-3 -1,-5 -2,-7 -2,-2 -4,-3 -7,-3 -1,0 -5,0 -13,0l-13 0 0 22zm70 50l0 -87 65 0 0 15 -47 0 0 19 43 0 0 15 -43 0 0 23 48 0 0 15 -66 0zm81 -87l32 0c8,0 13,0 17,1 5,2 9,5 13,9 4,3 6,8 8,14 2,5 3,12 3,20 0,7 -1,14 -3,19 -2,6 -5,11 -9,15 -3,3 -7,6 -12,7 -4,1 -9,2 -16,2l-33 0 0 -87zm18 15l0 57 13 0c5,0 8,0 11,0 2,-1 5,-2 7,-4 2,-2 3,-5 4,-9 1,-3 2,-9 2,-16 0,-6 -1,-11 -2,-15 -1,-4 -3,-6 -5,-8 -2,-3 -5,-4 -8,-5 -2,0 -7,0 -14,0l-8 0zm70 72l0 -87 17 0 0 87 -17 0zm54 0l0 -72 -26 0 0 -15 69 0 0 15 -26 0 0 72 -17 0zm-820 150l0 -87 27 0 16 59 15 -59 26 0 0 87 -16 0 0 -69 -17 69 -17 0 -17 -69 0 69 -17 0zm181 0l-19 0 -8 -20 -35 0 -7 20 -19 0 34 -87 19 0 35 87zm-33 -35l-12 -32 -11 32 23 0zm42 35l0 -87 18 0 0 38 36 -38 23 0 -33 34 35 53 -23 0 -24 -41 -14 15 0 26 -18 0zm88 0l0 -87 65 0 0 14 -47 0 0 20 43 0 0 15 -43 0 0 23 48 0 0 15 -66 0zm81 0l0 -87 37 0c10,0 16,0 21,2 4,2 7,4 10,8 2,4 4,9 4,14 0,7 -2,12 -6,16 -4,5 -10,7 -17,8 3,3 7,5 9,8 3,2 6,7 10,14l11 17 -21 0 -13 -19c-4,-7 -8,-11 -9,-13 -2,-2 -4,-3 -6,-4 -1,0 -4,-1 -8,-1l-4 0 0 37 -18 0zm18 -50l13 0c8,0 14,-1 16,-2 2,0 4,-1 5,-3 1,-2 1,-4 1,-7 0,-3 0,-5 -2,-7 -1,-2 -4,-3 -6,-3 -2,-1 -6,-1 -13,-1l-14 0 0 23z"/>
    <g style="clip-path:url(#id3)">
     <g>
     </g>
     <g style="clip-path:url(#id4)">
      <image id="shutterstock_278822606.jpg_0" x="10698" y="-876" width="5433" height="3546" xlink:href="logo_Images\logo_ImgID2.png"/>
     </g>
     <g style="clip-path:url(#id5)">
     </g>
    </g>
    <path class="fil1" d="M942 62l17 5c-3,10 -7,17 -13,22 -6,4 -14,7 -23,7 -12,0 -21,-4 -29,-12 -7,-8 -11,-19 -11,-33 0,-14 4,-26 11,-34 8,-8 18,-12 30,-12 10,0 19,3 26,10 4,3 7,9 9,16l-18 4c-1,-5 -3,-8 -6,-11 -4,-2 -7,-4 -12,-4 -7,0 -12,3 -16,7 -4,5 -6,12 -6,23 0,11 2,19 6,23 4,5 9,7 15,7 5,0 9,-1 13,-4 3,-3 5,-8 7,-14zm32 32l0 -87 37 0c9,0 16,1 20,2 5,2 8,5 11,9 2,4 3,8 3,13 0,7 -2,12 -5,17 -4,4 -10,6 -18,8 4,2 7,4 10,7 2,3 6,7 10,14l10 17 -21 0 -12 -19c-5,-7 -8,-11 -10,-13 -1,-2 -3,-3 -5,-3 -2,-1 -5,-1 -9,-1l-3 0 0 36 -18 0zm18 -50l13 0c8,0 13,-1 16,-1 2,-1 3,-2 4,-4 2,-2 2,-4 2,-7 0,-3 -1,-5 -2,-7 -2,-2 -4,-3 -7,-3 -1,0 -5,0 -13,0l-13 0 0 22zm70 50l0 -87 65 0 0 15 -47 0 0 19 43 0 0 15 -43 0 0 23 48 0 0 15 -66 0zm81 -87l32 0c8,0 13,0 17,1 5,2 9,5 13,9 4,3 6,8 8,14 2,5 3,12 3,20 0,7 -1,14 -3,19 -2,6 -5,11 -9,15 -3,3 -7,6 -12,7 -4,1 -9,2 -16,2l-33 0 0 -87zm18 15l0 57 13 0c5,0 8,0 11,0 2,-1 5,-2 7,-4 2,-2 3,-5 4,-9 1,-3 2,-9 2,-16 0,-6 -1,-11 -2,-15 -1,-4 -3,-6 -5,-8 -2,-3 -5,-4 -8,-5 -2,0 -7,0 -14,0l-8 0zm70 72l0 -87 17 0 0 87 -17 0zm54 0l0 -72 -26 0 0 -15 69 0 0 15 -26 0 0 72 -17 0zm-820 150l0 -87 27 0 16 59 15 -59 26 0 0 87 -16 0 0 -69 -17 69 -17 0 -17 -69 0 69 -17 0zm181 0l-19 0 -8 -20 -35 0 -7 20 -19 0 34 -87 19 0 35 87zm-33 -35l-12 -32 -11 32 23 0zm42 35l0 -87 18 0 0 38 36 -38 23 0 -33 34 35 53 -23 0 -24 -41 -14 15 0 26 -18 0zm88 0l0 -87 65 0 0 14 -47 0 0 20 43 0 0 15 -43 0 0 23 48 0 0 15 -66 0zm81 0l0 -87 37 0c10,0 16,0 21,2 4,2 7,4 10,8 2,4 4,9 4,14 0,7 -2,12 -6,16 -4,5 -10,7 -17,8 3,3 7,5 9,8 3,2 6,7 10,14l11 17 -21 0 -13 -19c-4,-7 -8,-11 -9,-13 -2,-2 -4,-3 -6,-4 -1,0 -4,-1 -8,-1l-4 0 0 37 -18 0zm18 -50l13 0c8,0 14,-1 16,-2 2,0 4,-1 5,-3 1,-2 1,-4 1,-7 0,-3 0,-5 -2,-7 -1,-2 -4,-3 -6,-3 -2,-1 -6,-1 -13,-1l-14 0 0 23z"/>
   </g>
   <g>
    <path class="fil3" d="M388 226l0 -200c0,-14 -11,-26 -25,-26l-337 0c-14,0 -25,12 -25,26l0 200c0,15 11,27 25,27l337 0c14,0 25,-12 25,-27z"/>
    <g style="clip-path:url(#id6)">
     <g>
     </g>
     <g style="clip-path:url(#id7)">
      <image id="shutterstock_278822606.jpg_1" x="10692" y="-858" width="5433" height="3546" xlink:href="logo_Images\logo_ImgID3.png"/>
     </g>
     <g style="clip-path:url(#id8)">
     </g>
    </g>
    <path class="fil4" d="M388 226l0 -200c0,-14 -11,-26 -25,-26l-337 0c-14,0 -25,12 -25,26l0 200c0,15 11,27 25,27l337 0c14,0 25,-12 25,-27z"/>
    <path class="fil5" d="M1 227c0,14 12,26 25,26l145 0 32 -32c-3,3 -8,4 -12,4l-12 0 -29 0 -78 0c-13,0 -26,-5 -35,-15 -17,-19 -25,-7 -32,-7l-2 0c-1,0 -2,0 -2,0l0 24z"/>
    <g style="clip-path:url(#id9)">
     <g>
     </g>
     <g style="clip-path:url(#id10)">
      <image id="shutterstock_278822606.jpg_2" x="10692" y="-858" width="5433" height="3546" xlink:href="logo_Images\logo_ImgID4.png"/>
     </g>
     <g style="clip-path:url(#id11)">
     </g>
    </g>
    <path class="fil4" d="M1 227c0,14 12,26 25,26l145 0 32 -32c-3,3 -8,4 -12,4l-12 0 -29 0 -78 0c-13,0 -26,-5 -35,-15 -17,-19 -25,-7 -32,-7l-2 0c-1,0 -2,0 -2,0l0 24z"/>
    <path class="fil6" d="M0 81l0 128c4,-4 10,-6 17,-6l2 0c6,0 13,3 18,7 9,10 22,15 35,15l78 0 29 0 12 0c11,0 19,-9 19,-19 0,-10 -7,-18 -16,-19 9,-2 16,-10 16,-19 0,-10 -7,-18 -16,-20 9,-1 16,-11 16,-21 0,-9 -6,-17 -15,-19l80 0c11,0 20,-9 20,-19 0,-11 -9,-20 -20,-20l-96 0 -17 0 -6 0c7,-2 12,-9 12,-17 0,-10 -8,-19 -19,-19l-57 0c-7,0 -13,3 -18,7l-37 37c-5,5 -12,7 -19,7l-5 0c-5,0 -9,-1 -13,-3z"/>
    <g style="clip-path:url(#id12)">
     <g>
     </g>
     <g style="clip-path:url(#id13)">
      <image id="shutterstock_278822606.jpg_3" x="10692" y="-858" width="5433" height="3546" xlink:href="logo_Images\logo_ImgID5.png"/>
     </g>
     <g style="clip-path:url(#id14)">
     </g>
    </g>
    <path class="fil4" d="M0 81l0 128c4,-4 10,-6 17,-6l2 0c6,0 13,3 18,7 9,10 22,15 35,15l78 0 29 0 12 0c11,0 19,-9 19,-19 0,-10 -7,-18 -16,-19 9,-2 16,-10 16,-19 0,-10 -7,-18 -16,-20 9,-1 16,-11 16,-21 0,-9 -6,-17 -15,-19l80 0c11,0 20,-9 20,-19 0,-11 -9,-20 -20,-20l-96 0 -17 0 -6 0c7,-2 12,-9 12,-17 0,-10 -8,-19 -19,-19l-57 0c-7,0 -13,3 -18,7l-37 37c-5,5 -12,7 -19,7l-5 0c-5,0 -9,-1 -13,-3z"/>
    <path class="fil2" d="M287 104c-3,2 -7,4 -12,4l-80 0c9,2 15,10 15,19 0,10 -7,20 -16,21 9,2 16,10 16,20 0,9 -7,17 -16,19 3,0 5,1 8,3l85 -86z"/>
    <g style="clip-path:url(#id15)">
     <g>
     </g>
     <g style="clip-path:url(#id16)">
      <image id="shutterstock_278822606.jpg_4" x="10692" y="-858" width="5433" height="3546" xlink:href="logo_Images\logo_ImgID6.png"/>
     </g>
     <g style="clip-path:url(#id17)">
     </g>
    </g>
    <path class="fil1" d="M287 104c-3,2 -7,4 -12,4l-80 0c9,2 15,10 15,19 0,10 -7,20 -16,21 9,2 16,10 16,20 0,9 -7,17 -16,19 3,0 5,1 8,3l85 -86z"/>
   </g>
  </g>
 </g>
</svg>
