<?xml version="1.0" encoding="UTF-8"?>
<!DOCTYPE svg PUBLIC "-//W3C//DTD SVG 1.1//EN" "http://www.w3.org/Graphics/SVG/1.1/DTD/svg11.dtd">
<!-- Creator: CorelDRAW X8 -->
<svg xmlns="http://www.w3.org/2000/svg" xml:space="preserve" width="25.1409mm" height="25.1411mm" version="1.1" style="shape-rendering:geometricPrecision; text-rendering:geometricPrecision; image-rendering:optimizeQuality; fill-rule:evenodd; clip-rule:evenodd"
viewBox="0 0 86 86"
 xmlns:xlink="http://www.w3.org/1999/xlink">
 <defs>
  <style type="text/css">
   <![CDATA[
    .str0 {stroke:#ABABAB;stroke-width:0.289716}
    .str1 {stroke:#E6E6E6;stroke-width:0.289716}
    .fil1 {fill:none}
    .fil3 {fill:#D9D9D9}
    .fil0 {fill:#E6E6E6}
    .fil2 {fill:white}
   ]]>
  </style>
     <clipPath id="id0">
      <path d="M43 0c24,0 43,19 43,43 0,24 -19,43 -43,43 -24,0 -43,-19 -43,-43 0,-24 19,-43 43,-43z"/>
     </clipPath>
      <clipPath id="id1">
      </clipPath>
      <clipPath id="id2">
       <path d="M43 0c24,0 43,19 43,43 0,24 -19,43 -43,43 -24,0 -43,-19 -43,-43 0,-24 19,-43 43,-43z"/>
      </clipPath>
    <clipPath id="id3">
     <rect x="13" y="28" width="58.1954" height="27.2272"/>
    </clipPath>
     <clipPath id="id4">
      <rect x="13" y="28" width="58.1956" height="27.2272"/>
     </clipPath>
 </defs>
 <g id="Слой_x0020_1">
  <metadata id="CorelCorpID_0Corel-Layer"/>
  <g id="_1950135435088">
   <g>
    <path class="fil0" d="M43 0c24,0 43,19 43,43 0,24 -19,43 -43,43 -24,0 -43,-19 -43,-43 0,-24 19,-43 43,-43z"/>
    <g style="clip-path:url(#id0)">
     <g>
     </g>
     <g style="clip-path:url(#id1)">
      <image x="-1538" y="-363" width="2421" height="757" xlink:href="item-3_Images\item-3_ImgID1.png"/>
     </g>
     <g style="clip-path:url(#id2)">
     </g>
    </g>
    <path class="fil1 str0" d="M43 0c24,0 43,19 43,43 0,24 -19,43 -43,43 -24,0 -43,-19 -43,-43 0,-24 19,-43 43,-43z"/>
    <circle class="fil2 str1" cx="43" cy="43" r="38"/>
    <path class="fil3" d="M43 0c23,0 43,19 43,43 0,0 0,1 0,1 -1,-23 -20,-42 -43,-42 -23,0 -42,19 -43,42 0,0 0,-1 0,-1 0,-24 20,-43 43,-43z"/>
   </g>
   <g style="clip-path:url(#id3)">
    <image style="clip-path:url(#id4)" x="-301" y="-307" width="481" height="1059" xlink:href="item-3_Images\item-3_ImgID2.png"/>
   </g>
  </g>
 </g>
</svg>
