{
    "reference": {
        "blob": {
            "url": "s3://deeploy-examples/bank_llm/model"
        },
        "docker": {
            "image": "deeployml/ollama_server:0.1.0",
            "port": 8080
        }
    }
}