{
    "reference": {
        "docker": {
            "image": "deeployml/agenetcaptumexplainer:0.9.14",
            "uri": "/v1/models/custom_explainer:explain",
            "port": 8080
        }
    }
}