{
    "features": [
      {
        "name": "sepal_length_(cm)",
        "observedMin": 4.3,
        "observedMax": 7.9
      },
      {
        "name": "sepal_width_(cm)",
        "observedMin": 2,
        "observedMax": 4.4
      },
      {
        "name": "petal_length_(cm)",
        "observedMin": 1,
        "observedMax": 6.9
      },
      {
        "name": "petal_width_(cm)",
        "observedMin": 0.1,
        "observedMax": 2.5
      }
    ],
    "predictionClasses": {
        "Iris Setosa": 0,
        "Iris Versicolour": 1,
        "Iris Virginica": 2
    },
    "problemType": "classification",
    "exampleInput": {
      "instances": [
        [
          5.1, 3.5, 1.4, 0.2
        ]
      ]
    },
    "inputTensorShape": [ 
      1, 
      4
    ],
    "exampleOutput": {
      "predictions":     [
        0.9069402020341337,
        0.010098257999991176,
        0.08296153996587496
      ]
    },
    "outputTensorShape": [ 
      1
    ],
    "customId": "clientId"
  }