<?xml version="1.0" encoding="utf-8"?><!-- Uploaded to: SVG Repo, www.svgrepo.com, Generator: SVG Repo Mixer Tools -->
<svg width="800px" height="800px" viewBox="0 0 24 24" fill="none" xmlns="http://www.w3.org/2000/svg">
<path fillRule="evenodd" clipRule="evenodd" d="M13.1739 3.5968C13.8662 3.2047 14.686 3.10369 15.4528 3.31598C15.7928 3.41011 16.0833 3.57409 16.3571 3.7593C16.6172 3.9352 16.9155 4.16808 17.2613 4.43799L17.3117 4.47737C17.6575 4.74728 17.9559 4.98016 18.1897 5.18977C18.4358 5.41046 18.6654 5.65248 18.8393 5.95945C19.2314 6.65177 19.3324 7.47151 19.1201 8.23831C19.026 8.5783 18.862 8.86883 18.6768 9.14267C18.5009 9.40276 18.268 9.70112 17.998 10.0469L10.8953 19.1462C10.8773 19.1692 10.8596 19.1919 10.8421 19.2144C10.5087 19.6419 10.2566 19.9651 9.9445 20.2306C9.68036 20.4553 9.38811 20.6447 9.07512 20.794C8.70535 20.9704 8.30733 21.0685 7.78084 21.1983C7.75324 21.2051 7.72528 21.212 7.69696 21.219L5.57214 21.7435C5.42499 21.7799 5.25702 21.8215 5.10885 21.8442C4.94367 21.8696 4.68789 21.8926 4.40539 21.8022C4.06579 21.6934 3.77603 21.4672 3.58809 21.1642C3.43175 20.9121 3.39197 20.6584 3.3765 20.492C3.36262 20.3427 3.36213 20.1697 3.3617 20.0181C3.36167 20.0087 3.36165 19.9994 3.36162 19.9902L3.35475 17.8295C3.35465 17.8003 3.35455 17.7715 3.35445 17.7431C3.3525 17.2009 3.35103 16.7909 3.4324 16.3894C3.50128 16.0495 3.61406 15.72 3.76791 15.4093C3.94967 15.0421 4.20204 14.7191 4.53586 14.2918C4.55336 14.2694 4.57109 14.2467 4.58905 14.2237L11.6918 5.12435C11.9617 4.77856 12.1946 4.48019 12.4042 4.2464C12.6249 4.00025 12.8669 3.77065 13.1739 3.5968ZM14.9191 5.24347C14.6635 5.17271 14.3903 5.20638 14.1595 5.33708C14.1203 5.35928 14.0459 5.41135 13.8934 5.5815C13.7348 5.75836 13.5438 6.00211 13.2487 6.38018L16.4018 8.84145C16.697 8.46338 16.887 8.21896 17.0201 8.02221C17.1482 7.83291 17.1806 7.74808 17.1926 7.70467C17.2634 7.44907 17.2297 7.17583 17.099 6.94505C17.0768 6.90586 17.0247 6.83145 16.8546 6.6789C16.6777 6.52033 16.434 6.32938 16.0559 6.03426C15.6778 5.73914 15.4334 5.54904 15.2367 5.41597C15.0474 5.28794 14.9625 5.25549 14.9191 5.24347ZM15.1712 10.418L12.0181 7.95674L6.16561 15.4543C5.75585 15.9792 5.6403 16.135 5.56031 16.2966C5.48339 16.452 5.42699 16.6167 5.39256 16.7866C5.35675 16.9633 5.35262 17.1572 5.35474 17.8231L5.36082 19.7357L7.2176 19.2773C7.86411 19.1177 8.05119 19.0666 8.21391 18.9889C8.37041 18.9143 8.51653 18.8196 8.64861 18.7072C8.78593 18.5904 8.90897 18.4405 9.31872 17.9156L15.1712 10.418ZM12 21C12 20.4477 12.4477 20 13 20H20C20.5523 20 21 20.4477 21 21C21 21.5523 20.5523 22 20 22H13C12.4477 22 12 21.5523 12 21Z" fill="#0F1729"/>
</svg>