module deepcube-example

go 1.17

require (
	github.com/golang-jwt/jwt v3.2.2+incompatible // indirect
	github.com/labstack/echo/v4 v4.5.0 // indirect
	github.com/labstack/gommon v0.3.0 // indirect
	github.com/mattn/go-colorable v0.1.8 // indirect
	github.com/mattn/go-isatty v0.0.12 // indirect
	github.com/valyala/bytebufferpool v1.0.0 // indirect
	github.com/valyala/fasttemplate v1.2.1 // indirect
	golang.org/x/crypto v0.0.0-20210322153248-0c34fe9e7dc2 // indirect
	golang.org/x/net v0.0.0-20210405180319-a5a99cb37ef4 // indirect
	golang.org/x/sys v0.0.0-20210403161142-5e06dd20ab57 // indirect
	golang.org/x/text v0.3.6 // indirect
	golang.org/x/time v0.0.0-20201208040808-7e3f01d25324 // indirect
)
