{
    "en-IN":{
        
        "meal":"Meal",
        "search":"Search",
        "account":"Account",
        "plans":"Plans",
        "lunch":"Lunch",
        "dinner":"Dinner",
        "Order_now_to_get":"Order now to get",
        "Tomorrows_Lunch":"Tomorrow's Lunch"
    },
    "hi-IN":{
        "meal":"भोजन",
        "search":"खोज",
        "account":"प्लान्स",
        "subscribe":"सदस्यता",
        "lunch":"दोपहर का भोजन",
        "dinner":"रात का भोजन",
        "Order_now_to_get":"अभी ऑर्डर करे",
        "Tomorrows_Lunch":"कल का दोपहर का खाना"
    },
    "mr-IN":{
        "meal":"खाना",
        "search":"प्लान्स",
        "account":"खातों ",
        "subscribe":"प्लान्स",
        "lunch":"दिन रो खाणो",
        "dinner":"रात रो खाणो",
        "Order_now_to_get":"अबार ऑर्डर करो",
        "Tomorrows_Lunch":"काल रो दिन रो खाणो"
    }
}
