{
  "tools": [
    {
      "name": "SalesforceTool",
      "tool_directory": "G:\\PERSISTENT\\NEW_TOOLS\\TOOLS\\salesforce\\SalesforceTool"
    }
  ],
  "yxi_name": "salesforce",
  "designer_path": null,
  "tool_family_name": "salesforce",
  "requirements_tool": "SalesforceTool"
}