{
  "tools": [
    {
      "name": "JustWorkTool",
      "tool_directory": "G:\\PERSISTENT\\NEW_TOOLS\\TOOLS\\justwork\\JustWorkTool"
    }
  ],
  "yxi_name": "justwork",
  "designer_path": null,
  "tool_family_name": "justwork",
  "requirements_tool": "JustWorkTool"
}