<svg xmlns="http://www.w3.org/2000/svg" width="28" height="28" viewBox="0 0 28 28">
    <g fill="#FFF" fill-rule="nonzero">
        <path d="M10.228 3.893l-.625 1.874a14.762 14.762 0 0 1-3.548 5.741l-3.056 3.06a5.737 5.737 0 0 0 0 8.104l2.894 2.894 2.518-2.518c4.63-4.629 5.628-11.533 2.7-17.388l-.883-1.767zM13.776 8.264c.645 2.495.735 5.069.23 7.544 1.748.099 3.468.489 5.112 1.159.164-.166.34-.352.512-.533l-3.462-3.462 1.158-1.158 3.412 3.412a48.957 48.957 0 0 0 4.013-5.249l-2.795-2.793 1.158-1.158 2.53 2.529c1.909-3.226 3.101-6.451 1.67-7.883-1.205-1.204-3.737-.5-6.39.85l2.19 2.188-1.158 1.158-2.522-2.523c-1.857 1.099-3.756 2.477-5.42 3.842l3.312 3.312-1.158 1.158-2.392-2.393zm5.865-1.08l2.315 2.315-1.157 1.157-2.315-2.315 1.157-1.157zM3.682 27.986l.965-1.35L1.84 23.83c-.165-.165-.287-.355-.433-.531L0 24.304l3.682 3.682zM9.569 24.206L7.445 26.33c2.019.715 4.36.27 5.973-1.342l.74-.745a14.762 14.762 0 0 1 5.742-3.548l1.874-.625-2.243-1.122c-1.877-.939-3.895-1.407-5.947-1.478-.793 2.536-2.044 4.764-4.015 6.736z"/>
    </g>
</svg>
