<svg xmlns="http://www.w3.org/2000/svg" width="20" height="17" viewBox="0 0 20 17">
    <g fill="none" fill-rule="evenodd">
        <path d="M-2-3h24v24H-2z"/>
        <g fill="#B9E4AC" fill-rule="nonzero">
            <path d="M18 .03H6.023a1.977 1.977 0 0 0-1.976 1.976v1.86h1.715V2.364c0-.416.336-.752.752-.752h10.994c.415 0 .752.336.752.752v7.07a.751.751 0 0 1-.752.752h-5.123v2.467l-.008 3.306a2.063 2.063 0 0 1-.278.952h3.56a.751.751 0 0 0 .751-.752v-.961a.751.751 0 0 0-.752-.752h-1.835v-1.334H18a1.977 1.977 0 0 0 1.977-1.977v-9.13A1.977 1.977 0 0 0 17.999.03zm-.972 12.119a.617.617 0 1 1 0-1.234.617.617 0 0 1 0 1.234z"/>
            <path d="M10.297 4.875H3.211a1.08 1.08 0 0 0-1.08 1.08v1.513h1.482V6.57h6.281v7.424H6.406v1.201c.1-.07.216-.12.348-.12a.617.617 0 0 1 0 1.233.602.602 0 0 1-.348-.121v.176c0 .21-.043.407-.112.592h4.003a1.08 1.08 0 0 0 1.08-1.08v-9.92c0-.596-.484-1.08-1.08-1.08z"/>
            <path d="M4.724 8.373H.674A.673.673 0 0 0 0 9.047v7.212c0 .372.301.674.674.674h4.05a.674.674 0 0 0 .674-.674V9.047a.674.674 0 0 0-.674-.674zM2.699 16.55A.52.52 0 1 1 2.7 15.51a.52.52 0 0 1 0 1.039zm1.604-2.104H1.095V9.714h3.208v4.731z"/>
        </g>
    </g>
</svg>
