<svg xmlns="http://www.w3.org/2000/svg" width="40" height="32" viewBox="0 0 40 32">
    <defs>
        <radialGradient id="a" cx="79.612%" cy="0%" r="98.072%" fx="79.612%" fy="0%" gradientTransform="scale(.7906 1) rotate(-77.846 .902 -.13)">
            <stop offset="0%" stop-color="#BCE259"/>
            <stop offset="100%" stop-color="#53AE46"/>
        </radialGradient>
    </defs>
    <path fill="url(#a)" fill-rule="nonzero" d="M39.792 6.486a28.143 28.143 0 0 0-.536-2.767c-.238-.98-.59-1.814-1.059-2.498C37.73.537 37.204.195 36.624.195c-.066-.29-.39-.257-.97.1s-.852.477-.814.357c.037-.119-.164.03-.603.446l-.657.625-.658.658c-.58.55-1.424.97-2.532 1.26-1.108.29-2.323.468-3.646.535-1.324.067-2.651.112-3.982.134a60.33 60.33 0 0 0-4.004.2c-1.338.113-2.416.302-3.234.57a20.854 20.854 0 0 0-4.55 2.13 19.47 19.47 0 0 0-3.803 3.1 13.312 13.312 0 0 0-2.654 4.116 12.7 12.7 0 0 0-.97 4.907c0 .788.066 1.561.2 2.32.03.148.149.476.357.981.208.506.312.788.312.848 0 .282-.23.64-.691 1.07-.461.432-.967.848-1.517 1.25a8.021 8.021 0 0 0-1.517 1.46c-.46.573-.691 1.12-.691 1.64a1.326 1.326 0 0 0 .1.513c.023.045.064.119.123.222.06.104.104.187.134.246.253.43.454.743.602.937.149.193.38.371.692.535.312.163.691.245 1.137.245.432 0 .878-.238 1.339-.713.46-.476.85-.997 1.17-1.562.32-.564.655-1.085 1.004-1.56.35-.476.643-.714.881-.714.342 0 1.056.275 2.141.825 1.086.55 1.74.863 1.963.937a19.652 19.652 0 0 0 6.38 1.048c3.33 0 6.587-.803 9.769-2.409 3.257-1.62 5.914-3.613 7.974-5.978 2.06-2.364 3.431-5.211 4.116-8.543.296-1.457.445-2.892.445-4.305 0-.565-.06-1.278-.178-2.14zm-11.666 7.56a1.373 1.373 0 0 1-1.004.424c-2.707 0-5.037.387-6.993 1.16-1.955.773-3.951 2.082-5.988 3.926-.297.282-.796.773-1.495 1.472-.698.699-1.249 1.227-1.65 1.583-.312.283-.647.424-1.004.424-.387 0-.721-.141-1.004-.424a1.37 1.37 0 0 1-.424-1.003c0-.357.141-.691.424-1.004 1.814-2.008 3.565-3.64 5.253-4.896 1.688-1.256 3.617-2.252 5.788-2.989 2.17-.736 4.535-1.104 7.093-1.104.386 0 .721.141 1.004.424.282.283.424.617.424 1.004 0 .386-.141.721-.424 1.003z"/>
</svg>
