<svg xmlns="http://www.w3.org/2000/svg" width="94" height="73" viewBox="0 0 94 73">
    <path fill="#DFA42B" fill-rule="nonzero" d="M99.48 16.214a70.358 70.358 0 0 0-1.339-6.916c-.595-2.453-1.477-4.535-2.648-6.245S93.01.488 91.56.488c-.167-.725-.976-.642-2.426.25-1.45.893-2.129 1.19-2.035.893.093-.298-.41.074-1.506 1.115a4157.254 4157.254 0 0 0-1.644 1.561l-1.646 1.645c-1.45 1.376-3.559 2.425-6.328 3.15-2.77.726-5.809 1.171-9.117 1.339-3.309.168-6.627.28-9.954.335-3.327.055-6.664.223-10.01.501-3.345.28-6.04.753-8.085 1.422a52.134 52.134 0 0 0-11.376 5.326 48.675 48.675 0 0 0-9.507 7.751c-2.807 2.956-5.019 6.385-6.636 10.289-1.616 3.902-2.425 7.992-2.425 12.267 0 1.97.167 3.903.501 5.8.075.371.372 1.19.893 2.453.52 1.265.78 1.97.78 2.12 0 .705-.576 1.6-1.728 2.676a40.245 40.245 0 0 1-3.792 3.122c-1.375 1.004-2.64 2.221-3.792 3.652C.577 69.588 0 70.955 0 72.255c0 .26.027.51.084.753.056.242.112.418.167.529.056.112.159.297.307.556.15.26.26.466.335.614.632 1.078 1.134 1.859 1.505 2.342.372.483.948.929 1.729 1.338.78.409 1.728.613 2.843.613 1.079 0 2.194-.595 3.347-1.783a19.18 19.18 0 0 0 2.927-3.903 39.21 39.21 0 0 1 2.509-3.904c.873-1.189 1.608-1.784 2.202-1.784.855 0 2.64.689 5.353 2.064 2.714 1.376 4.35 2.156 4.908 2.343 5.13 1.747 10.445 2.62 15.947 2.62 8.328 0 16.468-2.008 24.425-6.023 8.142-4.052 14.786-9.033 19.935-14.944 5.15-5.912 8.578-13.03 10.289-21.358.741-3.643 1.113-7.23 1.113-10.762 0-1.413-.148-3.197-.446-5.352zM70.314 35.116c-.707.707-1.544 1.06-2.51 1.06-6.767 0-12.593.967-17.482 2.9-4.887 1.932-9.878 5.204-14.971 9.813-.743.707-1.989 1.933-3.736 3.68-1.747 1.748-3.123 3.068-4.126 3.96-.781.706-1.617 1.06-2.51 1.06-.967 0-1.803-.354-2.51-1.06-.706-.705-1.06-1.543-1.06-2.51 0-.892.354-1.727 1.06-2.51 4.535-5.018 8.913-9.098 13.132-12.239 4.22-3.14 9.044-5.631 14.471-7.472 5.427-1.84 11.338-2.76 17.731-2.76.967 0 1.804.353 2.51 1.06.707.706 1.06 1.543 1.06 2.509s-.352 1.803-1.06 2.51z" opacity=".3"/>
</svg>
