<svg xmlns="http://www.w3.org/2000/svg" width="10" height="12" viewBox="0 0 10 12">
    <path fill="#086939" fill-rule="nonzero" d="M8.693 8.578l-2.025-.955a.524.524 0 0 1-.31-.473v-.677a4.486 4.486 0 0 0 .779-1.35c.3-.129.493-.408.493-.723v-.8a.772.772 0 0 0-.212-.525V2.011c.012-.11.059-.765-.443-1.305C6.54.238 5.833 0 4.875 0c-.958 0-1.665.238-2.1.706a1.722 1.722 0 0 0-.443 1.305v1.064a.772.772 0 0 0-.212.525v.8c0 .243.117.47.317.622.194.725.6 1.272.742 1.447v.662a.525.525 0 0 1-.292.464l-1.89.973C.382 8.885 0 9.492 0 10.152v.648c0 .95 3.189 1.2 4.875 1.2s4.875-.25 4.875-1.2v-.609c0-.687-.405-1.306-1.057-1.613z"/>
</svg>
