<svg xmlns="http://www.w3.org/2000/svg" width="42" height="30" viewBox="0 0 42 30">
    <defs>
        <radialGradient id="a" cx="79.612%" cy="0%" r="98.56%" fx="79.612%" fy="0%" gradientTransform="scale(.71429 1) rotate(-76.592 .955 -.202)">
            <stop offset="0%" stop-color="#BCE259"/>
            <stop offset="100%" stop-color="#53AE46"/>
        </radialGradient>
    </defs>
    <path fill="url(#a)" fill-rule="nonzero" d="M197.952 118.313L201.4 106h10.85v12.313h-14.298zm-.98 3.5h15.278V136H193l3.972-14.188zm33.076-3.5H215.75V106h10.85l3.448 12.313zm.98 3.5L235 136h-19.25v-14.188h15.278z" transform="translate(-193 -106)"/>
</svg>
