<svg xmlns="http://www.w3.org/2000/svg" width="30" height="30" viewBox="0 0 30 30">
    <path fill="#FFF" fill-rule="nonzero" d="M3.314 9.919c-4.443 4.443-4.415 11.7.062 16.178 4.478 4.478 11.736 4.506 16.179.063 3.92-3.921 4.36-10.033 1.332-14.492l2.097-2.097 2.464 2.465a2.17 2.17 0 0 0 3.069.011 2.17 2.17 0 0 0-.012-3.069l-2.464-2.464 2.803-2.804a2.17 2.17 0 0 0-.012-3.069A2.17 2.17 0 0 0 25.763.63L22.96 3.433 20.495.97a2.17 2.17 0 0 0-3.069-.012 2.17 2.17 0 0 0 .012 3.069l2.465 2.464-2.097 2.097C13.346 5.56 7.235 5.998 3.314 9.919zm13.16 13.16c-2.757 2.757-7.261 2.74-10.04-.039-2.78-2.779-2.797-7.283-.039-10.04 2.758-2.758 7.262-2.74 10.04.038 2.78 2.78 2.797 7.283.04 10.04z"/>
</svg>
