<svg xmlns="http://www.w3.org/2000/svg" width="34" height="40" viewBox="0 0 34 40">
    <defs>
        <linearGradient id="a" x1="84.722%" x2="15.278%" y1="0%" y2="100%">
            <stop offset="0%" stop-color="#BCE259"/>
            <stop offset="100%" stop-color="#53AE46"/>
        </linearGradient>
    </defs>
    <g fill="none" fill-rule="nonzero">
        <path d="M-3 0h40v40H-3z"/>
        <path fill="url(#a)" d="M33.054 28.593l-6.923-3.184c-.653-.301-1.059-.905-1.059-1.577v-2.254c.166-.187.341-.4.521-.634a14.84 14.84 0 0 0 2.141-3.866c1.023-.431 1.686-1.361 1.686-2.411V12a2.54 2.54 0 0 0-.724-1.75V6.704c.04-.367.2-2.55-1.516-4.35C25.69.792 23.276 0 20 0s-5.691.792-7.18 2.353c-1.716 1.801-1.556 3.984-1.516 4.351v3.546A2.54 2.54 0 0 0 10.58 12v2.667c0 .811.4 1.568 1.084 2.072.664 2.418 2.053 4.24 2.539 4.825v2.206c0 .645-.383 1.237-.998 1.547L6.741 28.56c-2.103 1.055-3.408 3.078-3.408 5.28V36c0 3.164 10.903 4 16.667 4 5.764 0 16.667-.836 16.667-4v-2.029c0-2.292-1.385-4.353-3.613-5.378z" transform="translate(-3)"/>
    </g>
</svg>
