digraph G {
node [shape=square, color=black];
edge [color=black];
g1 -> g1 [label=1.0, fontcolor=black];
g1 -> g2 [label=1.0, fontcolor=black];
g1 -> g3 [label=0.0, fontcolor=black];
g1 -> g4 [label=1.0, fontcolor=black];
g1 -> g5 [label=1.0, fontcolor=black];
g2 -> g1 [label=0.0, fontcolor=black];
g2 -> g2 [label=1.0, fontcolor=black];
g2 -> g3 [label=0.0, fontcolor=black];
g2 -> g4 [label=1.0, fontcolor=black];
g2 -> g5 [label=0.0, fontcolor=black];
g3 -> g1 [label=1.0, fontcolor=black];
g3 -> g2 [label=1.0, fontcolor=black];
g3 -> g3 [label=1.0, fontcolor=black];
g3 -> g4 [label=1.0, fontcolor=black];
g3 -> g5 [label=1.0, fontcolor=black];
g4 -> g1 [label=0.0, fontcolor=black];
g4 -> g2 [label=0.0, fontcolor=black];
g4 -> g3 [label=0.0, fontcolor=black];
g4 -> g4 [label=1.0, fontcolor=black];
g4 -> g5 [label=0.0, fontcolor=black];
g5 -> g1 [label=1.0, fontcolor=black];
g5 -> g2 [label=1.0, fontcolor=black];
g5 -> g3 [label=1.0, fontcolor=black];
g5 -> g4 [label=0.0, fontcolor=black];
g5 -> g5 [label=1.0, fontcolor=black];
g1[fontcolor=black]
g2[fontcolor=black]
g3[fontcolor=black]
g4[fontcolor=black]
g5[fontcolor=black]
}
