digraph G {
node [shape=diamond, color=blue];
edge [color=blue];
g4 [label = "g4", fontcolor=blue];
g5 [label = "g5", fontcolor=blue];
g1 [label = "g1", fontcolor=blue];
g2 [label = "g2", fontcolor=blue];
g3 [label = "g3", fontcolor=blue];
g4 -> g5;
g5 -> g1;
g1 -> g2;
g2 -> g3;
// title
labelloc="t";
label="Coucou!!!";
}
