digraph G {
node [shape=oval, color=blue];
edge [color=blue];
labelloc="t";
label="Good"; fontcolor=blue;
labelGood [label = "a11, a03, a07, a12, a08, a05, fictiveBest", shape=oval, fontcolor=blue];
}
