digraph G {
node [shape=circle, color=green];
edge [color=green];
g1 -> g2;
g1 -> g4;
g2 -> g4;
g3 -> g5;
g3 -> g1;
g3 -> g2;
g3 -> g4;
g5 -> g2;
g5 -> g4;
g1[fontcolor=green]
g2[fontcolor=green]
g3[fontcolor=green]
g4[fontcolor=green]
g5[fontcolor=green]
}
