name="A MEIOU submod - A worldwide construction mapmode"
path="mod/DebugConstructionMapmode"
tags={
	"MEIOU and Taxes"
	"Building AI"
	"A MEIOU submod"
	"Jakob"
}
picture="MEIOUandTaxes1.jpg.jpg"
supported_version="1.25.*.*"