name="A MEIOU submod - A Capital, Regional Capital & mines Building AI [ALPHA 1.0]"
path="mod/ACapitalRegionalCapitalAndMinesBuildingAImod"
tags={
	"MEIOU and Taxes"
	"Building AI"
	"A MEIOU submod"
	"Jakob"
}
picture="MEIOUandTaxes1.jpg.jpg"
supported_version="1.25.*.*"