begin
	ndims              2
	nvars              1
	size               128 128
	iproc              4 4
	ghost              3
	n_iter             13
	restart_iter       0 
	time_scheme        rk
	time_scheme_type   44
	hyp_space_scheme   crweno5
	hyp_interp_type    components
	dt                 0.004
	conservation_check yes
	screen_op_iter     1
	file_op_iter       999999
	op_file_format     binary
	ip_file_type       binary
	input_mode         serial
	output_mode        serial
	op_overwrite       no
	model              linear-advection-diffusion-reaction
end
