begin
  ndims             2
  nvars             1
  size              120 60
  iproc             3 1
  ghost             3
  n_iter            4
  time_scheme       rk
  time_scheme_type  ssprk3
  hyp_space_scheme  weno5
  dt                0.04
  screen_op_iter    1
  file_op_iter      9999
  op_file_format    tecplot2d
  op_overwrite      no
  model             linear-advection-diffusion-reaction
end
