begin
  ndims             3
  nvars             5
  size              200 96 3
  iproc             2 2 1
  ghost             3
  n_iter            5
  time_scheme       rk
  time_scheme_type  44
  hyp_space_scheme  weno5
  hyp_interp_type   components
  par_space_type    nonconservative-2stage
  par_space_scheme  4
  dt                0.04
  screen_op_iter    1
  file_op_iter      1000
  ip_file_type      binary
  op_file_format    binary
  op_overwrite      yes
  model             navierstokes3d
  immersed_body     cylinder.stl
end
