{
    "participantID": "P14",
    "techniqueOrder": ["redict", "keyword"],
    "redict": {
        "_1EU": {
            "T1": {
                "_meta": "REDICT | 1EU | T1 | <D>",
                "trigger": "D",
                "baseString": "Could you please pass me the green bottle on the table.",
                "testString": "Could you please pass me the green yellow bottle on the table."
            },
            "T2": {
                "_meta": "REDICT | 1EU | T2 | <R>",
                "trigger": "R",
                "baseString": "They prepared the cotton candy in an old fashioned way.",
                "testString": "They prepared the rotten candy in an old fashioned way."
            },
            "T3": {
                "_meta": "REDICT | 1EU | T3 | <A>",
                "trigger": "A",
                "baseString": "Brent and Ben had gone for deer hunting in the dense forest.",
                "testString": "Brent and Ben had gone for deer in the dense forest."
            }
        },
        "_2EU": {
            "T1": {
                "_meta": "REDICT | 2EU | T1 | <DD> | J'S'",
                "trigger": "DD",
                "config": "J'S'",
                "baseString": "The robotics team worked hard to produce a high functioning robot.",
                "testString": "The robotics team worked very hard to secretly produce a high functioning robot."
            },
            "T2": {
                "_meta": "REDICT | 2EU | T2 | <RD> | J'S'",
                "trigger": "RD",
                "config": "J'S'",
                "baseString": "The dedicated office worker reports early to the office every day.",
                "testString": "The dedicated office worker arrives early to the office pool every day."
            },
            "T3": {
                "_meta": "REDICT | 2EU | T3 | <RD> | JS'",
                "trigger": "RD",
                "config": "JS'",
                "baseString": "He displayed and sold the limited edition robots at a smaller price.",
                "testString": "He displayed and bought some of the limited edition robots at a smaller price."
            },
            "T4": {
                "_meta": "REDICT | 2EU | T4 | <DD> | JS'",
                "trigger": "DD",
                "config": "JS'",
                "baseString": "Last night my friends and I had dinner at a fancy restaurant.",
                "testString": "Last night my friends and I me having had dinner at a fancy restaurant."
            },
            "T5": {
                "_meta": "REDICT | 2EU | T5 | <RD> | J'S",
                "trigger": "RD",
                "config": "J'S",
                "baseString": "Joe drove to the railway station at the outskirts of the city.",
                "testString": "Joe drove to that railway platform station at the outskirts of the city."
            },
            "T6": {
                "_meta": "REDICT | 2EU | T6 | <DD> | J'S",
                "trigger": "DD",
                "config": "J'S",
                "baseString": "That man stood up to leave the dinner party before it was too late.",
                "testString": "That man stood up to leave the the dinner birthday party before it was too late."
            },
            "T7": {
                "_meta": "REDICT | 2EU | T7 | <DD> | JS",
                "trigger": "DD",
                "config": "JS",
                "baseString": "It rained quite heavily in the mountains for the past two weeks.",
                "testString": "It rained quite strongly and heavily in the mountains for the past two weeks."
            },
            "T8": {
                "_meta": "REDICT | 2EU | T8 | <RD> | JS",
                "trigger": "RD",
                "config": "JS",
                "baseString": "Paul has read enough good novels to know the nuances of creative writing.",
                "testString": "Paul has read enough bad books novels to know the nuances of creative writing."
            }
        }
    },
    "keyword": {
        "_1EU": {
            "T1": {
                "_meta": "KEY | 1EU | T1 | <A>",
                "trigger": "A",
                "baseString": "Justin sings and dances in the studio room every single day.",
                "testString": "Justin sings and dances in the room every single day."
            },
            "T2": {
                "_meta": "KEY | 1EU | T2 | <R>",
                "trigger": "R",
                "baseString": "Both brother and sister play computer games after school.",
                "testString": "Both brother and sister play football games after school."
            },
            "T3": {
                "_meta": "KEY | 1EU | T3 | <D>",
                "trigger": "D",
                "baseString": "The students generally hate to take exams in the afternoon.",
                "testString": "The students generally hate to take easy exams in the afternoon."
            }
        },
        "_2EU": {
            "T1": {
                "_meta": "KEY | 2EU | T1 | <AA> | J'S'",
                "trigger": "AA",
                "config": "J'S'",
                "baseString": "Swift is one of the first singers to sell an album on its first day.",
                "testString": "Swift is one of the singers sell an album on its first day."
            },
            "T2": {
                "_meta": "KEY | 2EU | T2 | <RD> | J'S'",
                "trigger": "RD",
                "config": "J'S'",
                "baseString": "Perched on a branch the little eagle shouted loudly to call its mother.",
                "testString": "Perched on a branch the little seagull shouted extremely loudly to call its mother."
            },
            "T3": {
                "_meta": "KEY | 2EU | T3 | <RD> | JS'",
                "trigger": "RD",
                "config": "JS'",
                "baseString": "Little Red Riding Hood was carrying the basket of flowers to her house.",
                "testString": "Little Red Riding Hood was marrying some basket of fruits to her house."
            },
            "T4": {
                "_meta": "KEY | 2EU | T4 | <AA> | JS'",
                "trigger": "AA",
                "config": "JS'",
                "baseString": "We could see the dust and grime stuck on his white cotton pants.",
                "testString": "We could see the dust and firmly stuck on his white cotton pants."
            },
            "T5": {
                "_meta": "KEY | 2EU | T5 | <RD> | J'S",
                "trigger": "RD",
                "config": "J'S",
                "baseString": "Moving up the social ladder brings unfortunate consequences for many.",
                "testString": "Moving up the public ladder leather brings unfortunate consequences for many."
            },
            "T6": {
                "_meta": "KEY | 2EU | T6 | <AA> | J'S",
                "trigger": "AA",
                "config": "J'S",
                "baseString": "Snow White and Cinderella happily danced all night at the ballroom.",
                "testString": "Snow and happily danced all night at the ballroom."
            },
            "T7": {
                "_meta": "KEY | 2EU | T7 | <AA> | JS",
                "trigger": "AA",
                "config": "JS",
                "baseString": "The management deeply apologized for their misconduct with the visitor.",
                "testString": "The management for their misconduct with the visitor."
            },
            "T8": {
                "_meta": "KEY | 2EU | T8 | <RD> | JS",
                "trigger": "RD",
                "config": "JS",
                "baseString": "Look under the mattress in the wardrobe for the hidden stash of cash.",
                "testString": "Look under that dirty mattress in the wardrobe for the hidden stash of cash."
            }
        }
    }
}