{
    "participantID": "P6",
    "techniqueOrder": ["redict", "keyword"],
    "redict": {
        "_1EU": {
            "T1": {
                "_meta": "REDICT | 1EU | T1 | <A>",
                "trigger": "A",
                "baseString": "A preposition is a word that connects two phrases.",
                "testString": "A preposition is a that connects two phrases."
            },
            "T2": {
                "_meta": "REDICT | 1EU | T2 | <R>",
                "trigger": "R",
                "baseString": "They prepared the cotton candy in an old fashioned way.",
                "testString": "They prepared the rotten candy in an old fashioned way."
            },
            "T3": {
                "_meta": "REDICT | 1EU | T3 | <D>",
                "trigger": "D",
                "baseString": "Brent and Ben are going deer hunting tomorrow morning.",
                "testString": "Brent and Ben are are going deer hunting tomorrow morning."
            }
        },
        "_2EU": {
            "T1": {
                "_meta": "REDICT | 2EU | T1 | <DD> | J'S'",
                "trigger": "DD",
                "config": "J'S'",
                "baseString": "The robotics team worked hard to produce a high functioning robot.",
                "testString": "The robotics team worked very hard to secretly produce a high functioning robot."
            },
            "T2": {
                "_meta": "REDICT | 2EU | T2 | <AR> | J'S'",
                "trigger": "AR",
                "config": "J'S'",
                "baseString": "The dedicated office worker reports early to the office every day.",
                "testString": "The dedicated office worker early to the pool every day."
            },
            "T3": {
                "_meta": "REDICT | 2EU | T3 | <AR> | JS'",
                "trigger": "AR",
                "config": "JS'",
                "baseString": "He displayed and sold the limited edition robots at a smaller price.",
                "testString": "He and told the limited edition robots at a smaller price."
            },
            "T4": {
                "_meta": "REDICT | 2EU | T4 | <DD> | JS'",
                "trigger": "DD",
                "config": "JS'",
                "baseString": "Last night my friends and I had dinner at a fancy restaurant.",
                "testString": "Last night my friends and I to having had dinner at a fancy restaurant."
            },
            "T5": {
                "_meta": "REDICT | 2EU | T5 | <AR> | J'S",
                "trigger": "AR",
                "config": "J'S",
                "baseString": "Joe drove to the railway station at the outskirts of the city.",
                "testString": "Joe drove to railway platform at the outskirts of the city."
            },
            "T6": {
                "_meta": "REDICT | 2EU | T6 | <DD> | J'S",
                "trigger": "DD",
                "config": "J'S",
                "baseString": "The man stood up to leave the dinner party before it was too late.",
                "testString": "The man stood up to leave the the dinner birthday party before it was too late."
            },
            "T7": {
                "_meta": "REDICT | 2EU | T7 | <DD> | JS",
                "trigger": "DD",
                "config": "JS",
                "baseString": "It rained quite heavily in the mountains for the past two weeks.",
                "testString": "It rained quite strongly and heavily in the mountains for the past two weeks."
            },
            "T8": {
                "_meta": "REDICT | 2EU | T8 | <AR> | JS",
                "trigger": "AR",
                "config": "JS",
                "baseString": "Paul has read enough good novels to know the nuances of creative writing.",
                "testString": "Paul has read bad novels to know the nuances of creative writing."
            }
        }
    },
    "keyword": {
        "_1EU": {
            "T1": {
                "_meta": "KEY | 1EU | T1 | <R>",
                "trigger": "R",
                "baseString": "Justin sings and dances in the studio room every single day.",
                "testString": "Justin sings and dances in the video room every single day."
            },
            "T2": {
                "_meta": "KEY | 1EU | T2 | <A>",
                "trigger": "A",
                "baseString": "Both brother and sister play computer games after school.",
                "testString": "Both brother and sister play games after school."
            },
            "T3": {
                "_meta": "KEY | 1EU | T3 | <D>",
                "trigger": "D",
                "baseString": "The students generally hate to take exams in the afternoon.",
                "testString": "The students generally hate to take easy exams in the afternoon."
            }
        },
        "_2EU": {
            "T1": {
                "_meta": "KEY | 2EU | T1 | <DD> | J'S'",
                "trigger": "DD",
                "config": "J'S'",
                "baseString": "Swift is one of the first singers to sell an album on its first day.",
                "testString": "Swift is one of the very first singers to not sell an album on its first day."
            },
            "T2": {
                "_meta": "KEY | 2EU | T2 | <RD> | J'S'",
                "trigger": "RD",
                "config": "J'S'",
                "baseString": "Perched on a branch the little eagle shouted loudly to call its mother.",
                "testString": "Perched on a branch the little seagull shouted very loudly to call its mother."
            },
            "T3": {
                "_meta": "KEY | 2EU | T3 | <RD> | JS'",
                "trigger": "RD",
                "config": "JS'",
                "baseString": "Little Red Riding Hood was carrying a basket of flowers to her house.",
                "testString": "Little Red Riding Hood was marrying an of fruits to her house."
            },
            "T4": {
                "_meta": "KEY | 2EU | T4 | <DD> | JS'",
                "trigger": "DD",
                "config": "JS'",
                "baseString": "We could see the dust and grime stuck on his white cotton pants.",
                "testString": "We could see the dust and grime grease firmly stuck on his white cotton pants."
            },
            "T5": {
                "_meta": "KEY | 2EU | T5 | <RD> | J'S",
                "trigger": "RD",
                "config": "J'S",
                "baseString": "Moving up the social ladder brings unfortunate consequences for many.",
                "testString": "Moving up the public ladder ladder brings unfortunate consequences for many."
            },
            "T6": {
                "_meta": "KEY | 2EU | T6 | <DD> | J'S",
                "trigger": "DD",
                "config": "J'S",
                "baseString": "Snow White and Cinderella merrily danced all night at the ballroom.",
                "testString": "Snow White and Cinderella very merrily danced sang all night at the ballroom."
            },
            "T7": {
                "_meta": "KEY | 2EU | T7 | <DD> | JS",
                "trigger": "DD",
                "config": "JS",
                "baseString": "The management deeply apologized for their misconduct with the visitor.",
                "testString": "The management deeply said sorry apologized for their misconduct with the visitor."
            },
            "T8": {
                "_meta": "KEY | 2EU | T8 | <RD> | JS",
                "trigger": "RD",
                "config": "JS",
                "baseString": "Look under the mattress in the wardrobe for the hidden stash of cash.",
                "testString": "Look under that dirty mattress in the wardrobe for the hidden stash of cash."
            }
        }
    }
}