{
    "participantID": "P13",
    "techniqueOrder": ["keyword", "redict"],
    "keyword": {
        "_1EU": {
            "T1": {
                "_meta": "KEY | 1EU | T1 | <D>",
                "trigger": "D",
                "baseString": "A preposition is a word that connects two phrases.",
                "testString": "A preposition is a phrase word that connects two phrases."
            },
            "T2": {
                "_meta": "KEY | 1EU | T2 | <R>",
                "trigger": "R",
                "baseString": "They prepared the cotton candy in an old fashioned way.",
                "testString": "They prepared the rotten candy in an old fashioned way."
            },
            "T3": {
                "_meta": "KEY | 1EU | T3 | <A>",
                "trigger": "A",
                "baseString": "Brent and Ben are going deer hunting tomorrow morning.",
                "testString": "Brent and Ben are going hunting tomorrow morning."
            }
        },
        "_2EU": {
            "T1": {
                "_meta": "KEY | 2EU | T1 | <RR> | J'S'",
                "trigger": "RR",
                "config": "J'S'",
                "baseString": "The robotics team worked hard to produce a high functioning robot.",
                "testString": "The robotics team tried hard to building a high functioning robot."
            },
            "T2": {
                "_meta": "KEY | 2EU | T2 | <RD> | J'S'",
                "trigger": "RD",
                "config": "J'S'",
                "baseString": "The dedicated office worker reports early to the office every day.",
                "testString": "The dedicated office worker arrives early to the the office every day."
            },
            "T3": {
                "_meta": "KEY | 2EU | T3 | <RD> | JS'",
                "trigger": "RD",
                "config": "JS'",
                "baseString": "He displayed and sold the limited edition robots at a smaller price.",
                "testString": "He displayed and told her the limited edition robots at a smaller price."
            },
            "T4": {
                "_meta": "KEY | 2EU | T4 | <RR> | JS'",
                "trigger": "RR",
                "config": "JS'",
                "baseString": "Last night my friends and I had dinner at a fancy restaurant.",
                "testString": "Last night my friends and me having dinner at a fancy restaurant."
            },
            "T5": {
                "_meta": "KEY | 2EU | T5 | <RD> | J'S",
                "trigger": "RD",
                "config": "J'S",
                "baseString": "Joe drove to the railway station at the outskirts of the city.",
                "testString": "Joe drove above the train railway station at the outskirts of the city."
            },
            "T6": {
                "_meta": "KEY | 2EU | T6 | <RR> | J'S",
                "trigger": "RR",
                "config": "J'S",
                "baseString": "The man stood up to leave the dinner party before it was too late.",
                "testString": "The man stood up to leave his dinner gathering before it was too late."
            },
            "T7": {
                "_meta": "KEY | 2EU | T7 | <RR> | JS",
                "trigger": "RR",
                "config": "JS",
                "baseString": "It rained quite heavily in the mountains for the past two weeks.",
                "testString": "It rained really strongly in the mountains for the past two weeks."
            },
            "T8": {
                "_meta": "KEY | 2EU | T8 | <RD> | JS",
                "trigger": "RD",
                "config": "JS",
                "baseString": "Paul has read enough good novels to know the nuances of creative writing.",
                "testString": "Paul has read many good good novels to know the nuances of creative writing."
            }
        }
    },
    "redict": {
        "_1EU": {
            "T1": {
                "_meta": "REDICT | 1EU | T1 | <A>",
                "trigger": "A",
                "baseString": "Justin sings and dances in the studio room every single day.",
                "testString": "Justin sings and dances in the room every single day."
            },
            "T2": {
                "_meta": "REDICT | 1EU | T2 | <D>",
                "trigger": "D",
                "baseString": "Both brother and sister play computer games after school.",
                "testString": "Both brother and sister play interesting computer games after school."
            },
            "T3": {
                "_meta": "REDICT | 1EU | T3 | <R>",
                "trigger": "R",
                "baseString": "The students generally hate to take exams in the afternoon.",
                "testString": "The students generally hate to take examinations in the afternoon."
            }
        },
        "_2EU": {
            "T1": {
                "_meta": "REDICT | 2EU | T1 | <AA> | J'S'",
                "trigger": "AA",
                "config": "J'S'",
                "baseString": "She is one of the few singers to sell an album on its first day.",
                "testString": "She is one of the few to an album on its first day."
            },
            "T2": {
                "_meta": "REDICT | 2EU | T2 | <AR> | J'S'",
                "trigger": "AR",
                "config": "J'S'",
                "baseString": "Perched on a branch the little eagle shouted loudly to call its mother.",
                "testString": "Perched on a branch the eagle called loudly to call its mother."
            },
            "T3": {
                "_meta": "REDICT | 2EU | T3 | <AR> | JS'",
                "trigger": "AR",
                "config": "JS'",
                "baseString": "Little Red Riding Hood was carrying the basket of flowers to her house.",
                "testString": "Little Red Riding Hood was that basket of flowers to her house."
            },
            "T4": {
                "_meta": "REDICT | 2EU | T4 | <AA> | JS'",
                "trigger": "AA",
                "config": "JS'",
                "baseString": "We could see the dust and grime stuck on his white cotton pants.",
                "testString": "We could see the dust and on his white cotton pants."
            },
            "T5": {
                "_meta": "REDICT | 2EU | T5 | <AR> | J'S",
                "trigger": "AR",
                "config": "J'S",
                "baseString": "Moving up the social ladder brings unfortunate consequences for many.",
                "testString": "Moving up social leather brings unfortunate consequences for many."
            },
            "T6": {
                "_meta": "REDICT | 2EU | T6 | <AA> | J'S",
                "trigger": "AA",
                "config": "J'S",
                "baseString": "Snow White and Cinderella danced happily all night at the ballroom.",
                "testString": "Snow and danced happily all night at the ballroom."
            },
            "T7": {
                "_meta": "REDICT | 2EU | T7 | <AA> | JS",
                "trigger": "AA",
                "config": "JS",
                "baseString": "Oliver did not concede even a single goal in the football tournament.",
                "testString": "Oliver did not concede even a in the football tournament."
            },
            "T8": {
                "_meta": "REDICT | 2EU | T8 | <AR> | JS",
                "trigger": "AR",
                "config": "JS",
                "baseString": "Look under that table beside the wardrobe to find the huge pile of papers.",
                "testString": "Look under that table beside the for find the huge pile of papers."
            }
        }
    }
}