{
  "plugins": ["stylelint-order"],
  "rules": {
    "color-hex-length": "long",
    "color-named": "never",
    "no-empty-source": true,
    "order/properties-alphabetical-order": true,
    "selector-type-case": "lower",
    "value-keyword-case": ["lower", {"camelCaseSvgKeywords": true}]
  }
}
