+ date
Thu Aug 31 09:31:04 UTC 2023
+ id
uid=0(root) gid=0(root) groups=0(root)
+ apt-get source --only-source linux-meta=5.15.0.82.78+11.0trisquel6
Reading package lists...
E: Can not find version '5.15.0.82.78+11.0trisquel6' of package 'linux-meta'
E: Unable to find a source package for linux-meta
