+ date
Tue Apr 11 20:12:04 UTC 2023
+ apt-get source --only-source linux-meta=5.15.0.56.54+11.0trisquel6
Reading package lists...
E: Can not find version '5.15.0.56.54+11.0trisquel6' of package 'linux-meta'
E: Unable to find a source package for linux-meta
