+ date
Tue Apr 11 20:47:25 UTC 2023
+ apt-get source --only-source linux=5.15.0-50.56+11.0trisquel11
Reading package lists...
E: Can not find version '5.15.0-50.56+11.0trisquel11' of package 'linux'
E: Unable to find a source package for linux
