+ date
Tue Apr 11 20:58:21 UTC 2023
+ apt-get source --only-source linux=5.15.0-67.74+11.0trisquel18
Reading package lists...
E: Can not find version '5.15.0-67.74+11.0trisquel18' of package 'linux'
E: Unable to find a source package for linux
