+ date
Thu Dec 21 11:27:36 UTC 2023
+ id
uid=0(root) gid=0(root) groups=0(root)
+ apt-get source --only-source linux=5.15.0-82.91+11.0trisquel24
Reading package lists...
E: Can not find version '5.15.0-82.91+11.0trisquel24' of package 'linux'
E: Unable to find a source package for linux
