+ date
Sat Jun 17 07:15:06 UTC 2023
+ id
uid=0(root) gid=0(root) groups=0(root)
+ apt-get source --only-source kdenlive=4:23.04.2-0~ubuntu22.04.1+11.0trisquel2
Reading package lists...
E: You must put some 'deb-src' URIs in your sources.list
