+ date
Sat Nov 25 20:03:55 UTC 2023
+ id
uid=0(root) gid=0(root) groups=0(root)
+ apt-get source --only-source linux-hwe-6.2=6.2.0-33.33~22.04.1+11.0trisquel25
Reading package lists...
E: Can not find version '6.2.0-33.33~22.04.1+11.0trisquel25' of package 'linux-hwe-6.2'
E: Unable to find a source package for linux-hwe-6.2
