+ date
Fri Mar 15 05:40:45 UTC 2024
+ id
uid=0(root) gid=0(root) groups=0(root)
+ apt-get source --only-source linux-hwe-6.5=6.5.0-21.21~22.04.1+11.0trisquel27
Reading package lists...
E: Can not find version '6.5.0-21.21~22.04.1+11.0trisquel27' of package 'linux-hwe-6.5'
E: Unable to find a source package for linux-hwe-6.5
