amanda=1:3.5.1-7
animatch=1.0.3-1pureos+librem5.1+byz1
appstream-generator=0.8.6-2~pureos1
appstream-glib=0.7.18-1pureos1
appstream=0.15.1-1~pureos1
atlas-cpp=0.6.4-3
autoclass=3.3.6.dfsg.1-2
bagel=1.2.2-2
base-files=11.1pureos1
bob=1.0.1-1pureos+librem5.2+byz1
boiledcorn=1.0.1-1pureos+librem5.1+byz1
c-ares=1.18.1-1pureos2
calamares=3.2.44.3-0pureos2
callaudiod=0.1.9-1~exp1~pureos1
carbons=0.2.3+actually0.2.2.0pureos1
casper=1.395pureos3
cawbird=1.3.1-0pureos3
chatty=0.7.3-1pureos1
clementine=1.4.0~rc1+git347-gfc4cb6fc7+dfsg-1+deb11u1
coreboot=4.8.1-0pureos1
cron=3.0pl1-137pureos1
darktable=3.4.1-5
debian-installer=20171204pureos2
debos=1.0.0+git20210707.c66a48d-2~pureos0.1
deja-dup=42.7-1pureos1
dino-im=0.4.2-1pureos1
directx-headers=1.4.9-1~pureos1
dnsproxy=1.16-0.1+deb11u1
dolfin=2019.2.0~git20201207.b495043-5
dolfinx=2019.2.0~git20210130.c14cb0a-5
dpkg=1.20.12pureos1
epiphany-browser=40.2-1pureos2
eris=1.3.23-8
evince=40.1-1pureos1
fdflush=1.0.1.3
feedbackd=0.2.0-1pureos1
flashrom=1.2.0-0pureos10
fwupd=1.5.7-4pureos0.1
gbinder-python=1.1.1-0pureos1
gcr=3.38.1-2pureos3
gdm3=3.38.2.1-1pureos1
geary=40-0pureos2
gedit=3.38.1-1+pureos3
geoclue-2.0=2.6.0-2pureos2
geoclue-2.0=2.7.0-1pureos1~byz1
glib2.0=2.66.8-1pureos3
gnome-bluetooth=3.34.3-2pureos1
gnome-calculator=1:40.0-1pureos2
gnome-calendar=41.0-1pureos7
gnome-calls=45~alpha.0-2pureos1
gnome-characters=40.0-1pureos1
gnome-chess=1:3.38.0-1pureos2
gnome-clocks=40.0-2pureos3
gnome-contacts=43~beta-1pureos2
gnome-control-center=1:3.38.4-1pureos7
gnome-desktop3=3.38.5-3pureos1
gnome-disk-utility=41.0-1~pureos1
gnome-firmware=3.36.0-1pureos0.1
gnome-initial-setup=3.38.4-1pureos1
gnome-online-accounts=3.38.0-3pureos1
gnome-power-manager=43.0-1pureos1
gnome-screenshot=41.0-1pureos2
gnome-settings-daemon=3.38.2-1pureos5
gnome-software=3.38.1-1pureos0.1
gnome-taquin=3.38.1-1+pureos1
gnome-usage=3.38.0-1pureos2
gnss-share=0.4-0pureos2
gnss-share=0.7.1-2pureos1~byz1.1
golang-github-go-debos-fakemachine=0.0~git20210901.fc48786-1~pureos0.1
grub-gfxpayload-lists=0.7
grub2=2.06-3pureos1u1~deb11u5
gsettings-desktop-schemas=3.38.0-2pureos1
gst-plugins-bad1.0=1.18.4-3pureos1
gtherm=0.0.3-1~pureos1
gtk+3.0=3.24.27-1pureos4
gtk4=4.6.5+ds-1pureos4
haegtesse=0.1.2~0pureos1
hivex=1.3.20-1
i2pd=2.36.0-1
ice=6.0.8-0pureos4
infineon-firmware-updater-master=1.1.2459.0-0pureos2.1
ircii=20210314+really20190117-1
jsonnet=0.17.0+ds-2
kdeconnect=20.12.3-2
kgx=0.4.0-1pureos2
kodi=2:19.1+dfsg2-2+deb11u1pureos1
kongress=1.0.1-1
l2tpns=2.3.3-2
libadwaita-1=1.2.0-1pureos1
libaperture-0=0.1.0+git20200908-2
libatomic-queue=0.0+git20201108.d9d66b6-2
libcamera=0~git20220628+27cc0a6b-1pureos3
libdecor-0=0.1.0-1~pureos1
libdrm=2.4.107-1pureos1
libgbinder=1.1.26-0pureos3
libglibutil=1.0.67-0pureos1
libglvnd=1.3.4-2pureos2
libhandy-1=1.6.2-1pureos1
libmbim=1.26.2-1pureos2
libnitrokey=3.6-1pureos1
libqmi=1.30.4-1pureos2
librem-control=0.0.2
libsdl2=2.0.16+dfsg1-4pureos1
libssh=0.9.5-1+deb11u1pureos1
libva=2.10.0-1pureos1
libwebm=1.0.0.28-1
libwfut=0.2.3-8
libxmlb=0.3.6-2~pureos0.1
lirc=0.10.1-6.3
mercator=0.3.3-6
mesa=21.2.6-1pureos4
millipixels=0.22.0-1pureos1
mmsd-tng=1.13.0-0pureos1
modemmanager=1.18.6-1pureos4
mpv=0.32.0-3
nautilus=3.38.2-1+deb11u1pureos1
netselect=0.3.ds1-29
network-manager-openvpn=1.8.14-1~pureos1
network-manager=1.30.6-1+deb11u1pureos1
neverball=1.6.0+git20180603-3pureos1
nheko=0.10.0-1pureos1
node-opencv=7.0.0+git20200310.6c13234-2
nomad-driver-lxc=0.3.0-1
nomad=0.12.10+dfsg1-3
obs-studio=26.1.2+dfsg1-2
odin=2.0.4-3
olm=3.2.11~dfsg-1~bpo11+1pureos1
openexr=2.5.4-2+deb11u1pureos1
osk-sdl=0.67.1-2pureos1
osk-sdl=0.67.1-2pureos2
p7zip=16.02+dfsg-8
packagekit=1.2.5-1~pureos2
pango1.0=1.50.7+ds-1~pureos1
paxctld=1.2.1-1pureos5
phoc=0.28.0+ds-1pureos1
phoc=0.29.0+ds-1pureos1~byz1
phosh-mobile-settings=0.27.0-1pureos2
phosh-mobile-settings=0.29.0-1pureos1~byz1
phosh-osk-stub=0.32.0-1pureos1~byz1
phosh-tour=0.25.0-1pureos1
phosh-tour=0.28.0-1pureos1
phosh=0.28.0-1pureos1
phosh=0.32.0-1pureos1~byz1
pixman=0.40.0-1.1pureos1
plymouth=0.9.5-3pureos4
psensor=1.2.0-1pureos2
pulseaudio=14.2-2pureos2
pulseaudio=14.2-2pureos3
pureos-meta=0.11.0
pureos-store=41.beta+really41.4-0pureos2
purple-xmpp-http-upload=0.2.4-1~pureos1
pygobject=3.40.1-1~pureos1
python-apt=2.2.1pureos1
python-igraph=0.9.0-2
python-reportlab=3.5.59-2
rust-fs-extra=1.2.0-0pureos1
rust-liboverdrop=0.0.2-0pureos1
scrappie=1.4.2-7
seahorse=40.0-2~pureos3
seatd=0.5.0-2pureos1
simgrid=3.25+dfsg-5
sks=1.1.6+git20210302.c3ba6d5a-3
skstream=0.3.9-4
soapyosmo=0.2.5-4
sofia-sip=1.12.11+20110422.1+1e14eea~dfsg-3pureos1
squeekboard=1.22.0-1pureos1
squeekboard=1.22.0-1pureos2~byz1
syncevolution=2.0.0-1+20211029~pureos1
systemd-zram-generator=0.3.2-0pureos1
tcd-utils=20061127-2b1
termshark=2.2.0-1+deb11u1
thunderbird=1:115.4.1-1~deb11u1
tootle=1.0-ds1-4pureos3
tpmfactoryupd=1.1.2529.00-1pureos4
usbguard=1.1.1+ds-1pureos1
util-linux=2.36.1-8+deb11u1pureos1
varconf=1.0.1-7
virtboard=0.0.6pureos1
vte2.91=0.66.1-1pureos1
vtk-dicom=0.8.12-4
vvmd=0.12-1pureos1
vvmplayer=1.5-1~pureos1
waaaa=0.0.0+git20201112-1pureos+librem5.1+byz1
wayland=1.21.0-1pureos2
wfmath=1.0.2+dfsg1-14
wget=1.21-1+deb11u1
wlroots=0.15.1-2pureos1
wys=0.1.11-1pureos1
xdg-desktop-portal-gtk=1.8.0-1pureos1
xdmf=3.0+git20190531-7
xserver-xorg-video-intel=2:2.99.917+git20200714-1+deb11u1
yelp=3.38.3-1pureos1
yforth=0.2.1-1
