+ date
Tue Apr 18 15:51:38 UTC 2023
+ apt-get source --only-source i2pd=2.36.0-1
Reading package lists...
E: Can not find version '2.36.0-1' of package 'i2pd'
E: Unable to find a source package for i2pd
