389-ds-base=1.4.4.11-2+devuan0.1
apt=2.2.4+devuan1
base-files=11.1+devuan3
cgroupfs-mount=1.4+devuan1
colord=1.4.5-3+devuan1
dbus=1.12.24-0+deb11u1devuan1
debian-installer=20210731+devuan2
debootstrap=1.0.123+devuan3
desktop-base=1:4.1
distro-info-data=0.51+devuan1
dnscrypt-proxy=2.0.45+ds1-1+devuan1
elogind=246.10-2
gpsd=3.22-4+devuan2
hylafax=3:6.0.7-3.1+devuan1
init-system-helpers=1.60+devuan1
iwd=1.14-2+devuan1
libvirt=7.0.0-3+devuan3
lightdm=1.26.0-7+devuan3
live-build=4.0.3-1+devuan2
live-config=11.0.3+devuan1
net-tools=1.60+git20181103.0eebece-1+devuan1
network-manager=1.30.6-1+deb11u1devuan1
network-manager=1.42.4-1~bpo11+1devuan1
openvpn=2.5.1-3+devuan2
packagekit=1.2.2-2+devuan1
pcsc-lite=1.9.1-1+devuan1
pdns-recursor=4.4.2-3+devuan1
plymouth=0.9.5-2+devuan2
policykit-1=0.105-31+devuan2
popularity-contest=1.71+devuan1
procps=2:3.3.17-5+devuan1
reportbug=7.10.3+devuan1
rsyslog=8.2102.0-2+devuan3
rsyslog=8.2302.0-1~bpo11+1devuan2
slim=1.3.6-5.2+devuan1
sshguard=2.4.2-1~bpo11+1devuan1
sysvinit=2.96-7+devuan2
tasksel=3.68+devuan4u1
tomcat9=9.0.43-3+devuan4
tomcat9=9.0.43-3+devuan5
udev=1:3.2.9+devuan4
udisks2=2.9.2-2+devuan1
util-linux=2.36.1-8+devuan2
xfce4-session=4.16.0-1+devuan1
xrdp=0.9.12-1.1+devuan2
