apache2=2.4.59-1~deb12u1
atril=1.26.0-2+deb12u3
bind9=1:9.18.24-1
bluez=5.66-1+deb12u1
cacti=1.2.24+ds1-1+deb12u2
chromium=126.0.6478.126-1~deb12u1
cjose=0.6.2.1-1+deb12u1
cockpit=287.1-0+deb12u2
composer=2.5.5-1+deb12u2
curl=7.88.1-10+deb12u5
cyrus-imapd=3.6.1-4+deb12u2
dav1d=1.0.0-2+deb12u1
edk2=2022.11-6+deb12u1
emacs=1:28.2+1-15+deb12u3
engrampa=1.26.0-1+deb12u2
exim4=4.96-15+deb12u4
fastdds=2.9.1+ds-1+deb12u2
ffmpeg=7:5.1.5-0+deb12u1
firefox-esr=115.12.0esr-1~deb12u1
flatpak=1.14.4-1+deb12u1
fontforge=1:20230101~dfsg-1.1~deb12u1
freeimage=3.18.0+ds2-9+deb12u1
frr=8.4.4-1.1~deb12u1
ghostscript=10.0.0~dfsg-11+deb12u4
gimp=2.10.34-1+deb12u1
glib2.0=2.74.6-2+deb12u2
glibc=2.36-9+deb12u7
gnome-shell=43.9-0+deb12u2
grub2=2.06-13+deb12u1
grub-efi-amd64-signed=1+2.06+13+deb12u1
gst-plugins-bad1.0=1.22.0-4+deb12u5
gst-plugins-base1.0=1.22.0-3+deb12u2
gst-plugins-good1.0=1.22.0-5+deb12u1
gst-plugins-ugly1.0=1.22.0-2+deb12u1
gtkwave=3.3.118-0.1~deb12u1
guestfs-tools=1.48.2-1+deb12u1
guix=1.4.0-3+deb12u1
haproxy=2.6.12-1+deb12u1
hsqldb1.8.0=1.8.0.10+dfsg-11+deb12u1
hsqldb=2.7.1-1+deb12u1
imagemagick=8:6.9.11.60+dfsg-1.6+deb12u1
iperf3=3.12-1+deb12u1
iwd=2.3-1+deb12u1
jetty9=9.4.50-4+deb12u3
jtreg6=6.2+1-3~deb12u1
jtreg7=7.3.1+1-1~deb12u1
kanboard=1.2.26+ds-2+deb12u2
knot-resolver=5.6.0-1+deb12u1
krb5=1.20.1-2+deb12u2
less=590-2.1~deb12u2
libarchive=3.6.2-1+deb12u1
libcue=2.2.1-4+deb12u1
libgit2=1.5.1+ds-1+deb12u1
libhtmlcleaner-java=2.26-1+deb12u1
libndp=1.8-1+deb12u1
libreoffice=4:7.4.7-1+deb12u2
librsvg=2.54.7+dfsg-1~deb12u1
libspreadsheet-parseexcel-perl=0.6500-4~deb12u1
libssh=0.10.6-0+deb12u1
libtpms=0.9.2-3.1~deb12u1
libuv1=1.44.2-1+deb12u1
libvpx=1.12.0-1+deb12u3
libwebp=1.2.4-0.2+deb12u1
libx11=2:1.8.4-2+deb12u2
libxpm=1:3.5.12-1.1+deb12u1
linux-signed-amd64=6.1.38+4
linux-signed-amd64=6.1.52+1
linux-signed-amd64=6.1.69+1
linux-signed-amd64=6.1.85+1
linux-signed-amd64=6.1.90+1
linux=6.1.90-1
lldpd=1.0.16-1+deb12u1
mediawiki=1:1.39.7-1~deb12u1
minidlna=1.3.0+dfsg-2.2+deb12u1
mosquitto=2.0.11-1.2+deb12u1
mutt=2.2.9-1+deb12u1
netty=1:4.1.48-7+deb12u1
nghttp2=1.52.0-1+deb12u1
nodejs=18.19.0+dfsg-6~deb12u1
node-babel7=7.20.15+ds1+~cs214.269.168-3+deb12u1
node-browserify-sign=4.2.1-3+deb12u1
node-undici=5.15.0+dfsg1+~cs20.10.9.3-1+deb12u3
ntpsec=1.2.2+dfsg1-1+deb12u1
openjdk-17=17.0.11+9-1~deb12u1
openssh=1:9.2p1-2+deb12u3
openssl=3.0.11-1~deb12u2
openvpn=2.6.3-1+deb12u2
openvswitch=3.1.0-2+deb12u1
open-vm-tools=2:12.2.0-1+deb12u2
orthanc=1.10.1+dfsg-2+deb12u1
pdns-recursor=4.8.8-1
php8.2=8.2.20-1~deb12u1
phpseclib=1.0.20-1+deb12u1
php-dompdf-svg-lib=0.5.0-3+deb12u1
php-phpseclib3=3.0.19-1+deb12u2
php-phpseclib=2.0.42-1+deb12u1
pillow=9.4.0-1.1+deb12u1
plasma-workspace=4:5.27.5-2+deb12u2
pmix=4.2.2-1+deb12u1
postgresql-15=15.6-0+deb12u1
putty=0.78-2+deb12u1
python-cryptography=38.0.4-3~deb12u1
python-django=3:3.2.19-1+deb12u1
python-pymysql=1.0.2-2+deb12u1
rabbitmq-server=3.10.8-1.1+deb12u1
redis=5:7.0.15-1~deb12u1
redmine=5.0.4-5+deb12u1
request-tracker4=4.4.6+dfsg-1.1+deb12u1
request-tracker5=5.0.3+dfsg-3~deb12u2
roundcube=1.6.5+dfsg-1+deb12u2
ruby3.1=3.1.2-7+deb12u1
ruby-rack=2.2.6.4-1+deb12u1
ruby-sanitize=6.0.0-1.1+deb12u1
runc=1.1.5+ds1-1+deb12u1
samba=2:4.17.12+dfsg-0+deb12u1
slurm-wlm=22.05.8-4+deb12u2
squid=5.7-2+deb12u1
strongswan=5.9.8-5+deb12u1
thunderbird=1:115.12.0-1~deb12u1
tiff=4.5.0-6+deb12u1
tinyproxy=1.11.1-2.1+deb12u1
tomcat10=10.1.6-1+deb12u2
tor=0.4.7.16-1
trafficserver=9.2.4+ds-0+deb12u1
tryton-server=6.0.29-2+deb12u1
unbound=1.17.1-2+deb12u2
util-linux=2.38.1-5+deb12u1
vlc=3.0.21-0+deb12u1
webkit2gtk=2.44.2-1~deb12u1
wireshark=4.0.6-1~deb12u1
wireshark=4.0.11-1~deb12u1
wordpress=6.1.6+dfsg1-0+deb12u1
xmltooling=3.2.3-1+deb12u1
xorg-server=2:21.1.7-3+deb12u7
yard=0.9.28-2+deb12u2
zbar=0.23.92-7+deb12u1
znc=1.8.2-3.1+deb12u1
zookeeper=3.8.0-11+deb12u1
