version=0
log=c9e525b98f412ede185ff2ac5abf70920a2e63a6ae31c88b1138b85de328706b
leaf=3191 eb52c7e153663c99865a4b1dcdebd21f6b47c7cedca66a84a8f3011afc0bdfae 4a53c55f525411c86799a44ce8a2dae0d0d2bf89155738a019cb56f539599ed246d8e2fd7f44602c7ca1911b3e33fa03952b2c9e399b297595d590a39379d103

size=284
root_hash=d3eaf5e04cf38ee639d922acb1664528b92c2ecd4676e6ab5b6d5b25fda93f0c
signature=9634bbfc32ac35744eed47c12eb715e6f444d460c51f50f1c752f9e1776bdafc0e144b3bb2dd794bfa25c27e2224108671d6be9117ed47ca0ed29c28a94fa605

leaf_index=283
node_hash=77684293b5f52dabfed4eee27757f9d882189fa67b495758a46d7afd62956a91
node_hash=d6c177757a2c22419ec79e59b64925eb929226e4ae7de406dbd82a315dc78ea8
node_hash=9cc71f041f3ff8db9ebe4e24c29a9b33c0de27feac36f69f2808bc36821a50e9
node_hash=3a924384989d67d9ea8f61229d145ddc4d9eb7938368d3c4e26d1b2bbcc80a2a
node_hash=84673dc3ca1bf1ce1f99ded794694b623bd65ede4635d48e7ee9e3ce18b6bfed
