2024/01/19 20:34:38 [INFO] Attempting submit to log: https://ghost-shrimp.sigsum.org
version=1
log=5955bfe2150ee2e667c4e418228f9ee89835d6990248aad9b39c0e2120c1b022
leaf=3430 eb52c7e153663c99865a4b1dcdebd21f6b47c7cedca66a84a8f3011afc0bdfae ab19a00cf28bb758506008020db81c48bbc5e8a4df01d24d425071b57d051dae060b8cfdd67f7aefd60d81d1cf533d2d126c74d121b68d896874fdc01b3a520d

size=92
root_hash=40fca2f36761d0845f1cfc5e1b5cae582066ef7c24c405bacaf437b2db50a4fc
signature=4a933e6d141c8e9c92b58099ba809fbced69480c66d52568699a4d3573863bfad99cc6e63516673184201a41a631fb614474024ecbcdc513dbea53fdf8a1d400
cosignature=70b861a010f25030de6ff6a5267e0b951e70c04b20ba4a3ce41e7fba7b9b7dfc 1705696590 c0c2829b6ac19887311e6bd1cbfd0a606b5b5a32194c95570ff5c6045d3bf27273963682157b12af35d815079e3be0c39fd153b2d0202906b953d7d305484d05

leaf_index=91
node_hash=9de7da155e83a0117ca51a25e7e0ad78596688178a9e9850d5e7be93df250eeb
node_hash=70c450286c0286f31dc64864c6436e77daa2034256b6c67851500565a1cd72e2
node_hash=7c81595a1f2e80b578836ebcf704b89c0c7b0445f9b2644662656e411df418e6
node_hash=dffad4a9ac601ea7b9fee767ea749ebb2a5db22dbd05fd49b5d93b65a1260a96
node_hash=b131baeb6be8ffcbf698b0b543b7c845e4aff27e52bed352ea333854c26220af
