version=0
log=c9e525b98f412ede185ff2ac5abf70920a2e63a6ae31c88b1138b85de328706b
leaf=522f eb52c7e153663c99865a4b1dcdebd21f6b47c7cedca66a84a8f3011afc0bdfae c0c71f1e2b08ba1f52d06c8b73609d39ee12d7fac78cd674f2d0b580228bc21c212fa005121538ef8a570a297d317183641dd2cbd026722b27a856fa540c6e0c

size=652
root_hash=6ee008068053e4a551d4c26097507f2a1fabcd8a89e159cbdd43b7afcbd93c69
signature=615f459fc67aba4f592952f39e2d1c1d581bd40a7c9270b94904d223fed58b65d420f3a75796a8c71c208cd433653d75ff3617d706540acc1e46152ef89e890c

leaf_index=651
node_hash=e0995fd3ac5b27d2bc105c1bbdb6a32f8925c371c920ab7c8019a27967552b2e
node_hash=172d54556432b633213ff01fc7880d5d5b42ddfbd88aa901d4e421e3585d29a3
node_hash=b9542b6a206de6ebb96c6f5f714f0d3a5d65bda5925007fb080bf58f28056dfb
node_hash=b8a281c8581ff6b997ce8b5e38f34f4aee5c7ce04ed3d53840f5556ca8b28a8a
node_hash=7316738b7ba2a710913418b55f3526e56581f01064468e75660969804d347c19
