version=0
log=c9e525b98f412ede185ff2ac5abf70920a2e63a6ae31c88b1138b85de328706b
leaf=8038 eb52c7e153663c99865a4b1dcdebd21f6b47c7cedca66a84a8f3011afc0bdfae ade50b841e01242100bb876c2f1bfe9b81b551a461a19a7699e32706dd1c1b5d772e878ab9cb31c6b6ef3ef31bdd7360550b23b105a12d03daa5195cd9f94008

size=329
root_hash=6c9e79fcf68d42429b4aa29a65b8c534c87a7a525b82131cd1bef1f447cb0f35
signature=ef3a0f55f407f9d645412acf18117848b67d48538c6c272160c06d379926c2db4c4c9dee06e2bfe7668965a4ccf67fdaf933c03f73a124396470be6105904f0a

leaf_index=328
node_hash=b4beb8bb67665a5e2bc205a6a8852ceb33503952e3bcfae510f5dabe0dc8c4e5
node_hash=b395b64981e4af94d37a094011459923222be55efa4aafe4dfd84da8c4a800a7
node_hash=84673dc3ca1bf1ce1f99ded794694b623bd65ede4635d48e7ee9e3ce18b6bfed
