version=0
log=c9e525b98f412ede185ff2ac5abf70920a2e63a6ae31c88b1138b85de328706b
leaf=4d51 eb52c7e153663c99865a4b1dcdebd21f6b47c7cedca66a84a8f3011afc0bdfae 0f0f37009a8b73f7893fe4541c6dd9767ca859b2b7e3f953268d7ef9163301b007620cdebbf45bd3d2f8bbef0ec6719e2cf017e2f3c14d9ea7c8367dbf399808

size=1212
root_hash=b86cdfd0f238a39e5e8976c16ffc062c78a6f9b8b29116f6c705f9454c280cef
signature=159353392a2ed12ea2c474d28cc0ce2a4fdf225e8977eba9334071a55531763a80e355e10f9ed6f30289f8568ebe8cd6bbfa900e7d540263513e3d0e0ec5bb07

leaf_index=1211
node_hash=90f4d79523e773e8ce546b45fb3e929f9e17c124f07b0529401e0f2b30e640c7
node_hash=08757bc3e5a245c6a6233322bfa091e62d001f8709cdb0db93b5f9f5fc760a0f
node_hash=199baa7b3a1e83d0396f96b76898bbe679f87207ffaa19c48f648d6fc9685a43
node_hash=d3f37d283ed1bbd07419b3c637495b3e998bf3cba8043064999bf1536b1e36c9
node_hash=321412784223d2fa77d609fde30eb2632b0536eb3c9f1dfd25208ab5203c63cc
node_hash=335c10aa94ec8dca25233526069f1ed527ef80d832add6c71c76e6b235027cda
node_hash=f083a6caeb32773e7b8928d77b26461fabdd70a89b9a6973c50864c50f531fe7
