version=0
log=c9e525b98f412ede185ff2ac5abf70920a2e63a6ae31c88b1138b85de328706b
leaf=b006 eb52c7e153663c99865a4b1dcdebd21f6b47c7cedca66a84a8f3011afc0bdfae 8be5bd5eaa59cee179f0ec91317d6f5520a04b0de262fa4386442372ec0ef64b9998dcd81c473c98df110f6b085c267482c03780953b8ecea55e0c586498cf0d

size=529
root_hash=1d8f748f123d6f2b595e3f0dcb04ea4886d2f30e80ba29fa5db969ebc4b3b46f
signature=8338809105e3f824e4e348aa9f35da051b32f2c6574412ac29bf28c84a0013f01aeceaa952b417614cedec43812caac375695d4ebeb1e725c02a43c2e0e4b703

leaf_index=528
node_hash=ecf86aae6414e9fef6c19262d90e461fa4411589958247a0995b5a838bd51678
node_hash=7316738b7ba2a710913418b55f3526e56581f01064468e75660969804d347c19
