version=0
log=c9e525b98f412ede185ff2ac5abf70920a2e63a6ae31c88b1138b85de328706b
leaf=5a56 eb52c7e153663c99865a4b1dcdebd21f6b47c7cedca66a84a8f3011afc0bdfae 0487ccc2b59ac3e5576313d547227f30e9c2159e539ff2fdbc5f82102a1d4d67e010427cddefd17e1415ef225d2759f1a6c3d65c56994f81ae7a0b5da346370e

size=193
root_hash=b1d838249378ad598158acdbaa20799a496e5abcb072514f15a2500b1460aa85
signature=881424e0d70f5bfb09757140b124fc4d2f964129314c8e9a40b38193254c7cfe6e2c4d20a5b2d0b05335bda38ee703d8f4e9ef147b5e03e70eac266953f9d40e

leaf_index=192
node_hash=7564f44f3b022736c6b745550a45ddbaa7e3f86114a77121db392847944cda9d
node_hash=d018d40d5de4c4a9bdee519600db2e944cfcc0601b6383eb58a54cb17b00de3a
