version=0
log=c9e525b98f412ede185ff2ac5abf70920a2e63a6ae31c88b1138b85de328706b
leaf=7aa7 eb52c7e153663c99865a4b1dcdebd21f6b47c7cedca66a84a8f3011afc0bdfae f458a8212f68e8383ba3a4c762fecb913a2b438b9a811d0a489ca9b995a6f462d67c2b875d22fcdee46924287d6fe52abe8cfe476156d9bb7913a6c1e342fa0f

size=776
root_hash=fb0fd0e1cac976c86220570f51b04b2e668505c31ea46d1e9383575f393f7e68
signature=a9b80d21ecb4a9e287c83441217ee4a28aab86a18aee1cdf7a695b7a25ff19a9458f9fe1ccc19285f8bfd1631e0e77a7728183eaf6367b6fe7b167c171b40203

leaf_index=775
node_hash=2eaa69a7afe17a09af3983666e07e21419d34ec6daa529142d9b634a38931f1a
node_hash=bb40b039bee2fb655f01dff5f0a99a7f3383aaa7a4d4a1becdd70af096990210
node_hash=b67615916c45175fa9dde31e26dfbbdede7ba6fa7f106f8190ddf7d0a4da10a0
node_hash=c0f42f84b4da630a133eed2df5cb4497f864a6bbb2cfeacc5bd4c2dfff6bb791
node_hash=7316738b7ba2a710913418b55f3526e56581f01064468e75660969804d347c19
