version=0
log=c9e525b98f412ede185ff2ac5abf70920a2e63a6ae31c88b1138b85de328706b
leaf=13cf 4f313845ab7b7bc4592e437869e838fcccef45b402bd970f8aa2628ec17ef5cf 8a56e75809c5e20b829c448b2508ada1f7a4503da4fd1ec93ab0a7eb6c9e808118a808e7dbd098ecaa69d058c0de4f052c9b4d7551111a4ed3b81645d5be4103

size=25
root_hash=c3e93d4c6b155c9b167e955cd7de5275c1621d9b4fac2931bd6420351d7d50a2
signature=a04c8b0f1cc658145831fa0d8dd58b438f6783f553fc1d2b44604a2caf81148a599abb891fe5a2b66da672b3d141f4f4084d6a060af2c15f012af531cf951003

leaf_index=24
node_hash=14cacced80805ffc81ff45f422a60ac4c32b990d610fa27c38bec61e3caa65fd
node_hash=21409606d488b202fc31ae03a99ef0bd68a9682fdc4f5033a7a38a982951a54d
0.05user 0.01system 0:00.07elapsed 81%CPU (0avgtext+0avgdata 11636maxresident)k
0inputs+0outputs (0major+1857minor)pagefaults 0swaps
