version=0
log=c9e525b98f412ede185ff2ac5abf70920a2e63a6ae31c88b1138b85de328706b
leaf=9abb 4f313845ab7b7bc4592e437869e838fcccef45b402bd970f8aa2628ec17ef5cf 7955b6b3c77ad62096bb10d23df10031675c12417ecb8f416ea049e31bc6cc3f8fadbdf503eff12476c7aa2744c1294b0c126b5d5ed42c2585e23c7d49a10506

size=116
root_hash=52225b60761549916412ec2f5f57387d7d3e413c950969a7f3dad1b074a81b92
signature=ed0d2b1ee4296983495b8e7224476c6ecbde401cd48046d5176f2fe389e71237ab3a2af893aaf8666fe730923fed02bdde9eaff35f42e47bb6ac160a043a960c

leaf_index=38
node_hash=8e811b161983f51e8a13a3a63d2509209191be7ad2aa3dc91ab3a2f5a677da26
node_hash=4a9abcf1f1a5bacde514b34348aeb07f46b23e871f6d09ae5c1effba69a30017
node_hash=d75a6c17af64a3ef05cd3c8f35a2bc242107d8f933865ac0127452229ef1f94c
node_hash=27f1b87468227d07757dd2a32989b58b216baf91f3f49dde14b011138fdde110
node_hash=afb4f3ea87a365333051fb83bfe3d1183800aa7ef2e140f0fe5adc68609fb124
node_hash=69809ba9446167b31dcb93672beac0906745ffeb45c0b27baa1b70cc669c9899
node_hash=432b84882dc2eccbdad4f8d9d130ae813550a38627c356f9443c47712b741ee8
