2024/01/19 19:46:38 [INFO] Attempting submit to log: https://ghost-shrimp.sigsum.org
version=1
log=5955bfe2150ee2e667c4e418228f9ee89835d6990248aad9b39c0e2120c1b022
leaf=3a65 4f313845ab7b7bc4592e437869e838fcccef45b402bd970f8aa2628ec17ef5cf 6eae3610c4e86bfac6231ca7d82cfbc516636de171779f66f060790a02f3a445c8da756ab4ad22bb90b0a6456eaa44fc3abcf110393742b62263eb437b3f4d04

size=25
root_hash=730ce462aa4cb8b1fa34c2e400a18c075159d6aed306803edca618c5c22e9439
signature=da9483c818e77e8f21bddac5ed6e8baa447b8d3af8d337653443734b60f437b912c466710b5dc7e89f97ee90a44af63256c7d513e94f2eef4f81004e2b292603
cosignature=70b861a010f25030de6ff6a5267e0b951e70c04b20ba4a3ce41e7fba7b9b7dfc 1705693712 476b82cb5aba61eaf48d3d5c15b96f790615eebbb5588f83cdae482d16954d7f1f35fcbfbc255d090214c2c529e1d29cc23b10764f839368298afac10b82e401

leaf_index=24
node_hash=16e415814aa62b1eb39a62985b126ee2cc818be408b2ea497927e19347f89345
node_hash=7b7f715c37c43a50164f585ba31c111e409074cc8a8dc8f51415587efff3dc57
