version=0
log=c9e525b98f412ede185ff2ac5abf70920a2e63a6ae31c88b1138b85de328706b
leaf=f086 4f313845ab7b7bc4592e437869e838fcccef45b402bd970f8aa2628ec17ef5cf f224000493cce29d4faa6f7db29374e7146a637535e82bbeba3d5d850385287e7a8dac16c6e66f342f7743633478a1b594fc5a4a72f8c3e4e788cea2c2b7aa06

size=658
root_hash=6ae602bf61be6c27869a34475a4fa0744ed35421dccc17bdd7e0ecf877c9850d
signature=e0ec0fd678cc8bd34c38f2088ee9d807faa8946797511fa96a213929cb1c28f5569e54453b706abee448a18a1c30ea61e941645c3e4b8300a7762b46b9bc3a00

leaf_index=657
node_hash=3e44fb930318bada2f2f9c1fa990593e2c251973dcac6ee65f0e2d4de8077252
node_hash=870ef7e121bc7ca9faba17ceb5f204da347c6111315d21c3b9dd437ba5a033f8
node_hash=b8a281c8581ff6b997ce8b5e38f34f4aee5c7ce04ed3d53840f5556ca8b28a8a
node_hash=7316738b7ba2a710913418b55f3526e56581f01064468e75660969804d347c19
