version=0
log=c9e525b98f412ede185ff2ac5abf70920a2e63a6ae31c88b1138b85de328706b
leaf=964c 4f313845ab7b7bc4592e437869e838fcccef45b402bd970f8aa2628ec17ef5cf 2b8ccebb2b74cf99c68b8c3bbbd995b3cf1d3ac8be163e5ddb13c717dc2defab633d63aff28aba4fce101c3db2800ca0679ac21d774c6b1b30c8cadd9c3f1801

size=27
root_hash=439b945131f29e84d28089d997d9b0ad8711ecb0c7caf511709077b25988cee4
signature=928bcb0f4ec6480841e8cdf5f9123a62e8b81722c5993b102b9987184438ab28a58249943d93ea6e7bb6a9eb1267ab1ca8b498f9131d587463b434af1b2bb209

leaf_index=23
node_hash=174909832e7444448848ba17645d00c8dc6abb14981a2bd797ad5e6f3ae1fcf3
node_hash=40bf2518a271d36a500a512406c528cd154ca2286f573d9a247d70a692f87517
node_hash=263d97cb83a4bc6ae599691c52e4b88c05d46ab2e4e85fdc0327f48448bba82a
node_hash=935dfb1ca4b300bcaf4c4d0c168d64991a921408e9c99a1624734bddcf785577
node_hash=21409606d488b202fc31ae03a99ef0bd68a9682fdc4f5033a7a38a982951a54d
0.05user 0.01system 0:00.09elapsed 81%CPU (0avgtext+0avgdata 11544maxresident)k
0inputs+0outputs (0major+1822minor)pagefaults 0swaps
