version=0
log=c9e525b98f412ede185ff2ac5abf70920a2e63a6ae31c88b1138b85de328706b
leaf=5193 4f313845ab7b7bc4592e437869e838fcccef45b402bd970f8aa2628ec17ef5cf 48e5be4f1587eb610371c59ad0a5546239316c410d9c2a13fbafdc1681c42f6d07ebb22bc69094e91f43c941ae31305fc45c58cdb86c1cadc64d48bf64411905

size=347
root_hash=d0fdad7538a7ec7b4833882785f8ba2197656c56748b32b178cf7abb77ef9c9b
signature=2948380f81cf889cf4c01c37943ac08d8700afc045f743702daee81ea3ddb1afe4c2623f5b77e858ecc42fbf850e0aeb7a54878ef6cd8f569b5586a7580e7705

leaf_index=346
node_hash=63aefdce5e2864f9d48e84c46b6eb60526433141a8b09b2022ee5de4c1f6a968
node_hash=2122e121a4383d035430656397c36d6633836aca5aea24ec7a401aebbd0d932a
node_hash=3c76f69170a22b18fabc451ee43deec483963d7ff60c1807ffd0eaa35d6ded9d
node_hash=b395b64981e4af94d37a094011459923222be55efa4aafe4dfd84da8c4a800a7
node_hash=84673dc3ca1bf1ce1f99ded794694b623bd65ede4635d48e7ee9e3ce18b6bfed
