2024/01/19 19:44:10 [INFO] Attempting submit to log: https://ghost-shrimp.sigsum.org
version=1
log=5955bfe2150ee2e667c4e418228f9ee89835d6990248aad9b39c0e2120c1b022
leaf=acd1 4f313845ab7b7bc4592e437869e838fcccef45b402bd970f8aa2628ec17ef5cf 3ab1e030aea7f1576b79dff631cbec065c641a7ed037a5b0a8b6e682e2b2e829b30b4acf6c801f324177e18306a695dd54f31bfe3358cd151620ee1a5fd6ca0f

size=20
root_hash=b02771a5f8cce6141de2247557a9479b1c274e008bf7ea2b3e48dba5e71a9034
signature=f8f772911f445cd39c05631c04457479598873137e5b2ca6d658d40d04370ffb217e2eb35de9f103071aff86b18d7f521dd9b183d8051ee94def8afe9494b70a
cosignature=70b861a010f25030de6ff6a5267e0b951e70c04b20ba4a3ce41e7fba7b9b7dfc 1705693562 140a83ee14ef68569e57dd1b776796b9c24dace37bd404dbd2fb9f59860ba6102c110ac42eeccddd907553ab011e570984b6ec932bfac7641db25bb6b2af2506

leaf_index=19
node_hash=6a703b68b08c13779f88ae994d3bf1ec0f8057e13a5ea27ea25b7e03e0ad6d41
node_hash=80983e165a4ddb4cf596d1aa14bd0dcba93f0bc14d2204577b7135a18c991dfa
node_hash=7b7f715c37c43a50164f585ba31c111e409074cc8a8dc8f51415587efff3dc57
