version=0
log=c9e525b98f412ede185ff2ac5abf70920a2e63a6ae31c88b1138b85de328706b
leaf=d6ee 4f313845ab7b7bc4592e437869e838fcccef45b402bd970f8aa2628ec17ef5cf 9634e5c6557d5225ed17427cb9d08201cb2c47de0f54c4ec582cecbaf4ff66493413ba587c30e58f9842f41dd3bf1fb5e1d9d7a9ab79fd4ebd153ff373dab204

size=25
root_hash=c3e93d4c6b155c9b167e955cd7de5275c1621d9b4fac2931bd6420351d7d50a2
signature=a04c8b0f1cc658145831fa0d8dd58b438f6783f553fc1d2b44604a2caf81148a599abb891fe5a2b66da672b3d141f4f4084d6a060af2c15f012af531cf951003

leaf_index=12
node_hash=5306aa0ffe275f6113e8bef5888bec8605c1480c57b299ea8044b672dc290c8a
node_hash=4987403967a4ae7ac7ee13b9cc8687fda5c2deb01aa4dff371e990f1f59abb0d
node_hash=63cf373654379e26ab7e7b82d7c51f9fa845e172be36c9c2ff7b5c59f1ebcd48
node_hash=ea26ae3f8b66e825708acf7db14144bf907267f8bcb05109d96fe57e0f8a0d69
node_hash=34bd5d1d088c611ad93d3f13a9279317b38c66b0ae1e82a6689e2f376b5b378f
0.02user 0.03system 0:00.09elapsed 65%CPU (0avgtext+0avgdata 11408maxresident)k
0inputs+0outputs (0major+1772minor)pagefaults 0swaps
