version=0
log=c9e525b98f412ede185ff2ac5abf70920a2e63a6ae31c88b1138b85de328706b
leaf=1b65 4f313845ab7b7bc4592e437869e838fcccef45b402bd970f8aa2628ec17ef5cf e408ebae184b5afee950283b37d39f9b815fcd955c63d1e36e3b7d7a83f0395e3673a000194fbc4ae179779947d76acbaee236df2988f6e29e62e8475b61d605

size=1084
root_hash=1ddc4d67122b1e339e6b3a5a5f59512e4fa60ed7f9d6ae0557ea82f75c295dca
signature=8c83a45fa0a1e1b6d0cf96dcb246d103e010a2148fc6f1fecc63ab688263769cd1e570a8baf9b88a1ba8c63b8333069c5c461ee342bbfa931fe3a20f7e6afd02

leaf_index=1083
node_hash=5bd4f08f003230e7d20aa2954ef72cd34bd2b5c35fd51b504421345fb94bbc58
node_hash=42b3c118fc90bd1babad32d4c15fdafe96ab877a986ace022e12c84b7a8f7f12
node_hash=e5e6deefffa139112c56ee6477d2e0f1bf465beb77a93c134c49d89a9844f79e
node_hash=92f93e0c3882dcc1f488cb1a0de8fcdbd77314b8117c9fbf0b7a44824384b8ad
node_hash=6f0f347609df2c827d76051731784046d6da8100b75505a10c8cad8f75440216
node_hash=f083a6caeb32773e7b8928d77b26461fabdd70a89b9a6973c50864c50f531fe7
