version=0
log=c9e525b98f412ede185ff2ac5abf70920a2e63a6ae31c88b1138b85de328706b
leaf=143c 18d618c493b6192db36a03cc04fd86773cceec52ff5a629b704af1a4f3d555ae 41559e622073cab22dd992d58fc48d353be03f70dea7fe49657056a57b63209ca9289050bfe633ffab49935cda33e8f826659a439a75e5b6ed61519ecfcfbd05

size=43
root_hash=08e86f6909b72ce5d2c743e7dcecf94d88809023dcfe5b21835af452743e7f70
signature=f09b5c83b2ed36cd299877634aa399e403f19b6679e87a0c37d78d499c0a29ec837d65375c1d405b54a0ac238446c14e094abd93163ba10ea84d7bc082fd420d

leaf_index=42
node_hash=b1a587ebd3c71369587fb6b1c86d890b876810be39b2fd02dc3c1870624dfec1
node_hash=f7cea1adeadad621660bb9cd3e9b94e6e40f298077db5c9a9b0abc0c43448186
node_hash=69809ba9446167b31dcb93672beac0906745ffeb45c0b27baa1b70cc669c9899
0.04user 0.02system 0:16.21elapsed 0%CPU (0avgtext+0avgdata 11616maxresident)k
0inputs+0outputs (0major+1817minor)pagefaults 0swaps
