2024/01/19 21:08:38 [INFO] Attempting submit to log: https://ghost-shrimp.sigsum.org
version=1
log=5955bfe2150ee2e667c4e418228f9ee89835d6990248aad9b39c0e2120c1b022
leaf=79b6 18d618c493b6192db36a03cc04fd86773cceec52ff5a629b704af1a4f3d555ae 947df37b4cfff5526bd52847e8b7b79d825d2f9b51e258968c9350b35c2c5d41a01165f6e97fe4f073a2909fea98628a726b3c815d6bb13b83ce8ad1bf3ec305

size=135
root_hash=0895069e4b37cbd74124e9a8e493165c343edce7355dfa98441499ab45cb6045
signature=c773ad2391eae493029682c46ea9d44246537e6a3e7c37716afe96f3195d8a30e60d47dc8d38b7a6b38aecd48c2c155a46db021912274f8aae2689ff6c11000f
cosignature=70b861a010f25030de6ff6a5267e0b951e70c04b20ba4a3ce41e7fba7b9b7dfc 1705698631 5b0be7b3ca14c8fb4cf36e20c9f22dbe909253baab2dd860bbda351d46aec77e42664ba3f540fcb849098f8dcc5f8a69d9777270b2942d019f4352aa76defb07

leaf_index=134
node_hash=946cd1f8cdfa42a4fb4ee12e71854ce3f6ee7bdb89b0b6b751b5f726f721d7e5
node_hash=a93c106c265ed56bde17f307c1a9e317d248adfadc9b0e2f7f43b3c7af568544
node_hash=73f7066de4988f363c1b8d1ce9ee479c7ed1242ff699bf885c6b6cb13755d0b6
