version=0
log=c9e525b98f412ede185ff2ac5abf70920a2e63a6ae31c88b1138b85de328706b
leaf=551c 18d618c493b6192db36a03cc04fd86773cceec52ff5a629b704af1a4f3d555ae 80f1425e669f58ac7507d97109e705cd30e301b04589da1d5093622e7efea71ec79d44bccb9abab2f252c92bec655cb455de97e562da141b089334575c88df08

size=1228
root_hash=8558460c1fc23d82cff81177076dbdf47a5e456fa5678f45cce2fb7c1abe5a5e
signature=44a0e04b61d8f47f83a2291510248d5488054a0b8c81d04fdaf295199e7b28f98264c371ba4b875a6b0c3575eafffc7caa9f95e2430d1306c646364eaedff504

leaf_index=1227
node_hash=e5c446f44a8304b62fcfaaccbced0cad2af24104c308cdad272d7ea343233057
node_hash=774c0b603caf82dcb7f6b2898292943cbf3e9e05725bea8ccbd5fe6cfd1e4c76
node_hash=65facf57ea39e64166a20c3c022ce574658a2bfda4249390e5952ede3a8bd645
node_hash=39925424d8734aee941b60ef2e00421213288f8d30fd4a12f6060b7e1fe824e2
node_hash=335c10aa94ec8dca25233526069f1ed527ef80d832add6c71c76e6b235027cda
node_hash=f083a6caeb32773e7b8928d77b26461fabdd70a89b9a6973c50864c50f531fe7
