version=0
log=c9e525b98f412ede185ff2ac5abf70920a2e63a6ae31c88b1138b85de328706b
leaf=20b3 18d618c493b6192db36a03cc04fd86773cceec52ff5a629b704af1a4f3d555ae 06de6c678e93b836623ca6f8ec068394ceb976adf5fa7f35b188f6923019625ab2b6761253f4f57a7fbada9bd17296b32a5dbc30941f0969e87863ab06e5e102

size=513
root_hash=a82441b0c03e11112ffbd645165c1cd6512dbf1592f427163185ed815a0da607
signature=81460c9de863e5db75e75fd90db634ebdbfcb187274b9ba9447ca42bdd125a653c7eba48497bc7bb9fbd3bb33f26b8fb4ebfca1d9b2a3234437d018c8ba38003

leaf_index=512
node_hash=7316738b7ba2a710913418b55f3526e56581f01064468e75660969804d347c19
