2024/01/19 21:09:39 [INFO] Attempting submit to log: https://ghost-shrimp.sigsum.org
version=1
log=5955bfe2150ee2e667c4e418228f9ee89835d6990248aad9b39c0e2120c1b022
leaf=684b 18d618c493b6192db36a03cc04fd86773cceec52ff5a629b704af1a4f3d555ae afca99e550b56d86e94d801c79650963c56bf7de91d34f5900273b472841100e0145c47646f9038cd3d0f9cb6785b25cd0006dccb537b9f4f1f12fb523782d0c

size=137
root_hash=833f438bf9564b2d2a82d83118d8b28a0c6b7fb04f276a2f6a539a02686b0c88
signature=202ced4af973a62707729a5e06feb76a27e9b7989bf8f1599492ad2751be13e045a118625b9af0d21371d86ba1930a31ebd37368a79729780c0744c30599fd06
cosignature=70b861a010f25030de6ff6a5267e0b951e70c04b20ba4a3ce41e7fba7b9b7dfc 1705698691 af4bd36cc940dff16d22959b08f47670a1ac3084dde07896cf5796bd95689f2c453a698d6838142fc4a6db2606104bc65cb25b63ac22e274105379d055ee0103

leaf_index=136
node_hash=97a80493b52f9034b410f455514096aa0646355e1e27c8d370ddfa9580c34c5c
node_hash=73f7066de4988f363c1b8d1ce9ee479c7ed1242ff699bf885c6b6cb13755d0b6
