2024/01/19 19:57:39 [INFO] Attempting submit to log: https://ghost-shrimp.sigsum.org
version=1
log=5955bfe2150ee2e667c4e418228f9ee89835d6990248aad9b39c0e2120c1b022
leaf=0e59 18d618c493b6192db36a03cc04fd86773cceec52ff5a629b704af1a4f3d555ae 07c2dbd65f6627dfa2c395ea1a356df97a201eb4eca774a577dc5c2a389a009d7fb94bdce9fca4f9b10871cdc22b8f2701f236b0c84a2bbabeaf2c33af9e820c

size=35
root_hash=9b69c39a91f0c9f512f792b322d962efaf748476d8c8a3db123f185fecd2c292
signature=d53924a727d4752f239cad30d2b361d23833df22f42a70925092a3ed8b3312259bfd2a50d42cd3709473525cd2aadf6fff529a5e2ad22f84d9becfef720ea503
cosignature=70b861a010f25030de6ff6a5267e0b951e70c04b20ba4a3ce41e7fba7b9b7dfc 1705694372 2e90f3db3c1378c0889241b2f5af45de4a1442ffb4fdaa11d15d05b5230af575c24a0c20cfd74629b6ba0ee57a1ca01a7987bab981d8b6e2a8c079cb13dede02

leaf_index=34
node_hash=d90166528e34afd4fe5e3f0068b27e90feb5da8df25e8422a04815be000c7970
node_hash=b55126b894778f90fb1e07ea517aac3e11d7a904db51269ec36499f38bfee9cb
