2024/01/19 21:04:09 [INFO] Attempting submit to log: https://ghost-shrimp.sigsum.org
version=1
log=5955bfe2150ee2e667c4e418228f9ee89835d6990248aad9b39c0e2120c1b022
leaf=f11e 18d618c493b6192db36a03cc04fd86773cceec52ff5a629b704af1a4f3d555ae 9e5f5ef6a8918b95d7c7a5cf74d886c9f69ed48b05607a62227c1ec732ee6409f748740ba906385e25a61936c411bd54d7ddadd584b67e7a657d94fc9abbd806

size=126
root_hash=5287facbee4d7b15f08c04ffa3406d3648f06c7c63e4dffe0b616cb6a760c2a5
signature=20753f74049e3add0695c5bdcc53c046e9b66a82791ddd700c853b79cabdda13cb757f61edb6d4c2e4c88e591fdfd291e5be6b7ef929c7c511e4525bc500b80a
cosignature=70b861a010f25030de6ff6a5267e0b951e70c04b20ba4a3ce41e7fba7b9b7dfc 1705698361 25c8ddf032e892a617c0f06e65583d362b27a123fa176d1dabe49f6d8a369335566b4853d0d3566b8698629e347054ea766562dedb5b66b68f59aa24ae172307

leaf_index=125
node_hash=f344f7530f13277c1abc36b4a53184cba6cb63c5b2540cc873578f3c232094f5
node_hash=5ced6a54595065426e357975d15a87885809d2191e49f39953d5b0e650113c06
node_hash=ca4ce6913cb1124f9283057459b86c04e75a6fc6e6c91a25374e077ff576f2a7
node_hash=f2493e7f4db318ea950b6ae8333ae0b6a8ba3048d3c5c588e9b379e25e8d080d
node_hash=80563f2fb8635639c64e7f74382dbc5fb2b1aadbbd52b209090b2f4e135dc880
node_hash=b131baeb6be8ffcbf698b0b543b7c845e4aff27e52bed352ea333854c26220af
