version=0
log=c9e525b98f412ede185ff2ac5abf70920a2e63a6ae31c88b1138b85de328706b
leaf=1477 18d618c493b6192db36a03cc04fd86773cceec52ff5a629b704af1a4f3d555ae 6252f2fbc5f8124017590ff6f96de82e3ccd3ce33940ffe7f4b565d361d90ab5a3ed1783c1d92d0cb378b733afe07a0079610f206c48f66ce512cb9417aa2400

size=497
root_hash=e162ea2d8dad68ff3a96ad5176ab51f0e094473092068eba5be8f959f3aa1b90
signature=3b0b794bdb95f71f6b48accc55b8aa886f739ece81b5d1417cb998abe9ed37452af3b7fa37b3ee4ae4253d5ef6829ab86fbcbbb23199da0dc415e5723f75e809

leaf_index=496
node_hash=104c7a14b814bea2dd98e4f61810ee37d8003b0e3bdc643bfe66513b0317413c
node_hash=6005035afbb5b527351c813358c8b2c30fb0910abf255067b03df2a3e30ad4a0
node_hash=96c8f34f2d27c8baccbe69a686d7d8cfa41d55c3ff8a1d534ca881a00c23c009
node_hash=33f4151aadfa95c4002558b0848809017259f88e97e991287154025ef16673dc
node_hash=84673dc3ca1bf1ce1f99ded794694b623bd65ede4635d48e7ee9e3ce18b6bfed
