version=0
log=c9e525b98f412ede185ff2ac5abf70920a2e63a6ae31c88b1138b85de328706b
leaf=d07a 18d618c493b6192db36a03cc04fd86773cceec52ff5a629b704af1a4f3d555ae e2727736981c36e50b8543127257ac9e378270a7328ffe9dbb61d0c9a9037dd8c0949cb977ecd42eb9cc580caf953c0dd8379ccb5656a37d752cf8aaf94a450c

size=157
root_hash=1a266ccb7659d7ff0b4fac830561a3a481780684e2e8584073e6307cdc0c5ea9
signature=bf558238502dc285c41ec958c500b4a531dd5cd17ae5dad3580383d8a8704f57b721f15d7f79b52a6f0e1c23929e88dca153b1fb4e461206996bdf3fb401160d

leaf_index=156
node_hash=bb89422ee465c80cb97a0164fc8674ed7b74aa7f86f3d7fa5c1fecae7e6c345b
node_hash=600880bcc66ec9792746ef648430d5a8b12187f464dd6361500f6d1d8279965d
node_hash=d860e970c75158e606108653d794e85be52813337a295b80eb05e264a10f676d
node_hash=d018d40d5de4c4a9bdee519600db2e944cfcc0601b6383eb58a54cb17b00de3a
