version=0
log=c9e525b98f412ede185ff2ac5abf70920a2e63a6ae31c88b1138b85de328706b
leaf=fa13 18d618c493b6192db36a03cc04fd86773cceec52ff5a629b704af1a4f3d555ae 73cf5d8d0717b33a2953b0f54aafd9321e37b566ef7af2402a4030f14cebd9242fd7b7e6c6198cbb0947b062969a1762ce75de0394be2a326d676340d0286f0a

size=271
root_hash=d64886ad4196514bc11e8d4e858304335a53b9a40ab4cc7d31c5287493ccd37d
signature=3042aafe341354f11f9b66841e2d69048efdce733a285a9bf5deb5e68a6b973b97b286554f1c843cc4bcbe5a40729d956f8a3c9208d4d70794567c2f5a0f1308

leaf_index=270
node_hash=b17f32b3c3b0d45912157ad9ac899824caf4f971a0683ca8f5eaaa8ca5fbeec3
node_hash=8ad2502ce2056c7ff095c536671db22f7fa92a3d3e80c1fa691e185870a5b679
node_hash=25191be85bdcc264ee1d74620245d3617f1afa3ddcfc3521bf7b530db238f4cf
node_hash=84673dc3ca1bf1ce1f99ded794694b623bd65ede4635d48e7ee9e3ce18b6bfed
