version=0
log=c9e525b98f412ede185ff2ac5abf70920a2e63a6ae31c88b1138b85de328706b
leaf=0db5 18d618c493b6192db36a03cc04fd86773cceec52ff5a629b704af1a4f3d555ae 215d8639d64441816b42a7e07386b7aba9e42ac63c9ac0837fbde64525f1e683ec4e76f3be2c21d017f6f1d999f5348379f2195b614b84157f4866ced89ca609

size=810
root_hash=4b3f98edfe5a22ba80f04b18c0ecf2a4c7e58efe52c406896462bf299b995be4
signature=33db736af1735c47dff2633f8e05cbc621421ec928f3f612eb1e4a891bdafbd6bce6734e38fa03a22349d5a54eb0b6869076ea99a98a7aa7a22d506b857f080a

leaf_index=809
node_hash=8257244e3f55d6babb095c2c6fde30ed7179969f43fc002ace8479998cbcd009
node_hash=344213dfe4ea13698c080c9167bebaf1b1f6897f8f26d76368f054af09620685
node_hash=ec0a5a81f424116036866941de1e909ec110e271e7d2d34b0ee249c08302b11e
node_hash=c0f42f84b4da630a133eed2df5cb4497f864a6bbb2cfeacc5bd4c2dfff6bb791
node_hash=7316738b7ba2a710913418b55f3526e56581f01064468e75660969804d347c19
