version=0
log=c9e525b98f412ede185ff2ac5abf70920a2e63a6ae31c88b1138b85de328706b
leaf=7bc2 18d618c493b6192db36a03cc04fd86773cceec52ff5a629b704af1a4f3d555ae f964a50e42fb80ea13a393a404a074cf7983c007cb34b579713813f3b15c8f038f1c5372e83a454582dd94c94254d91703de6165a1a70936db1f6114a7b2f509

size=702
root_hash=be2fe86227889e5327e13f0fb4478382dbcd71ff5f6f5f7463b718ebd9c15d2b
signature=48c386d37b81598b40b51ad18cfd464400799c8280f5af2abc11e58482112c2f5644a9213cc7ab95bd4fff14bc1abdf5cb8617d31018ba0f209c5034b9276608

leaf_index=701
node_hash=e123acd392b0787f7849ce8d3b47451e8c959f8d42bd27ace1e0e895c938fd18
node_hash=e22e12a4ea3a088d34f2b0e0a48ea7f1824c8e24eec8e9ab954133db1d9a5b72
node_hash=6d46ba966ca9ec72aed7e0b160b5981ef8ee3acc3cbf62f3a908d894ea5bc596
node_hash=45842c7d19bff878e8f36d4be735304a152eb3fd12e66c8b5c31a7f450325535
node_hash=e1145763ffcce77ae4a34b631e442dc6f34bdf97954a75c7ea8a2f1098c6dbba
node_hash=b8a281c8581ff6b997ce8b5e38f34f4aee5c7ce04ed3d53840f5556ca8b28a8a
node_hash=7316738b7ba2a710913418b55f3526e56581f01064468e75660969804d347c19
