2024/01/19 19:59:10 [INFO] Attempting submit to log: https://ghost-shrimp.sigsum.org
version=1
log=5955bfe2150ee2e667c4e418228f9ee89835d6990248aad9b39c0e2120c1b022
leaf=c288 18d618c493b6192db36a03cc04fd86773cceec52ff5a629b704af1a4f3d555ae 60721e18ce93b0979e0d70949355c65055867fe210de6d1b6dd8d6305039116d2a7bd8c4c92d55cf65c503deb50e7e878b938067ef13774347995f79314a4f05

size=38
root_hash=916c1bc5ba0ccf610ad7f4ba2e6ea5685759bd10f992c11b720bcd44d8b309cb
signature=c041711e0685ded888f261594bd11287f62bc91add8b61680979bc00617521bb6e2b153685859e1818c306a0f83cb48d94aeb932f2f242292e073a58edd94801
cosignature=70b861a010f25030de6ff6a5267e0b951e70c04b20ba4a3ce41e7fba7b9b7dfc 1705694462 fc5ccce4771d4ca89ac117bc73706d04c6ab238fba212ca948eb8f62ce9c8da925089f4b7859de86f414fb21217e8ed6471db4f98c61df75ed1cbe642a0ae402

leaf_index=37
node_hash=a8e6fd456083eb924220c031fa57febd542f502e6c448066ef4cdcbf93186103
node_hash=56a81f3ea0536526f66fff83d56a05c763eefa5f14f6128e758cc943558436cf
node_hash=b55126b894778f90fb1e07ea517aac3e11d7a904db51269ec36499f38bfee9cb
