2024/01/19 20:01:10 [INFO] Attempting submit to log: https://ghost-shrimp.sigsum.org
version=1
log=5955bfe2150ee2e667c4e418228f9ee89835d6990248aad9b39c0e2120c1b022
leaf=86ab 18d618c493b6192db36a03cc04fd86773cceec52ff5a629b704af1a4f3d555ae 7c7fbe93ec7ac15bb78dabed731a9526119ab7afd5caae2f920c5755e2fb5586eb7f3ead8d427c8aae680b0120d0e1cebe8c268f814df3dbb417cc6895ffbc0e

size=42
root_hash=e85e1358aece4269744751e243a300dacc999419efb39446660aa671d31b13dd
signature=deb89789f85c6dfae380c07d1b6e1b1864800e4c8f06e31352e4ebda7028fd1202a709702af853c86c24a5fd898dd0700acb78696e318763614e8d40992b3f07
cosignature=70b861a010f25030de6ff6a5267e0b951e70c04b20ba4a3ce41e7fba7b9b7dfc 1705694582 d55b36ac4d340000e281bc8e38d2ee98812f11cc023d407477aa811b07e72b00416daef0a924c03092952f8f20c4072a93dc88188a97a4e2c46a3329478ef509

leaf_index=41
node_hash=ac6123bb61841c8a5c4041e3175277c34fb7faad4f3652c5e8a36f319c988f9d
node_hash=bb7132e7af3b3f315ac379ca7aeeec88b4f133e5283c2792427c16c08982c5fe
node_hash=b55126b894778f90fb1e07ea517aac3e11d7a904db51269ec36499f38bfee9cb
