2024/01/19 21:11:08 [INFO] Attempting submit to log: https://ghost-shrimp.sigsum.org
version=1
log=5955bfe2150ee2e667c4e418228f9ee89835d6990248aad9b39c0e2120c1b022
leaf=d0f6 18d618c493b6192db36a03cc04fd86773cceec52ff5a629b704af1a4f3d555ae 252b7db69360e8891c2afdca457154ecc6c2f889421760d737a93a97c075fffa975c5e330700e2cbc318b386a7ece0a122c9eeef1ca07ce5be8667648ea22a03

size=140
root_hash=63198adec31f52f6224d994d80477aba54e4b7693310029cd995e93217fc8ed5
signature=167bf0954dfdc97c300911a552e427643d2f1246787642c52a7d6382502cb755d6da52eb3ec87f2039ee46cc71c6ef39c8f832605c3c61af0f9dc21d8481f30f
cosignature=70b861a010f25030de6ff6a5267e0b951e70c04b20ba4a3ce41e7fba7b9b7dfc 1705698781 9dce3e11722bf100fda74e40165c2e8d937f94ba19a5dc156ca3a84b9d3a7d744be19986b7d00903be076bab57d673c5040a2ea907acb467f8bb8f0000cff10d

leaf_index=139
node_hash=3af4a40dbf9d48a7a0c6a1507b0e29f57672dd47323c7100f61873a44b58b1d1
node_hash=d1cdb7c26f26c1ce29a19290c070412f1c93b0196da8c17d8488b47bc0d6361a
node_hash=97a80493b52f9034b410f455514096aa0646355e1e27c8d370ddfa9580c34c5c
node_hash=73f7066de4988f363c1b8d1ce9ee479c7ed1242ff699bf885c6b6cb13755d0b6
