version=0
log=c9e525b98f412ede185ff2ac5abf70920a2e63a6ae31c88b1138b85de328706b
leaf=c15e 18d618c493b6192db36a03cc04fd86773cceec52ff5a629b704af1a4f3d555ae 9f751ae7493049a451bf8a444b5552bb09a3fa00177dc942e40f594df4771be802fedb4db53453abe4c25d695647194fc0940c9f7e7c4f2cf3deb65c030ff001

size=159
root_hash=eae65479ff9e7ca97093437a677e829c5b007c4adc0650a6f7b4dd2523b7db29
signature=d983d3a00b87c3b20d59ca4d02d5c151bb3f8933dce88a69adf5d48c124423eea57c81a0464b3b875f0ef8fe99306558ccd601eb3086e11ac9c344c67d149d0e

leaf_index=158
node_hash=27404225c9badbf9b7121c78a392188ada591dc9c16b0d19eb86632e9a410beb
node_hash=bb89422ee465c80cb97a0164fc8674ed7b74aa7f86f3d7fa5c1fecae7e6c345b
node_hash=600880bcc66ec9792746ef648430d5a8b12187f464dd6361500f6d1d8279965d
node_hash=d860e970c75158e606108653d794e85be52813337a295b80eb05e264a10f676d
node_hash=d018d40d5de4c4a9bdee519600db2e944cfcc0601b6383eb58a54cb17b00de3a
