2024/01/19 21:06:08 [INFO] Attempting submit to log: https://ghost-shrimp.sigsum.org
version=1
log=5955bfe2150ee2e667c4e418228f9ee89835d6990248aad9b39c0e2120c1b022
leaf=77a0 18d618c493b6192db36a03cc04fd86773cceec52ff5a629b704af1a4f3d555ae b4a81f65e62db7ff3cbd559dbf3426145b994cd2019666244783c2ecdc50038ce676550317681377542076dbfff4a2ae37f0800325c27c4664db8d44d2862a06

size=130
root_hash=c74d2a37e04ad214c2727f200c06c9673fbad91a2ead645dfa6fd35fe318187f
signature=5c895ae1c97954b36f63b5f8a367437283e655a160919f632317cf35f6b06dd1d1801ab98e65788d50cd156dea22586c053fa9c98a3f3e7be2cd3d1c8f3a6009
cosignature=70b861a010f25030de6ff6a5267e0b951e70c04b20ba4a3ce41e7fba7b9b7dfc 1705698481 a086d947814e05d8e00005038aabaf85253b3934bdc6d8a04f6a64967137c8fb7cfce4605ec63310d7c12fa4266ea41e0e0cde604ed70a3855ef13c6b2e9a200

leaf_index=129
node_hash=14fc73ef6cea83a2543a250827e170552df2c222891209b4006b5705d2f3941f
node_hash=73f7066de4988f363c1b8d1ce9ee479c7ed1242ff699bf885c6b6cb13755d0b6
