version=0
log=c9e525b98f412ede185ff2ac5abf70920a2e63a6ae31c88b1138b85de328706b
leaf=a43e 18d618c493b6192db36a03cc04fd86773cceec52ff5a629b704af1a4f3d555ae 197c02cf1de7c3e652a274a23761ab121a631e5883bb724ad1fee017bc161c2565f99c3b533616ccdb9f76cbf1b65e96faf88fe664e5365d9b79982bc48dcb00

size=804
root_hash=ce3fa42184f67333e3a04723e3691c6aa15c10df0f60300992534e58c706d0ab
signature=9bf5fee55040bb7f8fc3e0a14589efea5798d5194a8517778077fa5059b9c5a97deb8b84bd9fc484d7470b8f9522abefdb05db5134299d8da01b5daf91177e08

leaf_index=803
node_hash=ee39146d517430718fefc7a8e83c708f970b192efdb6c0103058c3157d005534
node_hash=0d169d983bde0e83c5f1acb6a325e1ba5794d3cbd6d4401a49fefb3f8c5a562a
node_hash=ec0a5a81f424116036866941de1e909ec110e271e7d2d34b0ee249c08302b11e
node_hash=c0f42f84b4da630a133eed2df5cb4497f864a6bbb2cfeacc5bd4c2dfff6bb791
node_hash=7316738b7ba2a710913418b55f3526e56581f01064468e75660969804d347c19
