2024/01/19 21:12:09 [INFO] Attempting submit to log: https://ghost-shrimp.sigsum.org
version=1
log=5955bfe2150ee2e667c4e418228f9ee89835d6990248aad9b39c0e2120c1b022
leaf=21b6 18d618c493b6192db36a03cc04fd86773cceec52ff5a629b704af1a4f3d555ae c0c0a66c18ec852db8a6f89ed369e4184547a00457a4d0cc75fa84cb8216af819997bb13a993cbbdf44903839feec37045a66d5ef5d15ca241f63a7e9eeac300

size=142
root_hash=5be3bde6e2ba08ba2f706d9f07e9317b586c9cafb64d10c912bf7221b9e30fd2
signature=6cf833fd0bc646a15f42a3168953d62fbfaeb58053bf6caba266bb0cd28603ef56932a5f190da14f094e12e7197f6d456c8b37c02c987a0eb42bce1524938c08
cosignature=70b861a010f25030de6ff6a5267e0b951e70c04b20ba4a3ce41e7fba7b9b7dfc 1705698841 5b838252a0fe5e0f20045a15e6e403c030ff927b60e05ac3a1f287fee42a65dff099d7d931669d169e8f16f15f6cd0612b13bf2ec7cfcc820c9e3b0322ba1f0a

leaf_index=141
node_hash=359557aa28ad74667fa7afc39e33feb2313f7d6b956b6ade98f0d0c9a52d1bd2
node_hash=2963602792edc6527fd5e821e539df46da349b52db08a968413b1feadaf76cb2
node_hash=97a80493b52f9034b410f455514096aa0646355e1e27c8d370ddfa9580c34c5c
node_hash=73f7066de4988f363c1b8d1ce9ee479c7ed1242ff699bf885c6b6cb13755d0b6
