2024/01/19 21:05:38 [INFO] Attempting submit to log: https://ghost-shrimp.sigsum.org
version=1
log=5955bfe2150ee2e667c4e418228f9ee89835d6990248aad9b39c0e2120c1b022
leaf=3c93 18d618c493b6192db36a03cc04fd86773cceec52ff5a629b704af1a4f3d555ae 165b2bed0a568927d490faab9c70fed058b68ee28b5711652da2f1e2960ad54dc44fb109871bdb823276551c999567b6b245846fe4180060bb4af1bef4e4cc06

size=129
root_hash=566dce2a2b2e1c9695ea9fefbcbfb840f3b949b3a513dc9b8060cbd2262ab68c
signature=e1be6b037567b7f38c27d2ca490734d73cbdee936324cbd68c3948721e65973e49f2e9257abb4992bf899b273ddae1ed8f2f63090d0a234e0be4d83a65482c0a
cosignature=70b861a010f25030de6ff6a5267e0b951e70c04b20ba4a3ce41e7fba7b9b7dfc 1705698451 9c2b1cafdc72d1c093669b4a96e432f4d49c2fb979229e0c5d5bfaaca004fe3d140b45724bc100ae00ea16e735944d34fd418d5ab6b99c65fdab7c798b189b08

leaf_index=128
node_hash=73f7066de4988f363c1b8d1ce9ee479c7ed1242ff699bf885c6b6cb13755d0b6
