2024/01/19 21:11:39 [INFO] Attempting submit to log: https://ghost-shrimp.sigsum.org
version=1
log=5955bfe2150ee2e667c4e418228f9ee89835d6990248aad9b39c0e2120c1b022
leaf=39bf 18d618c493b6192db36a03cc04fd86773cceec52ff5a629b704af1a4f3d555ae 18afbd9de836ece60f80b6ee5769f7c55c434949eb00d6dd60660b88078c04e21c76c9a62d4f1ad794a95953a54123d4ecd9aa314d17840ecb73e2e422ca6109

size=141
root_hash=f3fbbe9c098ec092582bdb0a00299179f6fab045691d09cd330201d4d8d0016a
signature=fbef01c384b783f1ae1c27ca10c7d6ec940a589980ea7c788a60ebdb3b33aa6e7103b9a205adede6141bc880510327911e464992e9a99cf44aedf007c0ccc009
cosignature=70b861a010f25030de6ff6a5267e0b951e70c04b20ba4a3ce41e7fba7b9b7dfc 1705698811 7cef70671776d3c14f8febbb7f3247ba03fb19dc972f117a132a6dc0abf28f493d3740fce0e9347dcf468cd91a7ad5b6526374516ffee59d329a03c1a4417500

leaf_index=140
node_hash=2963602792edc6527fd5e821e539df46da349b52db08a968413b1feadaf76cb2
node_hash=97a80493b52f9034b410f455514096aa0646355e1e27c8d370ddfa9580c34c5c
node_hash=73f7066de4988f363c1b8d1ce9ee479c7ed1242ff699bf885c6b6cb13755d0b6
