version=0
log=c9e525b98f412ede185ff2ac5abf70920a2e63a6ae31c88b1138b85de328706b
leaf=98c2 18d618c493b6192db36a03cc04fd86773cceec52ff5a629b704af1a4f3d555ae 73d951d9d4adcfedd1c5ab2b5fffbfc5ff3a5c3eeffe14c4aa2fff6158b0885fcc1fda4b03d14474e9c33d799ade28d1624a22c296e4fb30df6b5b569f946a05

size=503
root_hash=e843321ea18e98e7326a891c35e2f0747bf10cb9c6b678e6f9c8e5a592c83549
signature=1c42edaa9f219c310badbe349d906dab525688fae185718a9efd454cf3a8a01f571bc0386db844689cacab763e76f85c8783028f89f0167d51f3fd00afade001

leaf_index=502
node_hash=a94a5a908810c4e6b168cb390eab977450fb11690c841b225ca320db15514a27
node_hash=e9c99c311d8473777a0088076f4cefa7d75c445b8d34b632cb8242dc115d7e59
node_hash=104c7a14b814bea2dd98e4f61810ee37d8003b0e3bdc643bfe66513b0317413c
node_hash=6005035afbb5b527351c813358c8b2c30fb0910abf255067b03df2a3e30ad4a0
node_hash=96c8f34f2d27c8baccbe69a686d7d8cfa41d55c3ff8a1d534ca881a00c23c009
node_hash=33f4151aadfa95c4002558b0848809017259f88e97e991287154025ef16673dc
node_hash=84673dc3ca1bf1ce1f99ded794694b623bd65ede4635d48e7ee9e3ce18b6bfed
