2024/01/19 21:15:58 [INFO] Attempting submit to log: https://ghost-shrimp.sigsum.org
version=1
log=5955bfe2150ee2e667c4e418228f9ee89835d6990248aad9b39c0e2120c1b022
leaf=1bf3 01e2c1da6f85ecdb4f9f47ab81c2abaf4b1691c4fb565f8305398bdab7229c3c 2a1970e2db05304b12cba08f854777de1031cd3cf33d233534940c0492d63505e56cb9b9e29c42d2dacb092d23a789aa77e901157d318f111fe4a5bfa9502e00

size=148
root_hash=a12153f4fc849ff28925f5798ecd475d3fd24bb9b46ac11ba079e36a2879b019
signature=782bc4491f7d2a31874be4b072d0dff3bda78947afcb002a1f15f759523a7367dd6912d136821c06d017681df2eb74ba75213a43a504aeece28f40f7268eb30c
cosignature=70b861a010f25030de6ff6a5267e0b951e70c04b20ba4a3ce41e7fba7b9b7dfc 1705699071 d9056001249b28d9c5d9475c7b740846fed8ae22f5f4367100a9d651716f87e41f922c3a487bbbd21f90ceacc41bbaea83cd106f6eced705950097151102320c

leaf_index=147
node_hash=d3291454360df5a5ad8cc44426f30cb351653326b8744635d9db5ec0740ac69a
node_hash=35d08e7b533798b5d3c8e991fedb8c9fd5e430e8054019620de894cd03a62698
node_hash=29ebf0bab3c06a24c000691c1bd1a148f0e8aa08905872d8cc7d2cde52e959af
node_hash=73f7066de4988f363c1b8d1ce9ee479c7ed1242ff699bf885c6b6cb13755d0b6
