2024/01/19 21:40:00 [INFO] Attempting submit to log: https://ghost-shrimp.sigsum.org
version=1
log=5955bfe2150ee2e667c4e418228f9ee89835d6990248aad9b39c0e2120c1b022
leaf=6204 6ecb6a66c902c22596827298c1dd52f7b522759b59365ec561567c3deee23dde 1c5cfd29e55cb510f5064b3e0afa6411c388dd57b2905b719f55642a93e9d1a5d8155cbeed1ac3043661ba00c1bccacac6b4bc407a94d581453c665eb9cd680e

size=171
root_hash=0301b3288ec1688a89c14aea30c3ad0eacc2386586b2becae32e9d9f0c4ba533
signature=a44854819fe6a85e2c19756bfcd5315bf75e671c0bff05ad5079f3a9b7ae03bef0a92657b0c7169bcddec171815c50ad68263444fbf09a77a676735787379b05
cosignature=70b861a010f25030de6ff6a5267e0b951e70c04b20ba4a3ce41e7fba7b9b7dfc 1705700511 728ee5d244cad02537b7eba5fa32a72e624faec3ba421236e80842e4f86798909a41bbbc913c28cb01908d44f63a7a12daaee8086c0a6d59b50c238c79657702

leaf_index=170
node_hash=fbf806c901606dce2abdaf52ac95e5e82de4148d2b87178b05779388f60b98f8
node_hash=3e28f0e6e2d1ec43c42902c4dc8613ba1d2b211d4d1745217aa59db112cf9a81
node_hash=7ad618ed7634169d8fd9527c62cdecde3b847c7e3bbfd62c66912a114e3644b2
node_hash=73f7066de4988f363c1b8d1ce9ee479c7ed1242ff699bf885c6b6cb13755d0b6
