2024/01/19 21:39:29 [INFO] Attempting submit to log: https://ghost-shrimp.sigsum.org
version=1
log=5955bfe2150ee2e667c4e418228f9ee89835d6990248aad9b39c0e2120c1b022
leaf=0389 6ecb6a66c902c22596827298c1dd52f7b522759b59365ec561567c3deee23dde 1b594c22aeb5b19428199b3695bc7ea2fad0bb28afd9da28636987a2ded4a6ce13bd98f0eb5102a4ad8a9be3dd2b21182cab73dc9a81d83b0fbf6abfbcf44d0d

size=170
root_hash=cc4aea1728262d9d55bb9b277f1e1f2f533d6c1b8d14c3b997d1f7d787263309
signature=9a7160da7ec91194198efa9a7a97b6a395fe922b104b86d28614c582b1952c376536ee6445cf901023c4910dbf5e27e4d4f52c35fcbff7dc70275282783f2f0d
cosignature=70b861a010f25030de6ff6a5267e0b951e70c04b20ba4a3ce41e7fba7b9b7dfc 1705700481 c7d919f52aac554aa5cf0eb41261a1f7b543948681491cf7f9e3e7f35a1deb6c7e228cf561cc5770f6e9f51882a2b28b7ca6c3d955f883f19b960ef622b22402

leaf_index=169
node_hash=0859d52d4a975f65c3edc6b45846448be973e233394ecf61e515980fadd8c8cf
node_hash=3e28f0e6e2d1ec43c42902c4dc8613ba1d2b211d4d1745217aa59db112cf9a81
node_hash=7ad618ed7634169d8fd9527c62cdecde3b847c7e3bbfd62c66912a114e3644b2
node_hash=73f7066de4988f363c1b8d1ce9ee479c7ed1242ff699bf885c6b6cb13755d0b6
