version=0
log=c9e525b98f412ede185ff2ac5abf70920a2e63a6ae31c88b1138b85de328706b
leaf=ca9a 6ecb6a66c902c22596827298c1dd52f7b522759b59365ec561567c3deee23dde bd094026dee8cf8a8e55bd9010cb17b938250bf5f0a393756dee21bd557001be1659b45736faedd83f07797a14f36102f16da5d2a81c47e636445beb43e5ca02

size=696
root_hash=f56fbe950ae9e86ed850487427fe3505a299d72995482b846d8e5cc678e8ae26
signature=ac3e8fe3cae69110ea41b1c27681ce6b922f011db6c0ddfb3d8ed1b28b03e56873e4eb6646e98bd9115e49e196ce5e3c13dff457b5a6ce21c93e1fb4a380450d

leaf_index=695
node_hash=9da9c41ca6a33296bf42617680d37657ba0e6c8273669f4e152b2cc610f34cbc
node_hash=7654e5dae872ccf7d1081ce41f2b0a97b4ee340b74ba3e6cc9118c70808e002e
node_hash=d176e713ae3d98410563d3159fdb27a2468786925d0617292996cd6ac17546c2
node_hash=45842c7d19bff878e8f36d4be735304a152eb3fd12e66c8b5c31a7f450325535
node_hash=e1145763ffcce77ae4a34b631e442dc6f34bdf97954a75c7ea8a2f1098c6dbba
node_hash=b8a281c8581ff6b997ce8b5e38f34f4aee5c7ce04ed3d53840f5556ca8b28a8a
node_hash=7316738b7ba2a710913418b55f3526e56581f01064468e75660969804d347c19
