version=0
log=c9e525b98f412ede185ff2ac5abf70920a2e63a6ae31c88b1138b85de328706b
leaf=dfbc 6ecb6a66c902c22596827298c1dd52f7b522759b59365ec561567c3deee23dde b02c4be6200c29cef2b7595450b9e67d268efb22b7dea032728da2d13530b1c04205bc082d8dfe646afd31136ff6056d0ab7b5dd115b1c8c525407a13366d50d

size=909
root_hash=eee22dd04b49a4e1da1decbc1fa6e7553494ec1347df15cc49341ee9593e8f6e
signature=0fe046d5ca995eae34df6520918ae07518bad5c66c3b041e32c5d9c3cdb202bea4b7f5748ea37d030b212c64f15471f67ba803eb74c322bc6d84fb8ce5a8720f

leaf_index=908
node_hash=29da478451e95711cbe9b4ea95d23d151a56f83a8a48e9cc4a4bf59cd293cfb2
node_hash=4d46a0047e88cbdd1d0aa37ca1c40d99e65afaf7ce7ad0c878e3bcc7dd297653
node_hash=0f2f67df96a31db31a787748be219748dfb5f2698b459eb2796933d420a5b0db
node_hash=c0f42f84b4da630a133eed2df5cb4497f864a6bbb2cfeacc5bd4c2dfff6bb791
node_hash=7316738b7ba2a710913418b55f3526e56581f01064468e75660969804d347c19
