version=0
log=c9e525b98f412ede185ff2ac5abf70920a2e63a6ae31c88b1138b85de328706b
leaf=fce3 6ecb6a66c902c22596827298c1dd52f7b522759b59365ec561567c3deee23dde 45aeb8073d1c67bf6c0534344d71409205a629fe0c548e9be47be90b44d517b4b82b5f44cb6e23a32d76a50e1b411113134260b8bf74f9706fc8563bfb563c01

size=391
root_hash=1bea5988f46dcaf288a01ccfe446b18f919413a53b52d804b98c10c46026e52a
signature=7f61c8609f5851fa7e093f156d5c84dc403c1818c0b8257e2baaf8f9195d5126ee931e458505ea8d85491b91790c076ac4e34598a647717f8433d40e352a330c

leaf_index=390
node_hash=271bfc3182054223aaffcacf2256fcf54605f78546f9175b115617432c140818
node_hash=9115707c48c903d7ebf3c2587e164496fb8627a875fa1f3e1c51b61fe8580a87
node_hash=33f4151aadfa95c4002558b0848809017259f88e97e991287154025ef16673dc
node_hash=84673dc3ca1bf1ce1f99ded794694b623bd65ede4635d48e7ee9e3ce18b6bfed
