2024/01/19 20:16:24 [INFO] Attempting submit to log: https://ghost-shrimp.sigsum.org
2024/01/19 20:17:09 [ERRO] Submitting to log "https://ghost-shrimp.sigsum.org" failed: context deadline exceeded
2024/01/19 20:17:09 [FATA] Submit failed: all logs failed, giving up
