2024/01/19 20:41:07 [INFO] Attempting submit to log: https://ghost-shrimp.sigsum.org
version=1
log=5955bfe2150ee2e667c4e418228f9ee89835d6990248aad9b39c0e2120c1b022
leaf=4562 3df24b18c76a8fe5f516e2fa6a9a415605cf3e1612822f3ed6c9313edfdfabc7 c5790e5f5790a29726fee0be491fd5e8c2a7fd9d141c623ec5de6ab8dac2e247efb3c4fc8b8a883deab6b32eda56b55718800e78aebe3b062334f0a6dd84ac0d

size=102
root_hash=91622c3686933d2fb945103c029b6a3eaaf9237cedcf7e0a65c7c8bc5c1fd1a2
signature=c014eb6c73399681363cf9d261d10e7b911f1de077bdba9518ac1948fb8935d3cc273e95b4d135b5eea5835ac7785c3e67d3da4608008f15d0708e3ca8659100
cosignature=70b861a010f25030de6ff6a5267e0b951e70c04b20ba4a3ce41e7fba7b9b7dfc 1705696981 db9343788827c657b96309a3183c5ecd0a9c46385c0ce0a2d1307db59a58c1d9a1c92df2e7e0cbacf241a8c453ffabf6eb2a6628bd21e2cebe6911300ba62904

leaf_index=101
node_hash=a251d49f428c575f099f56a639adb26b62e75a763c754b1d6a7dfee4fe6a51d8
node_hash=91a28751ca9d96c2e4910723cb529471bbd2bd48c6ef125db241339c09aee43e
node_hash=80563f2fb8635639c64e7f74382dbc5fb2b1aadbbd52b209090b2f4e135dc880
node_hash=b131baeb6be8ffcbf698b0b543b7c845e4aff27e52bed352ea333854c26220af
