version=0
log=c9e525b98f412ede185ff2ac5abf70920a2e63a6ae31c88b1138b85de328706b
leaf=6738 3df24b18c76a8fe5f516e2fa6a9a415605cf3e1612822f3ed6c9313edfdfabc7 c10f702dbc15b394ce5221be4933ca5ceae37cf8d12256fa61e009a3cbb6037c0e4c73f28d33ef5f9e6ff6bc2c2d30dd467ddd3f2ceb3e4fd2a622af03764709

size=1109
root_hash=caf89bc972492463a448ce2bdacc914a58d344f2fadc854ade4bb413c84800c2
signature=52a9731e8b3c5b10306b3e1b19781beaba4f521bd400dbcadc1b979d82579763b61d9dd3c02ca8c5dce3717972587ffb2eba14066cecac438c3137dcd831a60b

leaf_index=1108
node_hash=ef9d2555d2982c1fc4b0c9af43400927c29dd498c0c5421a9fccc40457a390d0
node_hash=bb8144e9c01c5d4fefa9e99ea32977804cdc37e5c498ca3dc344b489cca8d652
node_hash=b81076801ad3830d1605b3b376bb268db94d86bb855ff85fe85a8a9f4f972d95
node_hash=f083a6caeb32773e7b8928d77b26461fabdd70a89b9a6973c50864c50f531fe7
