version=0
log=c9e525b98f412ede185ff2ac5abf70920a2e63a6ae31c88b1138b85de328706b
leaf=8a59 3df24b18c76a8fe5f516e2fa6a9a415605cf3e1612822f3ed6c9313edfdfabc7 350b0c3d73c0ad4a5e64c53225f2570e166f9d16af6ad33b7ec08ba835059d9f6f128279f272acc34cef776aa3110aff52df325cc6cc848101d431f4e7d2df0e

size=801
root_hash=3c2404cf6762970c0294b917cd8e585360e9c8459a4f8f2e4fc99004bc90c1eb
signature=adbe456206894ad0de2da8abe7fd71a27036e9ffd492e3dacc006795964bf297936f233f4dc2b4d868d916cffc6f71a23552f35f42509156aae651820c9c8300

leaf_index=800
node_hash=ec0a5a81f424116036866941de1e909ec110e271e7d2d34b0ee249c08302b11e
node_hash=c0f42f84b4da630a133eed2df5cb4497f864a6bbb2cfeacc5bd4c2dfff6bb791
node_hash=7316738b7ba2a710913418b55f3526e56581f01064468e75660969804d347c19
