version=0
log=c9e525b98f412ede185ff2ac5abf70920a2e63a6ae31c88b1138b85de328706b
leaf=c5d0 3df24b18c76a8fe5f516e2fa6a9a415605cf3e1612822f3ed6c9313edfdfabc7 a4676da8ea1bfa804923a25ff112e0f335767acce6ca52318523b509b4ae8465905caba5135cc385e1c9bd116f1da0848cc89079384cef0c97f80a4f3cfe8309

size=682
root_hash=8d90b07f817b7a1a26ffe78dc12fe8cdfe8ceccf69dc46a9f5cbe33ec74cefdb
signature=135d9a5ae9312835812775ad24e528d408ea5002b8f74a41c48db45e322af70d26a7c3398aa95a4a4192f48dc60e00a9407f039d70a4b18d1b6c2cd17d211703

leaf_index=681
node_hash=3a25c8116f45191b6fa70719d9f063ab35bdfc9987b76878d37ac1b92fe540ab
node_hash=160e697c0ab5db165e7d8ffbfa60d5eb7ba3e14e4027a921738258f2401ff0f6
node_hash=e1145763ffcce77ae4a34b631e442dc6f34bdf97954a75c7ea8a2f1098c6dbba
node_hash=b8a281c8581ff6b997ce8b5e38f34f4aee5c7ce04ed3d53840f5556ca8b28a8a
node_hash=7316738b7ba2a710913418b55f3526e56581f01064468e75660969804d347c19
