version=0
log=c9e525b98f412ede185ff2ac5abf70920a2e63a6ae31c88b1138b85de328706b
leaf=6e5a 3df24b18c76a8fe5f516e2fa6a9a415605cf3e1612822f3ed6c9313edfdfabc7 c88475e83502ebb3d8ca1800bf3d085980d0b378cfbf98873e709a88dda5661cfd66f847137db71ad6f18433e8ff82800f519658c5a893a56608abaaefc2e400

size=139
root_hash=f063fc543b391100932c6728abe2c886274b6589d261c409353d92004d2e5e69
signature=605b0318716b4fa1dedcd84847107a18e9f5a481a84604fe80909736d08b4d8550f0e54116863c91ee460fdb1fab4ba034d7bfee411705e07f8e7fef18163207

leaf_index=138
node_hash=61618bc2cd93c507f4846ee594b3d31cb6c12e32395293b9c3c98abecb44685f
node_hash=16286534ac8f2527bb7b10d6162185d2c3dda21927bdfc1693981b0322b94313
node_hash=d018d40d5de4c4a9bdee519600db2e944cfcc0601b6383eb58a54cb17b00de3a
