version=0
log=c9e525b98f412ede185ff2ac5abf70920a2e63a6ae31c88b1138b85de328706b
leaf=b685 3df24b18c76a8fe5f516e2fa6a9a415605cf3e1612822f3ed6c9313edfdfabc7 c9cebf452c58c669710408f2b1a968afc53613934adb459b5560d7f347b688bda419bc6bc3d3ddce700df12e9a5caf864b1bdcc735714c87c65df05b763e880b

size=473
root_hash=00434407d99afde11d63e079b0998266e4bd0c289a21474e8d981ca01cdff68b
signature=45ce8ac01b224c3bc9a26568879c2bdb95bd28efc72b653b0a138ca487dce140033f8d0a78b2369f717066dcb7c6bb3bca355c1449b4d692d36e1de372fbcb01

leaf_index=472
node_hash=c692bf262c4275a71a13528ce3de4e3bb5fcca8bab771880bc8937aebb57b6b8
node_hash=2fcee5abb6427959848acc45feb853763ac89d56160b34a7474b7e255a17ff11
node_hash=96c8f34f2d27c8baccbe69a686d7d8cfa41d55c3ff8a1d534ca881a00c23c009
node_hash=33f4151aadfa95c4002558b0848809017259f88e97e991287154025ef16673dc
node_hash=84673dc3ca1bf1ce1f99ded794694b623bd65ede4635d48e7ee9e3ce18b6bfed
