version=0
log=c9e525b98f412ede185ff2ac5abf70920a2e63a6ae31c88b1138b85de328706b
leaf=da42 3df24b18c76a8fe5f516e2fa6a9a415605cf3e1612822f3ed6c9313edfdfabc7 fc0ab925aa97e2e48cabb77962a155d1f65308c8841d6d5012fe11ae0012559746ff0d819aec3aa05600986e046b7d1c9f535e6a53be1cb695ad7d0e967ca50b

size=904
root_hash=b717f87352c754888ee1e13cd0c481363e52709bc089fc9d444b10442de3c4d6
signature=fb2d80a90414295baa84a76d807f5114f172279f65159c655b85d0e2d0b33cd72a05da7ab19a918e9dba5ef420f5d15d3c1a7205348063361359a5fdf1cc8107

leaf_index=903
node_hash=aaae1e45333c85021159b13a3c5181ef68e28851ccd34b2b50e5742fada95623
node_hash=0c612032ae20bcfba26a27ea43f53eea2a142633da1094fc61bb81e0dedbf1ce
node_hash=3f53cb28612031f76c030e492d6b6761c5fe4fa3257f4c0ef764b93162a65dee
node_hash=0f2f67df96a31db31a787748be219748dfb5f2698b459eb2796933d420a5b0db
node_hash=c0f42f84b4da630a133eed2df5cb4497f864a6bbb2cfeacc5bd4c2dfff6bb791
node_hash=7316738b7ba2a710913418b55f3526e56581f01064468e75660969804d347c19
