version=0
log=c9e525b98f412ede185ff2ac5abf70920a2e63a6ae31c88b1138b85de328706b
leaf=e8a5 3df24b18c76a8fe5f516e2fa6a9a415605cf3e1612822f3ed6c9313edfdfabc7 78d050b5c47ab117f9a6966c3caf6b013502213e3804e7a63de8c2b9868c0126803da147d79998ffb2d76dd3e431b36dd184c53bbaef7f88de9f018b7e6bd00c

size=560
root_hash=b03ed11b384a6f3bda22c60548e1345ae2b11d0f32a19a87c809bddac290dfaf
signature=d64c9bfd03cff176bbaad13de18f46e4b3af85b10fdfdc13547171ee791d062ee44b73e631b1d1d1a2f32abe8024d3da0144aab055478471b11d1a4d24237400

leaf_index=559
node_hash=7cc9166de6d2d82eeb8e993426c256adcfefa7be989fecf5757ef9b1b275fa32
node_hash=b6fcf21bbd3ad26761404a65fd66e340a345db6c7c30201503bbc7725390340c
node_hash=34b8ec45613379590a641655c9096b6e9622922edea1d25571314cbd89f75eed
node_hash=c19df7eaa628b660503eaf167bbea209a332e2ea581e2793886a70d239671d96
node_hash=04cccf3c75bf25fb712651f8cdd03d6e25c33c1f2f48647150da37f532e54676
node_hash=7316738b7ba2a710913418b55f3526e56581f01064468e75660969804d347c19
