version=0
log=c9e525b98f412ede185ff2ac5abf70920a2e63a6ae31c88b1138b85de328706b
leaf=7ee3 3df24b18c76a8fe5f516e2fa6a9a415605cf3e1612822f3ed6c9313edfdfabc7 abffd11fade288b47f019069e0e2c571ad37125bb4787a33598851a03d328f51d49f17a9c739429e5e4e62bccd1835fcf74ad485903cdcc77ede607e421cb309

size=1221
root_hash=5b0c4d1117a10cbaf06621b2f5a67e4542456ac25f8ed8bda44e0af5f65a9616
signature=10c0c001eb28612d344092fba6ff745ab83aae915497aa2944482c28d4f17bfeaf01548363792f30ab788ca39f7bf069f5e6d9c85b3783a6e4a9cb9456da6301

leaf_index=1220
node_hash=be04b54a54d42a1dc3ad6a944bfc5836734054ab7f59db61e943a5f1a7deb1b1
node_hash=39925424d8734aee941b60ef2e00421213288f8d30fd4a12f6060b7e1fe824e2
node_hash=335c10aa94ec8dca25233526069f1ed527ef80d832add6c71c76e6b235027cda
node_hash=f083a6caeb32773e7b8928d77b26461fabdd70a89b9a6973c50864c50f531fe7
