version=0
log=c9e525b98f412ede185ff2ac5abf70920a2e63a6ae31c88b1138b85de328706b
leaf=b4bd 3df24b18c76a8fe5f516e2fa6a9a415605cf3e1612822f3ed6c9313edfdfabc7 184c3fc4244e6bb040b25c25c8f5d251a79e684579745530cc8aaa70ebe9d753d285496b2dc563c2abb94996a81307bec2a6f5cc0a0e16631f86c3d897cdf904

size=1216
root_hash=f96619df9528d019580c90cdae4e30ec66dead774ac1edcb5966ebbce1dac7ca
signature=e95aae86fe77b22c84d7c189963afee9f7778bfc5d29bf68a881ab2604eb602dbfef90d4e789b87597814f6d8bf2ac96d05ca222377393d8bfb1757177a69c01

leaf_index=1215
node_hash=6e8d8f10985c6a8855d5c0893d9b181e89e8fa4893dc43f8963da77af8bee453
node_hash=41e5a0bd5824b1e4575e480389be482039653373a9c6edbfbe028364aeaa3125
node_hash=d1afdb02a30b79d35dd6f56b1e5b2d40b6a5835abb85f50fc762893a8c5c94cf
node_hash=199baa7b3a1e83d0396f96b76898bbe679f87207ffaa19c48f648d6fc9685a43
node_hash=d3f37d283ed1bbd07419b3c637495b3e998bf3cba8043064999bf1536b1e36c9
node_hash=321412784223d2fa77d609fde30eb2632b0536eb3c9f1dfd25208ab5203c63cc
node_hash=335c10aa94ec8dca25233526069f1ed527ef80d832add6c71c76e6b235027cda
node_hash=f083a6caeb32773e7b8928d77b26461fabdd70a89b9a6973c50864c50f531fe7
