2024/01/19 20:49:38 [INFO] Attempting submit to log: https://ghost-shrimp.sigsum.org
version=1
log=5955bfe2150ee2e667c4e418228f9ee89835d6990248aad9b39c0e2120c1b022
leaf=ed87 3df24b18c76a8fe5f516e2fa6a9a415605cf3e1612822f3ed6c9313edfdfabc7 423b8de790be84a0ffbde92fabf1c4f2e2b517a4add38a42f80ce883038cf32970d8bc1bebf3ebf4c782af83378d7e67346290a91126bc9c7c379d9341343f00

size=119
root_hash=d6f31549948f803f0baf5850e71464d6acdc95c10a18caa355817944eccf200f
signature=998272e41456ba0a80bd967bbf33434ff349ac0d5648ab4707fbac742d55f72af5dd6595795cc208c271d77cfcd4b5148abc9665cbd45de4509e98b89fa1b10b
cosignature=70b861a010f25030de6ff6a5267e0b951e70c04b20ba4a3ce41e7fba7b9b7dfc 1705697491 da2059c4e35635388cbea428613131366a38c2d4975eac4a68daf8e62a6e0c7898e11c2100c7ac8094199d43cd891eab6d8794f275449adf2d5445f675bae508

leaf_index=118
node_hash=efdac52e0ba5e64cafd76e5167e76b411724f276a3b14bcda859d901d86f4528
node_hash=7e23d2e6859baebe1480dc8737c6fb6bb2e7f638a3ef888ac0a2f43a2da657a5
node_hash=f2493e7f4db318ea950b6ae8333ae0b6a8ba3048d3c5c588e9b379e25e8d080d
node_hash=80563f2fb8635639c64e7f74382dbc5fb2b1aadbbd52b209090b2f4e135dc880
node_hash=b131baeb6be8ffcbf698b0b543b7c845e4aff27e52bed352ea333854c26220af
