version=0
log=c9e525b98f412ede185ff2ac5abf70920a2e63a6ae31c88b1138b85de328706b
leaf=74e2 3df24b18c76a8fe5f516e2fa6a9a415605cf3e1612822f3ed6c9313edfdfabc7 205fbc734ff0637a0fb453078b29c07445db28f6a1f86ee45519f4b21ee644e5b19bf0a7e61ee0590da14bbe6898059a6cd3b1fb5a69f4657b16e4aa92a4c906

size=382
root_hash=7990d088057aad2943642b8346777d98967af26d2548afc3714d825f0ec58dfc
signature=7a99bda766d389c9b11080c35378b55ad35989825081eba37d0f8b3dc666736319aab9b618278fae7014baa31cf57ca9238c9d792537761cd6bab2cde1f8dd02

leaf_index=381
node_hash=4718786316879e167f5952abd8d9f6aec770fcd9a5ae94a8a220c739dbd82572
node_hash=63158d31e94c89af81a9cd616f5a200153df7833effbb2ec6c9d134b94445ad6
node_hash=541d80584c3a35824e5b7f1ae804162f73641e6e77a3b9386428e43c70d06fb2
node_hash=35223c4ca3f787b97f931c39799d8c731e979370809c4a543bac8c4b2f4cc6a4
node_hash=3a65912855716318f0553b4f40dca168124cf3c597c91b930fdea3acec9fdc10
node_hash=b395b64981e4af94d37a094011459923222be55efa4aafe4dfd84da8c4a800a7
node_hash=84673dc3ca1bf1ce1f99ded794694b623bd65ede4635d48e7ee9e3ce18b6bfed
