2024/01/19 20:46:07 [INFO] Attempting submit to log: https://ghost-shrimp.sigsum.org
version=1
log=5955bfe2150ee2e667c4e418228f9ee89835d6990248aad9b39c0e2120c1b022
leaf=da08 3df24b18c76a8fe5f516e2fa6a9a415605cf3e1612822f3ed6c9313edfdfabc7 64806e432d903ea407b344a869e724dee8939f1ba25f106b5535485fe3ae48456f97d93319575a758b0bb6af9cf0fee350b0ff784e4957752ed92c2c9790ba06

size=112
root_hash=7fddd45ea6b811b67ee9e1fd259b855ecfe4fb472d82ea6662e6fa9987a1c708
signature=713f19abc5d9ec5a15d85f508c2f6b710935fedf5a54772644f11d0688ce169d58efc435f5eca3225991218d7faff57ec83f7c6777d9ec7554ffca4f5bc2450f
cosignature=70b861a010f25030de6ff6a5267e0b951e70c04b20ba4a3ce41e7fba7b9b7dfc 1705697281 232e9335e33cf7d8b04a91aa1ce89931b8c2218e02b100b09c03e0e8dab7b816bf8ad3ada121f5ab3187ddabcd9a5070f5504f187dc09b05a41b750e8ce1ba0f

leaf_index=111
node_hash=80ad0b257d22aab6ea3f148b158603ca86b662ff15706f07a6a5fcdab6903704
node_hash=ee47868baca9a7318f04c6ee70cc584abdeabc3fa8ed509a4ec6f485641d2006
node_hash=07d6b045b1ced9c5ba22a34c0343b7b8b49017a30c0a84e6c9538d6e41bfb6eb
node_hash=68b4d5bc695fc417340dccd6b067311d6e5cdbce874def8aabe7a3c744dbfc6f
node_hash=80563f2fb8635639c64e7f74382dbc5fb2b1aadbbd52b209090b2f4e135dc880
node_hash=b131baeb6be8ffcbf698b0b543b7c845e4aff27e52bed352ea333854c26220af
