2024/01/19 20:42:39 [INFO] Attempting submit to log: https://ghost-shrimp.sigsum.org
version=1
log=5955bfe2150ee2e667c4e418228f9ee89835d6990248aad9b39c0e2120c1b022
leaf=4e90 3df24b18c76a8fe5f516e2fa6a9a415605cf3e1612822f3ed6c9313edfdfabc7 ab8d09f3bcbbc6ee6997ef6c99bcaa01172ae9d99a2f54faf0b0c6a4b1e1fa638313ab844667031a7dc295e5d6188b113e9b29b929949d5e323fde9685f89802

size=105
root_hash=555a9f9274590456670082eda3181e92f389d4d5b5ec65a27fabe50e5b979d63
signature=57716a5ffdc62363a905969c3d33133d4b8978ade0ee22f22d0ac0c278933e61acfcf6df760bfa6bec834cbf953003f6c8460468daa09174bb2c4ab03d46d007
cosignature=70b861a010f25030de6ff6a5267e0b951e70c04b20ba4a3ce41e7fba7b9b7dfc 1705697071 30908f2722c6057611dcc4b3b65d66add66f4e4b37caa6ae421c04ce8d5ddd9b69174febf94802e3ecb0ddacc87bd73585daf32c037555c1cb7ca105391ec30c

leaf_index=104
node_hash=68b4d5bc695fc417340dccd6b067311d6e5cdbce874def8aabe7a3c744dbfc6f
node_hash=80563f2fb8635639c64e7f74382dbc5fb2b1aadbbd52b209090b2f4e135dc880
node_hash=b131baeb6be8ffcbf698b0b543b7c845e4aff27e52bed352ea333854c26220af
