[
    {
        "id_project" : 1,
        "id_bloc" : 1
    },
    {
        "id_project" : 1,
        "id_bloc" : 2
    },
    {
        "id_project" : 1,
        "id_bloc" : 3
    },
    {
        "id_project" : 2,
        "id_bloc" : 4
    },
    {
        "id_project" : 2,
        "id_bloc" : 5
    }
]