{
  "/": {
    "component": "component---site-src-pages-index-jsc-4-f-f99"
  },
  "/blog": {
    "component": "component---theme-blog-list-pagea-6-a-7ba",
    "items": [
      {
        "content": "content---blog-495-19e"
      }
    ],
    "metadata": "metadata---blogbbb-5f9"
  },
  "/blog/tags": {
    "component": "component---theme-blog-tags-list-page-01-a-d0b",
    "tags": "tags---blog-tags-8-be-13d"
  },
  "/blog/tags/beta": {
    "component": "component---theme-blog-tags-posts-page-687-b6c",
    "items": [
      {
        "content": "content---blog-495-19e"
      }
    ],
    "metadata": "metadata---blog-tags-beta-5-a-4-a18"
  },
  "/blog/tags/hello": {
    "component": "component---theme-blog-tags-posts-page-687-b6c",
    "items": [
      {
        "content": "content---blog-495-19e"
      }
    ],
    "metadata": "metadata---blog-tags-hello-3-a-6-b36"
  },
  "/blog/welcome": {
    "component": "component---theme-blog-post-pageccc-cab",
    "content": "content---blog-welcomefa-5-dd9"
  },
  "/docs/:route": {
    "component": "component---theme-doc-page-1-be-9be",
    "docsMetadata": "docsMetadata---docs-route-20-a-f24"
  },
  "/docs/accessibilite": {
    "component": "component---theme-doc-item-178-a40",
    "content": "content---docs-accessibilitec-40-881"
  },
  "/docs/bdd": {
    "component": "component---theme-doc-item-178-a40",
    "content": "content---docs-bdd-058-24d"
  },
  "/docs/client-web": {
    "component": "component---theme-doc-item-178-a40",
    "content": "content---docs-client-webfa-8-1be"
  },
  "/docs/code-of-conduct": {
    "component": "component---theme-doc-item-178-a40",
    "content": "content---docs-code-of-conductdea-e33"
  },
  "/docs/comment-contribuer": {
    "component": "component---theme-doc-item-178-a40",
    "content": "content---docs-comment-contribuer-809-e16"
  },
  "/docs/configuration": {
    "component": "component---theme-doc-item-178-a40",
    "content": "content---docs-configure-9-e-0-d1a"
  },
  "/docs/contributing-open-source": {
    "component": "component---theme-doc-item-178-a40",
    "content": "content---docs-contributing-open-sourcecf-3-b00"
  },
  "/docs/css-debat-public": {
    "component": "component---theme-doc-item-178-a40",
    "content": "content---docs-css-debat-publicac-9-a85"
  },
  "/docs/design-principles": {
    "component": "component---theme-doc-item-178-a40",
    "content": "content---docs-design-principles-2-c-9-814"
  },
  "/docs/doc-docusaurus": {
    "component": "component---theme-doc-item-178-a40",
    "content": "content---docs-doc-docusaurusce-3-69b"
  },
  "/docs/documentation": {
    "component": "component---theme-doc-item-178-a40",
    "content": "content---docs-documentation-7-ab-c4a"
  },
  "/docs/gitlab": {
    "component": "component---theme-doc-item-178-a40",
    "content": "content---docs-gitlab-22-a-66e"
  },
  "/docs/go-backend": {
    "component": "component---theme-doc-item-178-a40",
    "content": "content---docs-go-backendaa-5-254"
  },
  "/docs/infra": {
    "component": "component---theme-doc-item-178-a40",
    "content": "content---docs-infra-5-ec-d32"
  },
  "/docs/installation": {
    "component": "component---theme-doc-item-178-a40",
    "content": "content---docs-installation-3-b-8-7c6"
  },
  "/docs/introduction": {
    "component": "component---theme-doc-item-178-a40",
    "content": "content---docs-introductiona-09-6b4"
  },
  "/docs/makefile": {
    "component": "component---theme-doc-item-178-a40",
    "content": "content---docs-makefile-7-b-7-636"
  },
  "/docs/manifeste": {
    "component": "component---theme-doc-item-178-a40",
    "content": "content---docs-manifeste-573-a9f"
  },
  "/docs/markdown": {
    "component": "component---theme-doc-item-178-a40",
    "content": "content---docs-markdown-86-e-c03"
  },
  "/docs/technos": {
    "component": "component---theme-doc-item-178-a40",
    "content": "content---docs-technos-953-6c5"
  },
  "/docs/termes-conditions": {
    "component": "component---theme-doc-item-178-a40",
    "content": "content---docs-termes-conditions-3-c-1-095"
  }
}