[
  {
    "title": "Protéger l'agriculture francais",
    "description": "La production francaise est l'une des plus vertueuse au monde..."
  },
  {
    "title": "Titre 2",
    "description": "Lorem ipsum dolor sit amet consectetur adipisicing elit. Provident fuga consectetur dolorum ducimus praesentium aut cupiditate at? Totam sit cupiditate ea nam quia, dignissimos tempora commodi architecto voluptatem esse sed."
  },
  {
    "title": "Titre 3",
    "description": "Lorem ipsum dolor sit amet consectetur adipisicing elit. Provident fuga consectetur dolorum ducimus praesentium aut cupiditate at? Totam sit cupiditate ea nam quia, dignissimos tempora commodi architecto voluptatem esse sed."
  },
  {
    "title": "Titre 4",
    "description": "Lorem ipsum dolor sit amet consectetur adipisicing elit. Provident fuga consectetur dolorum ducimus praesentium aut cupiditate at? Totam sit cupiditate ea nam quia, dignissimos tempora commodi architecto voluptatem esse sed."
  },
  {
    "title": "Titre 5",
    "description": "Lorem ipsum dolor sit amet consectetur adipisicing elit. Provident fuga consectetur dolorum ducimus praesentium aut cupiditate at? Totam sit cupiditate ea nam quia, dignissimos tempora commodi architecto voluptatem esse sed."
  }
]
