{
    "name": "com.deaven.combatsystem.Tests",
    "rootNamespace": "",
    "references": [
        "GUID:67abe43cae7c14c6ebbed22bbdb6ed84",
        "GUID:27619889b8ba8c24980f49ee34dbb44a"
    ],
    "includePlatforms": [],
    "excludePlatforms": [],
    "allowUnsafeCode": false,
    "overrideReferences": false,
    "precompiledReferences": [],
    "autoReferenced": true,
    "defineConstraints": [],
    "versionDefines": [],
    "noEngineReferences": false
}